BLIND_ID,VISITID,WEIGHT_K,WEIGHT,SEX,AGE_K,AGE,RACE,RACE_W,RACE_B,other_race,ETHNICITY,VERSION
53001,20,No,,Male,No,,No,,,,Not Hispanic or Latino/Latina,A
53002,20,Yes,3.09,Male,Yes,36.80,No,,,,Unknown,A
53003,20,Yes,2.82,Male,Yes,37.00,Yes,Yes,No,No,Hispanic or Latino/Latina,A
53004,20,No,,Male,Yes,39.00,Yes,Yes,No,No,Not Hispanic or Latino/Latina,A
53005,20,Yes,2.50,Female,Yes,39.00,No,,,,Hispanic or Latino/Latina,A
53006,20,Yes,1.30,Male,Yes,29.29,Yes,Yes,No,No,Not Hispanic or Latino/Latina,A
53007,20,Yes,3.50,Female,Yes,38.70,Yes,Yes,No,No,Not Hispanic or Latino/Latina,A
53008,20,Yes,3.40,Male,Yes,39.00,Yes,Yes,No,No,Not Hispanic or Latino/Latina,A
53009,20,Yes,3.38,Male,Yes,38.50,Yes,Yes,No,No,Not Hispanic or Latino/Latina,A
53010,20,Yes,3.48,Male,Yes,39.00,Yes,Yes,No,No,Not Hispanic or Latino/Latina,A
53011,20,Yes,1.12,Female,Yes,28.57,Yes,No,Yes,No,Hispanic or Latino/Latina,A
53012,20,Yes,0.99,Male,Yes,27.00,No,,,,Hispanic or Latino/Latina,A
53013,20,Yes,3.28,Male,Yes,39.00,Yes,Yes,No,No,Not Hispanic or Latino/Latina,A
53014,20,Yes,3.59,Female,Yes,39.00,Yes,Yes,No,No,Not Hispanic or Latino/Latina,A
53015,20,Yes,3.14,Female,Yes,39.00,Yes,Yes,No,No,Not Hispanic or Latino/Latina,A
53016,20,Yes,2.02,Male,Yes,34.00,Yes,Yes,No,No,Hispanic or Latino/Latina,A
53017,20,Yes,3.30,Male,Yes,38.00,No,,,,Unknown,A
53018,20,Yes,2.31,Male,Yes,39.00,Yes,Yes,No,No,Not Hispanic or Latino/Latina,A
53019,20,Yes,3.63,Male,Yes,39.00,Yes,Yes,No,No,Not Hispanic or Latino/Latina,A
53020,20,Yes,3.53,Female,Yes,38.00,No,,,,Unknown,A
53021,20,Yes,1.58,Female,Yes,32.00,No,,,,Hispanic or Latino/Latina,A
53022,20,No,,Female,No,,Yes,Yes,No,No,Not Hispanic or Latino/Latina,A
53023,20,Yes,3.35,Female,Yes,38.00,Yes,Yes,No,No,Not Hispanic or Latino/Latina,A
53024,20,Yes,3.25,Male,No,,Yes,Yes,No,No,Not Hispanic or Latino/Latina,A
53025,20,Yes,2.68,Male,Yes,34.00,Yes,No,Yes,No,Not Hispanic or Latino/Latina,A
53026,20,Yes,2.53,Female,Yes,39.00,Yes,Yes,No,No,Not Hispanic or Latino/Latina,A
53027,20,Yes,2.38,Female,Yes,40.00,Yes,Yes,No,No,Not Hispanic or Latino/Latina,A
53028,20,Yes,3.06,Male,Yes,40.00,Yes,Yes,No,No,Not Hispanic or Latino/Latina,A
53029,20,Yes,3.30,Male,Yes,40.00,Yes,Yes,No,No,Hispanic or Latino/Latina,A
53030,20,Yes,0.63,Female,Yes,27.00,Yes,Yes,No,No,Not Hispanic or Latino/Latina,A
53031,20,No,,Male,Yes,28.00,Yes,Yes,No,No,Not Hispanic or Latino/Latina,A
53032,20,Yes,2.61,Male,Yes,39.00,No,,,,Unknown,A
53033,20,No,,Female,Yes,41.00,No,,,,Unknown,A
53034,20,Yes,3.27,Male,Yes,38.00,Yes,Yes,No,No,Not Hispanic or Latino/Latina,A
53035,20,Yes,3.54,Male,Yes,38.00,Yes,Yes,No,No,Not Hispanic or Latino/Latina,A
53036,20,Yes,2.86,Male,Yes,38.00,Yes,Yes,No,No,Not Hispanic or Latino/Latina,A
53037,20,No,,Female,Yes,34.00,No,,,,Unknown,A
53038,20,Yes,3.43,Male,Yes,39.00,No,,,,Unknown,A
53039,20,Yes,2.69,Male,Yes,39.00,Yes,Yes,No,No,Not Hispanic or Latino/Latina,A
53040,20,No,,Male,Yes,32.00,Yes,No,Yes,No,Hispanic or Latino/Latina,A
53041,20,Yes,2.19,Female,Yes,34.14,Yes,No,Yes,No,Not Hispanic or Latino/Latina,A
53042,20,Yes,3.00,Male,Yes,38.30,Yes,Yes,No,No,Not Hispanic or Latino/Latina,A
53043,20,Yes,3.18,Female,Yes,39.40,Yes,Yes,No,No,Not Hispanic or Latino/Latina,A
53044,20,Yes,3.46,Female,Yes,36.00,No,,,,Unknown,A
53045,20,Yes,3.06,Male,Yes,39.86,Yes,No,Yes,No,Not Hispanic or Latino/Latina,A
53046,20,Yes,3.00,Male,Yes,39.20,Yes,Yes,No,No,Hispanic or Latino/Latina,A
53047,20,No,,Female,Yes,40.00,Yes,Yes,No,No,Not Hispanic or Latino/Latina,A
53048,20,Yes,3.20,Male,Yes,37.00,No,,,,Not Hispanic or Latino/Latina,A
53049,20,Yes,3.54,Female,Yes,38.43,Yes,No,Yes,No,Not Hispanic or Latino/Latina,A
53050,20,Yes,3.74,Male,Yes,40.00,Yes,Yes,No,No,Not Hispanic or Latino/Latina,A
53051,20,Yes,2.20,Male,Yes,35.60,No,,,,Unknown,A
53052,20,Yes,3.56,Male,Yes,40.10,Yes,Yes,No,No,Not Hispanic or Latino/Latina,A
53053,20,Yes,3.06,Female,Yes,40.00,Yes,Yes,No,No,Not Hispanic or Latino/Latina,A
53054,20,Yes,3.43,Male,Yes,40.00,No,,,,Not Hispanic or Latino/Latina,A
53055,20,No,,Male,Yes,35.00,Yes,Yes,No,No,Not Hispanic or Latino/Latina,A
53056,20,No,,Male,Yes,36.85,No,,,,Unknown,A
53057,20,Yes,4.20,Male,Yes,40.43,Yes,Yes,No,No,Not Hispanic or Latino/Latina,A
53058,20,Yes,4.23,Male,Yes,38.00,Yes,Yes,No,No,Not Hispanic or Latino/Latina,A
53059,20,No,,Male,No,,No,,,,Unknown,A
53060,20,Yes,2.07,Female,Yes,35.00,Yes,Yes,No,No,Not Hispanic or Latino/Latina,A
53061,20,Yes,3.94,Male,Yes,40.43,Yes,Yes,No,No,Not Hispanic or Latino/Latina,A
53062,20,Yes,2.70,Male,Yes,36.00,Yes,Yes,No,No,Not Hispanic or Latino/Latina,A
53063,20,Yes,3.18,Female,Yes,39.00,Yes,No,Yes,No,Not Hispanic or Latino/Latina,A
53064,20,Yes,2.30,Male,Yes,37.00,Yes,Yes,No,No,Not Hispanic or Latino/Latina,A
53065,20,Yes,3.69,Female,Yes,40.00,No,,,,Unknown,A
53066,20,Yes,3.03,Male,Yes,37.00,Yes,Yes,No,No,Not Hispanic or Latino/Latina,A
53067,20,Yes,2.63,Male,Yes,37.00,No,,,,Unknown,A
53068,20,Yes,3.34,Male,No,,No,,,,Not Hispanic or Latino/Latina,A
53069,20,Yes,2.36,Female,Yes,32.00,Yes,Yes,No,No,Not Hispanic or Latino/Latina,A
53070,20,Yes,2.64,Male,Yes,39.00,No,,,,Unknown,A
53071,20,Yes,3.32,Female,No,,Yes,Yes,No,No,Not Hispanic or Latino/Latina,A
53072,20,Yes,2.05,Male,Yes,32.00,Yes,Yes,No,No,Not Hispanic or Latino/Latina,A
53073,20,Yes,2.53,Male,Yes,37.00,Yes,Yes,No,No,Not Hispanic or Latino/Latina,A
53074,20,Yes,2.95,Female,Yes,39.00,Yes,Yes,No,No,Not Hispanic or Latino/Latina,A
53075,20,Yes,2.68,Male,Yes,39.86,Yes,Yes,No,No,Not Hispanic or Latino/Latina,A
53076,20,Yes,3.49,Male,Yes,37.00,Yes,Yes,No,No,Not Hispanic or Latino/Latina,A
53077,20,Yes,2.27,Female,Yes,39.00,Yes,Yes,No,No,Not Hispanic or Latino/Latina,A
53078,20,Yes,3.22,Male,No,,Yes,Yes,No,No,Hispanic or Latino/Latina,A
53079,20,Yes,2.78,Female,Yes,38.00,Yes,Yes,No,No,Not Hispanic or Latino/Latina,A
53080,20,No,,Male,Yes,35.70,No,,,,Unknown,A
53081,20,Yes,4.51,Male,Yes,40.00,Yes,Yes,No,No,Not Hispanic or Latino/Latina,A
53082,20,Yes,3.55,Male,Yes,38.00,Yes,Yes,No,No,Not Hispanic or Latino/Latina,A
53083,20,Yes,2.75,Male,Yes,38.00,Yes,Yes,No,No,Not Hispanic or Latino/Latina,A
53084,20,No,,Female,Yes,39.14,No,,,,Unknown,A
53085,20,Yes,0.71,Female,Yes,28.00,Yes,Yes,No,No,Not Hispanic or Latino/Latina,A
53086,20,Yes,2.69,Female,Yes,37.57,Yes,Yes,No,No,Not Hispanic or Latino/Latina,A
53087,20,Yes,3.71,Female,Yes,35.00,Yes,Yes,No,No,Not Hispanic or Latino/Latina,A
53088,20,Yes,3.76,Female,Yes,41.00,Yes,Yes,No,No,Not Hispanic or Latino/Latina,A
53089,20,Yes,3.16,Male,Yes,40.57,Yes,Yes,No,No,Not Hispanic or Latino/Latina,A
53090,20,Yes,2.30,Female,Yes,36.00,No,,,,Unknown,A
53091,20,Yes,3.10,Male,Yes,40.00,Yes,Yes,No,No,Not Hispanic or Latino/Latina,A
53092,20,Yes,3.26,Female,Yes,39.00,Yes,Yes,No,No,Not Hispanic or Latino/Latina,A
53093,20,Yes,3.50,Male,Yes,39.00,Yes,Yes,No,No,Not Hispanic or Latino/Latina,A
53094,20,Yes,3.52,Female,Yes,39.00,Yes,Yes,No,No,Not Hispanic or Latino/Latina,A
53095,20,Yes,3.07,Female,Yes,37.43,Yes,Yes,Yes,No,Not Hispanic or Latino/Latina,A
53096,20,Yes,3.93,Female,Yes,39.00,Yes,Yes,No,No,Not Hispanic or Latino/Latina,A
53097,20,Yes,3.58,Female,No,,Yes,Yes,No,No,Not Hispanic or Latino/Latina,A
53098,20,Yes,4.09,Female,Yes,40.00,Yes,Yes,No,No,Not Hispanic or Latino/Latina,A
53099,20,Yes,4.48,Female,Yes,41.00,Yes,Yes,No,No,Not Hispanic or Latino/Latina,A
53100,20,Yes,3.74,Female,Yes,40.00,Yes,Yes,No,No,Not Hispanic or Latino/Latina,A
53101,20,Yes,3.67,Male,Yes,39.00,Yes,No,No,Yes,Hispanic or Latino/Latina,A
53102,20,Yes,2.58,Male,No,,Yes,No,No,Yes,Hispanic or Latino/Latina,A
53103,20,Yes,2.44,Male,Yes,34.00,Yes,Yes,No,No,Unknown,A
53104,20,Yes,3.32,Female,Yes,40.00,Yes,Yes,No,No,Not Hispanic or Latino/Latina,A
53105,20,Yes,2.87,Male,Yes,38.86,Yes,Yes,No,No,Not Hispanic or Latino/Latina,A
53106,20,Yes,3.43,Male,Yes,39.00,Yes,No,No,Yes,Hispanic or Latino/Latina,A
53107,20,Yes,3.55,Male,Yes,39.00,Yes,Yes,No,No,Not Hispanic or Latino/Latina,A
53108,20,Yes,3.26,Female,Yes,39.43,Yes,Yes,No,No,Not Hispanic or Latino/Latina,A
53109,20,Yes,2.11,Female,Yes,38.00,No,,,,Unknown,A
53110,20,No,,Male,No,,No,,,,Unknown,A
53111,20,Yes,1.50,Male,Yes,31.00,Yes,No,Yes,No,Not Hispanic or Latino/Latina,A
53112,20,Yes,1.42,Male,Yes,33.00,Yes,Yes,No,No,Not Hispanic or Latino/Latina,A
53113,20,Yes,2.32,Male,Yes,37.00,Yes,Yes,No,No,Unknown,A
53114,20,Yes,1.95,Male,Yes,34.00,Yes,Yes,No,No,Not Hispanic or Latino/Latina,A
53115,20,Yes,3.86,Male,Yes,40.00,Yes,Yes,No,No,Not Hispanic or Latino/Latina,A
53116,20,No,,Male,No,,Yes,Yes,No,No,Not Hispanic or Latino/Latina,A
53117,20,No,,Female,No,,No,,,,Unknown,A
53118,20,Yes,2.72,Female,Yes,40.00,Yes,Yes,No,No,Not Hispanic or Latino/Latina,A
53119,20,Yes,1.11,Male,Yes,28.71,Yes,Yes,No,No,Not Hispanic or Latino/Latina,A
53120,20,Yes,3.32,Male,Yes,39.86,Yes,Yes,No,No,Not Hispanic or Latino/Latina,A
53121,20,No,,Female,No,,No,,,,Unknown,A
53122,20,Yes,1.45,Female,Yes,27.00,Yes,Yes,No,No,Unknown,A
53123,20,No,,Female,Yes,40.00,Yes,Yes,No,No,Not Hispanic or Latino/Latina,A
53124,20,Yes,3.37,Male,Yes,37.00,No,,,,Unknown,A
53125,20,Yes,4.08,Female,Yes,40.00,Yes,Yes,No,No,Not Hispanic or Latino/Latina,A
53126,20,Yes,4.70,Male,Yes,40.00,Yes,Yes,No,No,Not Hispanic or Latino/Latina,A
53127,20,Yes,2.37,Female,Yes,39.00,No,,,,Unknown,A
53128,20,Yes,3.14,Female,Yes,38.00,No,,,,Unknown,A
53129,20,Yes,3.40,Female,Yes,39.60,No,,,,Unknown,A
53130,20,No,,Female,Yes,39.00,Yes,Yes,No,No,Hispanic or Latino/Latina,A
53131,20,Yes,3.18,Male,Yes,39.00,Yes,Yes,No,No,Not Hispanic or Latino/Latina,A
53132,20,No,,Male,Yes,40.00,Yes,Yes,No,No,Hispanic or Latino/Latina,A
53133,20,Yes,2.10,Female,Yes,39.00,Yes,Yes,No,No,Not Hispanic or Latino/Latina,A
53134,20,Yes,2.80,Male,Yes,37.29,Yes,Yes,No,No,Hispanic or Latino/Latina,A
53135,20,No,,Female,Yes,40.00,Yes,Yes,No,No,Not Hispanic or Latino/Latina,A
53136,20,Yes,3.35,Female,Yes,39.00,Yes,Yes,No,No,Not Hispanic or Latino/Latina,A
53137,20,No,,Female,Yes,41.50,Yes,Yes,No,No,Not Hispanic or Latino/Latina,A
53138,20,Yes,3.05,Male,Yes,39.00,Yes,Yes,No,No,Not Hispanic or Latino/Latina,A
53139,20,Yes,3.60,Female,Yes,40.00,No,,,,Unknown,A
53140,20,Yes,2.57,Male,Yes,38.00,Yes,Yes,No,No,Not Hispanic or Latino/Latina,A
53141,20,Yes,2.33,Female,Yes,39.00,Yes,Yes,No,No,Hispanic or Latino/Latina,A
53142,20,Yes,2.30,Female,Yes,36.20,Yes,Yes,No,No,Not Hispanic or Latino/Latina,A
53143,20,Yes,3.80,Male,Yes,37.00,Yes,No,No,Yes,Not Hispanic or Latino/Latina,A
53144,20,Yes,3.00,Male,Yes,40.00,Yes,Yes,No,No,Not Hispanic or Latino/Latina,A
53145,20,Yes,3.43,Male,Yes,39.00,No,,,,Unknown,A
53146,20,Yes,2.39,Male,Yes,37.00,Yes,Yes,No,No,Not Hispanic or Latino/Latina,A
53147,20,Yes,2.80,Male,Yes,38.43,Yes,Yes,No,No,Hispanic or Latino/Latina,A
53148,20,Yes,3.50,Male,Yes,39.00,No,,,,Unknown,A
53149,20,Yes,3.20,Male,Yes,38.00,Yes,Yes,No,No,Not Hispanic or Latino/Latina,A
53150,20,Yes,3.30,Male,Yes,39.00,Yes,No,Yes,No,Not Hispanic or Latino/Latina,A
53151,20,Yes,2.07,Female,Yes,38.00,Yes,No,No,Yes,Not Hispanic or Latino/Latina,A
53152,20,Yes,3.04,Female,Yes,39.00,Yes,Yes,No,No,Not Hispanic or Latino/Latina,A
53153,20,No,,Male,Yes,39.00,No,,,,Unknown,A
53154,20,Yes,3.25,Male,Yes,39.40,Yes,Yes,No,No,Not Hispanic or Latino/Latina,A
53155,20,Yes,2.40,Female,Yes,37.00,Yes,No,Yes,No,Not Hispanic or Latino/Latina,A
53156,20,Yes,1.19,Male,Yes,29.40,Yes,Yes,No,No,Not Hispanic or Latino/Latina,A
53157,20,Yes,2.80,Male,Yes,36.00,Yes,No,Yes,No,Not Hispanic or Latino/Latina,A
53158,20,Yes,3.40,Female,Yes,40.00,Yes,Yes,No,No,Not Hispanic or Latino/Latina,A
53159,20,Yes,3.69,Male,Yes,38.00,Yes,Yes,No,No,Not Hispanic or Latino/Latina,A
53160,20,Yes,2.38,Male,Yes,35.00,Yes,No,Yes,No,Not Hispanic or Latino/Latina,A
53161,20,Yes,3.69,Male,Yes,40.57,Yes,Yes,No,No,Hispanic or Latino/Latina,A
53162,20,Yes,2.30,Male,Yes,34.00,Yes,Yes,No,No,Not Hispanic or Latino/Latina,A
53163,20,Yes,2.90,Female,Yes,37.57,No,,,,Unknown,A
53164,20,Yes,3.00,Female,Yes,40.00,Yes,Yes,No,No,Not Hispanic or Latino/Latina,A
53165,20,Yes,3.70,Female,Yes,39.00,No,,,,Unknown,A
53166,20,Yes,3.44,Male,Yes,38.00,Yes,No,Yes,No,Not Hispanic or Latino/Latina,A
53167,20,Yes,3.02,Male,Yes,39.00,Yes,Yes,No,No,Not Hispanic or Latino/Latina,A
53168,20,Yes,3.35,Female,Yes,38.00,Yes,Yes,No,No,Not Hispanic or Latino/Latina,A
53169,20,No,,Female,No,,Yes,Yes,No,No,Hispanic or Latino/Latina,A
53170,20,Yes,2.01,Male,Yes,38.00,Yes,Yes,No,No,Not Hispanic or Latino/Latina,A
53171,20,Yes,3.50,Male,Yes,40.00,Yes,No,Yes,No,Not Hispanic or Latino/Latina,A
53172,20,Yes,3.06,Female,Yes,39.00,Yes,No,Yes,No,Not Hispanic or Latino/Latina,A
53173,20,Yes,1.95,Male,Yes,34.10,Yes,Yes,No,No,Not Hispanic or Latino/Latina,A
53174,20,Yes,3.31,Male,Yes,38.00,Yes,No,Yes,No,Not Hispanic or Latino/Latina,A
53175,20,Yes,3.18,Female,Yes,39.00,Yes,Yes,No,No,Not Hispanic or Latino/Latina,A
53176,20,Yes,3.05,Female,Yes,40.00,Yes,Yes,No,No,Not Hispanic or Latino/Latina,A
53177,20,Yes,2.81,Female,No,,No,,,,Unknown,A
53178,20,Yes,3.57,Male,Yes,36.00,Yes,Yes,No,No,Not Hispanic or Latino/Latina,A
53179,20,Yes,2.95,Male,Yes,39.00,Yes,Yes,No,No,Not Hispanic or Latino/Latina,A
53180,20,Yes,3.48,Female,Yes,40.00,Yes,Yes,No,No,Not Hispanic or Latino/Latina,A
53181,20,Yes,3.29,Male,Yes,39.00,Yes,Yes,No,No,Not Hispanic or Latino/Latina,A
53182,20,Yes,2.92,Male,Yes,39.00,Yes,Yes,No,No,Unknown,A
53183,20,Yes,4.10,Male,Yes,41.00,Yes,No,Yes,No,Not Hispanic or Latino/Latina,A
53184,20,Yes,3.54,Male,Yes,39.00,Yes,Yes,No,No,Not Hispanic or Latino/Latina,A
53185,20,Yes,1.58,Male,Yes,31.40,No,,,,Unknown,A
53186,20,No,,Male,Yes,38.00,Yes,Yes,No,No,Not Hispanic or Latino/Latina,A
53187,20,Yes,2.72,Male,Yes,39.57,Yes,No,Yes,No,Hispanic or Latino/Latina,A
53188,20,Yes,2.36,Female,Yes,37.00,No,,,,Unknown,A
53189,20,Yes,2.70,Male,Yes,38.00,Yes,Yes,No,No,Not Hispanic or Latino/Latina,A
53190,20,Yes,1.88,Female,Yes,32.29,Yes,No,Yes,No,Not Hispanic or Latino/Latina,A
53191,20,Yes,3.35,Female,No,,Yes,No,Yes,Yes,Not Hispanic or Latino/Latina,A
53192,20,Yes,1.10,Male,Yes,30.00,No,,,,Not Hispanic or Latino/Latina,A
53193,20,Yes,1.59,Female,Yes,31.00,Yes,Yes,No,No,Not Hispanic or Latino/Latina,A
53194,20,No,,Female,No,,Yes,No,Yes,No,Hispanic or Latino/Latina,A
53195,20,Yes,3.70,Male,Yes,38.29,Yes,Yes,No,No,Not Hispanic or Latino/Latina,A
53196,20,Yes,3.46,Male,Yes,39.00,Yes,Yes,No,No,Not Hispanic or Latino/Latina,A
53197,20,Yes,1.69,Female,Yes,36.00,Yes,Yes,No,No,Hispanic or Latino/Latina,A
53198,20,Yes,3.70,Female,Yes,39.00,Yes,Yes,No,No,Not Hispanic or Latino/Latina,A
53199,20,Yes,2.55,Male,Yes,38.00,Yes,Yes,No,No,Hispanic or Latino/Latina,A
53200,20,Yes,2.74,Male,Yes,37.00,Yes,No,Yes,No,Not Hispanic or Latino/Latina,A
53201,20,Yes,1.70,Male,Yes,36.29,Yes,No,Yes,No,Not Hispanic or Latino/Latina,A
53202,20,Yes,1.68,Female,Yes,33.87,Yes,Yes,No,No,Not Hispanic or Latino/Latina,A
53203,20,Yes,2.10,Female,Yes,35.00,No,,,,Unknown,A
53204,20,Yes,3.11,Female,Yes,38.00,Yes,Yes,No,No,Not Hispanic or Latino/Latina,A
53205,20,Yes,1.80,Female,Yes,36.00,Yes,Yes,No,No,Not Hispanic or Latino/Latina,A
53206,20,Yes,2.31,Male,Yes,37.00,Yes,Yes,No,No,Not Hispanic or Latino/Latina,A
53207,20,Yes,3.31,Male,Yes,36.29,Yes,No,Yes,No,Not Hispanic or Latino/Latina,A
53208,20,Yes,3.08,Female,Yes,39.00,Yes,No,No,Yes,Not Hispanic or Latino/Latina,A
53209,20,Yes,3.00,Male,Yes,39.14,Yes,Yes,No,No,Unknown,A
53210,20,Yes,3.97,Male,Yes,37.30,Yes,Yes,No,No,Not Hispanic or Latino/Latina,A
53211,20,Yes,3.60,Male,Yes,37.00,Yes,Yes,No,No,Not Hispanic or Latino/Latina,A
53212,20,Yes,1.65,Male,Yes,29.00,No,,,,Unknown,A
53213,20,No,,Female,Yes,39.00,Yes,Yes,No,No,Not Hispanic or Latino/Latina,A
53214,20,Yes,3.33,Female,Yes,37.00,Yes,Yes,No,No,Not Hispanic or Latino/Latina,A
53215,20,Yes,2.30,Female,No,,Yes,Yes,No,No,Not Hispanic or Latino/Latina,A
53216,20,Yes,2.85,Female,Yes,39.00,No,,,,Not Hispanic or Latino/Latina,A
53217,20,Yes,2.24,Male,Yes,36.00,Yes,No,No,Yes,Not Hispanic or Latino/Latina,A
53218,20,Yes,3.32,Male,Yes,39.00,Yes,Yes,No,No,Not Hispanic or Latino/Latina,A
53219,20,Yes,1.98,Male,No,,No,,,,Not Hispanic or Latino/Latina,A
53220,20,Yes,3.60,Female,Yes,40.00,No,,,,Not Hispanic or Latino/Latina,A
53221,20,Yes,3.08,Female,Yes,38.00,Yes,Yes,No,No,Not Hispanic or Latino/Latina,A
53222,20,No,,Female,No,,Yes,Yes,No,No,Not Hispanic or Latino/Latina,A
53223,20,Yes,3.31,Male,Yes,39.00,Yes,Yes,No,No,Not Hispanic or Latino/Latina,A
53224,20,Yes,3.49,Female,Yes,39.00,Yes,Yes,No,No,Not Hispanic or Latino/Latina,A
53225,20,Yes,4.25,Female,Yes,40.00,Yes,Yes,No,No,Not Hispanic or Latino/Latina,A
53226,20,Yes,1.30,Female,Yes,37.14,No,,,,Not Hispanic or Latino/Latina,A
53227,20,Yes,2.33,Male,Yes,35.00,Yes,Yes,No,No,Hispanic or Latino/Latina,A
53228,20,Yes,2.70,Female,Yes,37.00,Yes,Yes,No,No,Not Hispanic or Latino/Latina,A
53229,20,Yes,2.83,Female,Yes,37.00,Yes,Yes,No,No,Not Hispanic or Latino/Latina,A
53230,20,Yes,3.74,Female,Yes,40.00,Yes,Yes,No,No,Not Hispanic or Latino/Latina,A
53231,20,Yes,2.67,Male,Yes,38.00,Yes,Yes,No,No,Not Hispanic or Latino/Latina,A
53232,20,Yes,2.89,Male,Yes,39.00,Yes,No,Yes,No,Not Hispanic or Latino/Latina,A
53233,20,Yes,1.07,Male,Yes,27.90,No,,,,Unknown,A
53234,20,Yes,3.26,Female,Yes,39.00,Yes,Yes,No,No,Hispanic or Latino/Latina,A
53235,20,Yes,2.91,Female,Yes,36.00,No,,,,Not Hispanic or Latino/Latina,A
53236,20,Yes,3.60,Male,No,,Yes,Yes,No,No,Not Hispanic or Latino/Latina,A
53237,20,Yes,3.49,Male,Yes,39.00,Yes,Yes,No,No,Not Hispanic or Latino/Latina,A
53238,20,Yes,2.67,Male,Yes,36.00,No,,,,Not Hispanic or Latino/Latina,A
53239,20,No,,Male,No,,Yes,No,Yes,No,Unknown,A
53240,20,Yes,3.01,Male,No,,Yes,Yes,No,No,Not Hispanic or Latino/Latina,A
53241,20,Yes,3.10,Female,No,,Yes,Yes,No,No,Not Hispanic or Latino/Latina,A
53242,20,Yes,1.86,Male,Yes,36.00,No,,,,Unknown,A
53243,20,Yes,2.86,Male,Yes,38.00,Yes,Yes,No,No,Not Hispanic or Latino/Latina,A
53244,20,Yes,3.88,Female,Yes,40.00,Yes,Yes,No,No,Not Hispanic or Latino/Latina,A
53245,20,Yes,2.40,Female,Yes,37.00,Yes,Yes,No,No,Unknown,A
53246,20,Yes,3.58,Male,Yes,41.00,No,,,,Unknown,A
53247,20,Yes,3.84,Male,Yes,39.00,Yes,Yes,No,No,Not Hispanic or Latino/Latina,A
53248,20,Yes,1.51,Male,Yes,30.00,No,,,,Not Hispanic or Latino/Latina,A
53249,20,Yes,0.85,Female,Yes,28.00,Yes,No,Yes,No,Not Hispanic or Latino/Latina,A
53250,20,Yes,3.00,Male,Yes,37.00,Yes,Yes,No,No,Not Hispanic or Latino/Latina,A
53251,20,Yes,3.27,Male,Yes,36.00,Yes,Yes,No,No,Not Hispanic or Latino/Latina,A
53252,20,Yes,3.30,Male,Yes,39.00,Yes,Yes,No,No,Not Hispanic or Latino/Latina,A
53253,20,Yes,3.20,Female,No,,No,,,,Unknown,A
53254,20,Yes,3.95,Female,Yes,40.00,Yes,Yes,No,No,Not Hispanic or Latino/Latina,A
53255,20,Yes,2.55,Female,Yes,36.00,Yes,Yes,No,No,Unknown,A
53256,20,Yes,2.60,Male,Yes,39.00,Yes,Yes,No,No,Not Hispanic or Latino/Latina,A
53257,20,Yes,2.93,Male,Yes,40.00,Yes,Yes,No,No,Not Hispanic or Latino/Latina,A
53258,20,Yes,3.50,Male,Yes,39.00,Yes,No,No,Yes,Not Hispanic or Latino/Latina,A
53259,20,Yes,3.20,Female,Yes,38.00,No,,,,Unknown,A
53260,20,No,,Male,Yes,37.00,No,,,,Unknown,A
53261,20,Yes,3.43,Female,Yes,38.40,Yes,Yes,No,No,Hispanic or Latino/Latina,A
53262,20,Yes,3.00,Male,Yes,39.00,Yes,Yes,No,No,Hispanic or Latino/Latina,A
53263,20,Yes,2.87,Female,Yes,37.00,No,,,,Not Hispanic or Latino/Latina,A
53264,20,Yes,3.06,Female,Yes,37.00,Yes,No,Yes,No,Not Hispanic or Latino/Latina,A
53265,20,Yes,3.37,Female,Yes,40.00,Yes,Yes,No,No,Unknown,A
53266,20,Yes,3.03,Male,No,,Yes,Yes,No,No,Hispanic or Latino/Latina,A
53267,20,Yes,3.91,Male,Yes,40.00,Yes,Yes,No,No,Not Hispanic or Latino/Latina,A
53268,20,Yes,3.40,Male,Yes,38.00,Yes,Yes,No,No,Not Hispanic or Latino/Latina,A
53269,20,Yes,2.60,Female,Yes,36.00,Yes,Yes,No,No,Not Hispanic or Latino/Latina,A
53270,20,Yes,3.60,Male,Yes,40.00,Yes,Yes,No,No,Not Hispanic or Latino/Latina,A
53271,20,Yes,4.30,Male,Yes,39.00,No,,,,Unknown,A
53272,20,No,,Female,No,,Yes,Yes,No,No,Not Hispanic or Latino/Latina,A
53273,20,Yes,2.15,Female,Yes,33.00,Yes,Yes,No,No,Not Hispanic or Latino/Latina,A
53274,20,Yes,2.30,Male,Yes,36.00,Yes,Yes,No,No,Not Hispanic or Latino/Latina,A
53275,20,Yes,3.39,Female,Yes,39.00,Yes,Yes,No,No,Not Hispanic or Latino/Latina,A
53276,20,Yes,3.01,Female,Yes,39.50,Yes,Yes,No,No,Not Hispanic or Latino/Latina,A
53277,20,Yes,2.65,Female,Yes,36.71,Yes,Yes,No,No,Hispanic or Latino/Latina,A
53278,20,No,,Female,Yes,39.00,Yes,No,No,Yes,Not Hispanic or Latino/Latina,A
53279,20,Yes,3.56,Female,Yes,38.00,Yes,Yes,No,No,Not Hispanic or Latino/Latina,A
53280,20,Yes,3.03,Male,Yes,41.00,Yes,Yes,No,No,Not Hispanic or Latino/Latina,A
53281,20,Yes,2.84,Female,Yes,39.00,Yes,Yes,No,No,Not Hispanic or Latino/Latina,A
53282,20,Yes,2.95,Female,Yes,40.00,No,,,,Unknown,A
53283,20,Yes,1.80,Female,Yes,34.00,Yes,No,Yes,No,Not Hispanic or Latino/Latina,A
53284,20,No,,Female,Yes,40.00,Yes,Yes,No,No,Not Hispanic or Latino/Latina,A
53285,20,Yes,3.07,Female,Yes,39.00,Yes,Yes,No,No,Hispanic or Latino/Latina,A
53286,20,No,,Female,Yes,39.00,No,,,,Unknown,A
53287,20,Yes,2.84,Male,Yes,40.00,Yes,No,No,Yes,Hispanic or Latino/Latina,A
53288,20,Yes,3.46,Male,Yes,39.10,No,,,,Unknown,A
53289,20,Yes,3.85,Male,Yes,39.00,Yes,Yes,No,No,Not Hispanic or Latino/Latina,A
53290,20,Yes,3.06,Male,Yes,36.00,No,,,,Unknown,A
53291,20,Yes,2.95,Male,Yes,39.00,Yes,No,Yes,No,Not Hispanic or Latino/Latina,A
53292,20,Yes,0.81,Male,Yes,25.00,Yes,Yes,No,No,Not Hispanic or Latino/Latina,A
53293,20,Yes,2.30,Male,Yes,35.00,Yes,Yes,No,No,Not Hispanic or Latino/Latina,A
53294,20,Yes,2.92,Male,Yes,35.60,No,,,,Unknown,A
53295,20,Yes,3.52,Female,Yes,38.30,Yes,Yes,No,No,Not Hispanic or Latino/Latina,A
53296,20,Yes,2.30,Female,Yes,34.00,Yes,Yes,No,No,Hispanic or Latino/Latina,A
53297,20,Yes,2.10,Female,Yes,35.00,Yes,Yes,No,No,Not Hispanic or Latino/Latina,A
53298,20,Yes,3.10,Female,Yes,39.00,Yes,Yes,No,No,Hispanic or Latino/Latina,A
53299,20,Yes,3.70,Male,Yes,39.57,Yes,Yes,No,No,Not Hispanic or Latino/Latina,A
53300,20,Yes,3.69,Male,Yes,37.00,Yes,Yes,No,No,Not Hispanic or Latino/Latina,A
53301,20,Yes,3.59,Female,Yes,39.00,No,,,,Unknown,A
53302,20,Yes,2.50,Female,Yes,38.71,Yes,Yes,No,No,Not Hispanic or Latino/Latina,A
53303,20,Yes,2.75,Female,Yes,38.00,Yes,Yes,No,No,Not Hispanic or Latino/Latina,A
53304,20,Yes,2.75,Male,Yes,39.00,Yes,No,Yes,No,Not Hispanic or Latino/Latina,A
53305,20,Yes,1.80,Male,Yes,37.00,Yes,Yes,No,No,Not Hispanic or Latino/Latina,A
53306,20,Yes,3.01,Male,Yes,39.00,Yes,Yes,No,No,Not Hispanic or Latino/Latina,A
53307,20,Yes,2.89,Female,Yes,38.00,Yes,Yes,No,No,Unknown,A
53308,20,Yes,2.21,Female,Yes,39.10,No,,,,Hispanic or Latino/Latina,A
53309,20,Yes,3.52,Male,Yes,39.86,Yes,Yes,No,No,Not Hispanic or Latino/Latina,A
53310,20,Yes,2.95,Male,Yes,39.00,Yes,Yes,No,No,Not Hispanic or Latino/Latina,A
53311,20,Yes,2.40,Female,No,,No,,,,Not Hispanic or Latino/Latina,A
53312,20,Yes,3.14,Male,Yes,37.50,Yes,Yes,No,No,Not Hispanic or Latino/Latina,A
53313,20,Yes,3.20,Male,Yes,37.00,Yes,Yes,No,No,Not Hispanic or Latino/Latina,A
53314,20,Yes,2.17,Female,Yes,36.00,Yes,No,No,Yes,Not Hispanic or Latino/Latina,A
53315,20,Yes,3.56,Female,Yes,40.00,Yes,Yes,No,No,Not Hispanic or Latino/Latina,A
53316,20,Yes,3.25,Female,Yes,38.14,Yes,Yes,No,No,Not Hispanic or Latino/Latina,A
53317,20,Yes,3.38,Male,Yes,40.00,Yes,Yes,No,No,Not Hispanic or Latino/Latina,A
53318,20,Yes,3.24,Male,Yes,38.00,No,,,,Unknown,A
53319,20,Yes,3.23,Male,Yes,39.00,Yes,Yes,No,No,Not Hispanic or Latino/Latina,A
53320,20,No,,Male,Yes,39.00,Yes,No,Yes,No,Not Hispanic or Latino/Latina,A
53321,20,Yes,3.40,Female,Yes,39.00,Yes,Yes,No,No,Not Hispanic or Latino/Latina,A
53322,20,Yes,2.44,Female,Yes,36.57,Yes,Yes,No,No,Not Hispanic or Latino/Latina,A
53323,20,No,,Male,Yes,36.86,No,,,,Unknown,A
53324,20,Yes,2.52,Female,Yes,35.00,Yes,No,Yes,No,Not Hispanic or Latino/Latina,A
53325,20,Yes,3.48,Female,Yes,36.90,No,,,,Unknown,A