BLIND_ID,VISITID,PROC_AGE,DIAG,PROCED_TOF,PROCED_COARC,PROCED_COARC_OTH,DIAG_TETRA_FUND,DIAG_COARC_FUND,PALL_MBTS,PALL_CENTRAL,ABNORM_HEAD_ASPH,ABNORM_HEAD_HYPO,ABNORM_HEAD_SEIZ,ABNORM_HEAD_POREN,ABNORM_HEAD_POLY,ABNORM_HEAD_MULTI,ABNORM_HEAD_PACH,ABNORM_HEAD_LISS,ABNORM_HEAD_HYDRA,ABNORM_HEAD_HOLO,ABNORM_HEAD_ANEN,ABNORM_HEAD_HYDRO,ABNORM_SPINE,ABNORM_LTB_LARYNX,ABNORM_LTB_TRACH,ABNORM_LTB_BRONCH,ABNORM_LTB_FIST,ABNORM_LTB_MAL,ABNORM_LUNG_LOBAR,ABNORM_LUNG_EXTRA,ABNORM_LUNG_HYPO,ABNORM_LUNG_INTRA,ABNORM_LUNG_CYST,ABNORM_LUNG_LYMPH,ABNORM_LUNG_DIAPH,ABNORM_LUNG_CAP,ABNORM_LUNG_IMMATURE,ABNORM_LUNG_HYPLASIA,ABNORM_LUNG_RDS,ABNORM_LUNG_HYP,ABNORM_LUNG_BRONCH,ABNORM_LUNG_EMPH,ABNORM_LUNG_PLEU,ABNORM_LUNG_MEC,ABNORM_LUNG_ALV,CHROM_22,CHROM_13,CHROM_18,CHROM_21,CHROM_PIERRE,CHROM_CRI,CHROM_OTH,CHROM_ABNORM_OTH
53001,20,150,Tetralogy of Fallot Repair,"TOF repair, Ventriculotomy, Nontransanular patch",,,Pulmonary stenosis,,No,No,No,No,No,No,No,No,No,No,No,No,No,No,No,No,No,No,No,No,No,No,No,No,No,No,No,No,No,No,No,No,No,No,No,No,No,No,No,No,No,No,No,No,
53002,20,2,Coarctation of Aorta Repair,,"Coarctation repair, End to end, Extended",,,Isolated Coarctation,No,No,No,No,No,No,No,No,No,No,No,No,No,No,No,No,No,No,No,No,No,No,No,No,No,No,No,No,No,No,No,No,No,No,No,No,No,No,No,No,No,No,No,No,
53003,20,8,Coarctation of Aorta Repair,,"Coarctation repair, End to end, Extended",,,Coarctation + Other Lesion,No,No,No,No,No,No,No,No,No,No,No,No,No,No,No,No,No,No,No,No,No,No,No,No,No,No,No,No,No,No,No,No,No,No,No,No,No,No,No,No,No,No,No,No,
53004,20,51,Tetralogy of Fallot Repair,"TOF repair, Ventriculotomy, Transanular patch",,,Pulmonary stenosis,,No,No,No,No,No,No,No,No,No,No,No,No,No,No,No,No,No,No,No,No,No,No,No,No,No,No,No,No,No,No,No,No,No,No,No,No,No,No,No,No,No,No,No,No,
53005,20,364,Tetralogy of Fallot Repair,"TOF repair, Ventriculotomy, Transanular patch",,,Pulmonary stenosis,,No,No,No,No,No,No,No,No,No,No,No,No,No,No,No,No,No,No,No,No,No,No,No,No,No,No,No,No,No,No,No,No,No,No,No,No,No,No,No,No,No,No,No,No,
53006,20,148,Tetralogy of Fallot Repair,TOF - AVC (AVSD) repair,,,AVC (AVSD),,No,No,No,No,No,No,No,No,No,No,No,No,No,No,Yes,No,No,No,No,No,No,No,No,No,No,No,No,No,No,No,No,No,Yes,No,No,No,No,No,No,No,No,No,No,Yes,VACTERL
53007,20,71,Tetralogy of Fallot Repair,"TOF repair, Ventriculotomy, Nontransanular patch",,,Pulmonary stenosis,,No,No,No,No,No,No,No,No,No,No,No,No,No,No,No,No,No,No,No,No,No,No,No,No,No,No,No,No,No,No,No,No,No,No,No,No,No,No,No,No,No,No,No,No,
53008,20,239,Tetralogy of Fallot Repair,"TOF repair, No ventriculotomy",,,Pulmonary stenosis,,No,Yes,No,No,No,No,No,No,No,No,No,No,No,No,No,Yes,No,No,No,No,No,No,No,No,No,No,No,No,No,No,No,No,No,No,No,No,No,No,No,No,No,No,No,Yes,Heterotaxy
53009,20,13,Coarctation of Aorta Repair,,"Coarctation repair, Other",Aortic arch reconstruction with coarctation resection with posterior anastomosis and then patch arterioplasty of the anteroinferior portion on bypass.,,Coarctation + Other Lesion,No,No,No,No,No,No,No,No,No,No,No,No,No,No,No,No,No,No,No,No,No,No,No,No,No,No,No,No,No,No,No,No,No,No,No,No,No,No,No,No,No,No,No,No,
53010,20,84,Coarctation of Aorta Repair,,"Coarctation repair, End to end, Extended",,,Isolated Coarctation + VSD (not requiring intervention),No,No,No,No,No,No,No,No,No,No,No,No,No,No,No,No,No,No,No,No,No,No,No,No,No,No,No,No,No,No,No,No,No,No,No,No,No,No,No,No,No,No,No,No,
53011,20,211,Tetralogy of Fallot Repair,"TOF repair, Ventriculotomy, Transanular patch",,,Pulmonary stenosis,,No,No,No,No,No,No,No,No,No,No,No,No,No,No,No,No,No,No,No,No,No,No,No,No,No,No,No,No,No,No,No,No,No,No,No,No,No,No,No,No,No,No,No,No,
53012,20,32,Coarctation of Aorta Repair,,"Coarctation repair, End to end, Extended",,,Isolated Coarctation,No,No,No,No,No,No,No,No,No,No,No,No,No,No,No,No,No,No,No,No,No,No,No,No,No,No,No,No,No,No,Yes,No,No,No,No,No,No,No,No,No,No,No,No,No,
53013,20,14,Coarctation of Aorta Repair,,"Coarctation repair, End to end, Extended",,,Isolated Coarctation,No,No,No,No,No,No,No,No,No,No,No,No,No,No,No,No,No,No,No,No,No,No,No,No,No,No,No,No,No,No,No,No,No,No,No,No,No,No,No,No,No,No,No,No,
53014,20,4,Coarctation of Aorta Repair,,"Coarctation repair, End to end, Extended",,,Isolated Coarctation + VSD (not requiring intervention),No,No,No,No,No,No,No,No,No,No,No,No,No,No,No,No,No,No,No,No,No,No,No,No,No,No,No,No,No,No,No,No,No,No,No,No,No,No,No,No,No,No,No,No,
53015,20,8,Coarctation of Aorta Repair,,"Coarctation repair, End to end",,,Coarctation + Other Lesion,No,No,No,No,No,No,No,No,No,No,No,No,No,No,No,No,No,No,No,No,No,No,No,No,No,No,No,No,No,No,No,No,No,No,No,No,No,No,No,No,No,No,No,Yes,Mosaic Turner syndrome
53016,20,18,Coarctation of Aorta Repair,,"Coarctation repair, Other","aortic arch advancement ligation and division of aberrant RSCA, PFO closure",,Coarctation + Other Lesion,No,No,No,No,No,No,No,No,No,No,No,No,No,No,No,Yes,No,No,Yes,No,No,No,No,No,No,No,No,No,No,No,No,No,No,No,No,No,No,No,No,No,No,No,No,Yes,CHARGE
53017,20,68,Tetralogy of Fallot Repair,"TOF repair, Ventriculotomy, Nontransanular patch",,,Pulmonary stenosis,,No,No,No,No,No,No,No,No,No,No,No,No,No,No,No,No,No,No,No,No,No,No,No,No,No,No,No,No,No,No,No,No,No,No,No,No,No,No,No,No,No,No,No,No,
53018,20,241,Tetralogy of Fallot Repair,"TOF repair, Ventriculotomy, Transanular patch",,,Pulmonary stenosis,,No,No,No,No,No,No,No,No,No,No,No,No,No,No,No,No,No,No,No,No,No,No,No,No,No,No,No,No,No,No,No,No,No,No,No,No,No,No,No,No,No,No,No,Yes,VACTERL syndrome
53019,20,147,Tetralogy of Fallot Repair,"TOF repair, No ventriculotomy",,,Pulmonary stenosis,,No,No,No,No,No,No,No,No,No,No,No,No,No,No,No,No,No,No,No,No,No,No,No,No,No,No,No,No,No,No,No,No,No,No,No,No,No,No,No,No,No,No,No,No,
53020,20,1,Coarctation of Aorta Repair,,"Coarctation repair, Other","Arch reconstruction, VSD repair, ASD repair",,Coarctation + Other Lesion,No,No,No,No,No,No,No,No,No,No,No,No,No,No,No,No,No,No,No,No,No,No,No,No,No,No,No,No,No,No,No,No,No,No,No,No,No,No,No,No,No,No,No,No,
53021,20,29,Tetralogy of Fallot Repair,"TOF repair, Ventriculotomy, Transanular patch",,,Pulmonary stenosis,,No,No,No,No,No,No,No,No,No,No,No,No,No,No,No,No,No,No,No,No,No,No,No,No,No,No,No,No,No,No,No,No,No,No,No,No,No,No,No,No,No,No,No,No,
53022,20,166,Tetralogy of Fallot Repair,"TOF repair, Ventriculotomy, Transanular patch",,,Pulmonary stenosis,,No,No,No,No,No,No,No,No,No,No,No,No,No,No,No,No,No,No,No,No,No,No,No,No,No,No,No,No,No,No,No,No,No,No,No,No,No,No,No,No,No,No,No,No,
53023,20,100,Tetralogy of Fallot Repair,"TOF repair, Ventriculotomy, Transanular patch",,,Pulmonary stenosis,,No,No,No,No,No,No,No,No,No,No,No,No,No,No,No,No,No,No,No,No,No,No,No,No,No,No,No,No,No,No,No,No,No,No,No,No,No,No,No,No,No,No,No,No,
53024,20,13,Coarctation of Aorta Repair,,"Coarctation repair, End to end",,,Isolated Coarctation,No,No,No,No,No,No,No,No,No,No,No,No,No,No,No,No,No,No,No,No,No,No,No,No,No,No,No,No,No,No,No,No,No,No,No,No,No,No,No,No,No,No,No,No,
53025,20,39,Tetralogy of Fallot Repair,"TOF repair, Ventriculotomy, Nontransanular patch",,,Pulmonary stenosis,,No,No,No,No,No,No,No,No,No,No,No,No,No,No,No,No,No,No,No,No,No,No,No,No,No,No,No,No,No,No,No,No,No,No,No,No,No,No,No,No,Yes,No,No,No,
53026,20,12,Coarctation of Aorta Repair,,"Coarctation repair, End to end, Extended",,,Isolated Coarctation,No,No,No,No,No,No,No,No,No,No,No,No,No,No,No,No,No,No,No,No,No,No,No,No,No,No,No,No,No,No,No,No,No,No,No,No,No,No,No,No,No,No,No,No,
53027,20,112,Tetralogy of Fallot Repair,"TOF repair, Ventriculotomy, Transanular patch",,,Pulmonary stenosis,,No,No,No,No,No,No,No,No,No,No,No,No,No,No,No,No,No,No,No,No,No,No,No,No,No,No,No,No,No,No,No,No,No,No,No,No,No,No,No,No,No,No,No,No,
53028,20,151,Tetralogy of Fallot Repair,"TOF repair, Ventriculotomy, Transanular patch",,,Pulmonary stenosis,,No,No,No,No,No,No,No,No,No,No,No,No,No,No,No,No,No,No,No,No,No,No,No,No,No,No,No,No,No,No,No,No,No,No,No,No,No,No,No,No,No,No,No,No,
53029,20,114,Tetralogy of Fallot Repair,"TOF repair, Ventriculotomy, Transanular patch",,,Pulmonary stenosis,,No,No,No,No,No,No,No,No,No,No,No,No,No,No,No,No,No,No,No,No,No,No,No,No,No,No,No,No,No,No,No,No,No,No,No,No,No,No,No,No,No,No,No,No,
53030,20,197,Tetralogy of Fallot Repair,"TOF repair, Ventriculotomy, Transanular patch",,,Pulmonary stenosis,,Yes,No,No,No,No,No,No,No,No,No,No,No,No,No,No,No,No,No,No,No,No,No,No,No,No,No,No,No,Yes,No,No,No,No,No,No,No,No,No,No,No,No,No,No,No,
53031,20,105,Tetralogy of Fallot Repair,"TOF repair, Ventriculotomy, Transanular patch",,,Pulmonary stenosis,,No,No,No,No,No,No,No,No,No,No,No,No,No,No,No,No,No,No,No,No,No,No,No,No,No,No,No,No,No,No,No,No,No,No,No,No,No,No,No,No,No,No,No,No,
53032,20,93,Tetralogy of Fallot Repair,"TOF repair, Ventriculotomy, Nontransanular patch",,,Pulmonary stenosis,,No,No,No,No,No,No,No,No,No,No,No,No,No,No,No,No,No,No,No,No,No,No,No,No,No,No,No,No,No,No,No,No,No,No,No,No,No,No,No,No,No,No,No,No,
53033,20,283,Coarctation of Aorta Repair,,"Coarctation repair, End to end",,,Coarctation + Other Lesion,No,No,No,No,No,No,No,No,No,No,No,No,No,No,No,No,No,No,No,No,No,No,No,No,No,No,No,No,No,No,No,No,No,No,No,No,No,No,No,No,No,No,No,No,
53034,20,107,Coarctation of Aorta Repair,,"Coarctation repair, End to end, Extended",,,Isolated Coarctation + VSD (not requiring intervention),No,No,No,No,No,No,No,No,No,No,No,No,No,No,No,No,No,No,No,No,No,No,No,No,No,No,No,No,No,No,No,No,No,No,No,No,No,No,No,No,No,No,No,No,
53035,20,15,Coarctation of Aorta Repair,,"Coarctation repair, End to end, Extended",,,Isolated Coarctation + VSD (not requiring intervention),No,No,No,No,No,No,No,No,No,No,No,No,No,No,No,No,No,No,No,No,No,No,No,No,No,No,No,No,No,No,No,No,No,No,No,No,No,No,No,No,No,No,No,Yes,Noonans
53036,20,143,Tetralogy of Fallot Repair,"TOF repair, Ventriculotomy, Nontransanular patch",,,Pulmonary stenosis,,No,No,No,No,No,No,No,No,No,No,No,No,No,No,No,No,No,No,No,No,No,No,No,No,No,No,No,No,No,No,No,No,No,No,No,No,No,No,No,No,No,No,No,No,
53037,20,18,Coarctation of Aorta Repair,,"Coarctation repair, End to end",,,Coarctation + Other Lesion,No,No,No,No,No,No,No,No,No,No,No,No,No,Yes,No,No,Yes,No,No,No,No,No,No,No,No,No,No,No,No,No,No,No,No,No,No,No,No,No,No,No,No,No,No,No,
53038,20,219,Tetralogy of Fallot Repair,"TOF repair, No ventriculotomy",,,Pulmonary stenosis,,No,No,No,No,No,No,No,No,No,No,No,No,No,No,No,No,No,No,No,No,No,No,No,No,No,No,No,No,No,No,No,No,No,No,No,No,No,No,No,No,No,No,No,No,
53039,20,36,Tetralogy of Fallot Repair,"TOF repair, Ventriculotomy, Transanular patch",,,Pulmonary stenosis,,No,No,No,No,No,No,No,No,No,No,No,No,No,No,No,No,No,No,No,No,No,No,No,No,No,No,No,No,No,No,No,No,No,No,No,No,No,No,No,No,No,No,No,No,
53040,20,270,Tetralogy of Fallot Repair,"TOF repair, Ventriculotomy, Nontransanular patch",,,Pulmonary stenosis,,No,No,No,No,No,No,No,No,No,No,No,No,No,No,No,No,No,No,No,No,No,No,No,No,No,No,No,No,No,No,No,No,No,No,No,No,No,No,No,No,No,No,No,No,
53041,20,10,Coarctation of Aorta Repair,,"Coarctation repair, End to end, Extended",,,Coarctation + Other Lesion,No,No,No,No,No,No,No,No,No,No,No,No,No,No,No,No,No,No,No,No,No,No,No,No,No,No,No,No,No,No,No,No,No,No,No,No,No,No,No,No,No,No,No,No,
53042,20,13,Coarctation of Aorta Repair,,"Coarctation repair, End to end, Extended",,,Coarctation + Other Lesion,No,No,No,No,No,No,No,No,No,No,No,No,No,No,No,No,No,No,No,No,No,No,No,No,No,No,No,No,No,No,No,No,No,No,No,No,No,No,No,No,No,No,No,No,
53043,20,207,Tetralogy of Fallot Repair,"TOF repair, Ventriculotomy, Transanular patch",,,AVC (AVSD),,No,No,No,No,No,No,No,No,No,No,No,No,No,No,No,No,No,No,No,No,No,No,No,No,No,No,No,No,No,No,No,No,No,No,No,No,No,No,No,No,No,No,No,No,
53044,20,15,Coarctation of Aorta Repair,,"Coarctation repair, End to end",,,Coarctation + Other Lesion,No,No,No,No,No,No,No,No,No,No,No,No,No,No,No,No,No,No,No,No,No,No,No,No,No,No,No,No,No,No,No,No,No,No,No,No,No,No,No,No,Yes,No,No,No,
53045,20,175,Tetralogy of Fallot Repair,"TOF repair, Ventriculotomy, Nontransanular patch",,,Pulmonary stenosis,,No,No,No,No,No,No,No,No,No,No,No,No,No,No,Yes,Yes,No,No,Yes,No,No,No,No,No,No,No,No,No,No,No,No,No,No,No,No,No,No,No,No,No,No,No,No,Yes,VACTERL ASSOCIATION
53046,20,46,Tetralogy of Fallot Repair,"TOF repair, RV-PA conduit",,,Pulmonary stenosis,,No,No,No,No,No,No,No,No,No,No,No,No,No,No,No,No,No,No,No,No,No,No,No,No,No,No,Yes,No,No,No,No,No,No,No,No,No,No,No,No,No,No,No,No,Yes,mosaic trisomy 14
53047,20,18,Coarctation of Aorta Repair,,"Coarctation repair, End to end, Extended",,,Isolated Coarctation,No,No,No,No,No,No,No,No,No,No,No,No,No,No,No,No,No,No,No,No,No,No,No,No,No,No,No,No,No,No,No,No,No,No,No,No,No,No,No,No,No,No,No,No,
53048,20,46,Tetralogy of Fallot Repair,"TOF repair, Ventriculotomy, Nontransanular patch",,,Pulmonary stenosis,,No,No,No,No,No,No,No,No,No,No,No,No,No,No,No,No,No,No,No,No,No,No,No,No,No,No,No,No,No,No,No,No,No,No,No,No,No,No,No,No,No,No,No,No,
53049,20,138,Tetralogy of Fallot Repair,"TOF repair, Ventriculotomy, Nontransanular patch",,,Pulmonary stenosis,,No,No,No,No,No,No,No,No,No,No,No,No,No,No,No,No,No,No,No,No,No,No,No,No,No,No,No,No,No,No,No,No,No,No,No,No,No,No,No,No,No,No,No,No,
53050,20,42,Coarctation of Aorta Repair,,"Coarctation repair, End to end, Extended",,,Isolated Coarctation,No,No,No,No,No,No,No,No,No,No,No,No,No,No,No,No,No,No,No,No,No,No,No,No,No,No,No,No,No,No,No,No,No,No,No,No,No,No,No,No,No,No,No,No,
53051,20,146,Tetralogy of Fallot Repair,"TOF repair, No ventriculotomy",,,Pulmonary stenosis,,No,No,No,No,No,No,No,No,No,No,No,No,No,No,No,No,No,No,No,No,No,No,No,No,No,No,No,No,No,No,No,No,No,No,No,No,No,No,No,No,Yes,No,No,No,
53052,20,14,Coarctation of Aorta Repair,,"Coarctation repair, End to end, Extended",,,Isolated Coarctation,No,No,No,No,No,No,No,No,No,No,No,No,No,No,No,No,No,No,No,No,No,No,No,No,No,No,No,No,No,No,No,No,No,No,No,No,No,No,No,No,No,No,No,No,
53053,20,62,Coarctation of Aorta Repair,,"Coarctation repair, End to end, Extended",,,Isolated Coarctation,No,No,No,No,No,No,No,No,No,No,No,No,No,No,No,No,No,No,No,No,No,No,No,No,No,No,No,No,No,No,No,No,No,No,No,No,No,No,No,No,No,No,No,No,
53054,20,8,Coarctation of Aorta Repair,,"Coarctation repair, End to end, Extended",,,Isolated Coarctation,No,No,No,No,No,No,No,No,No,No,No,No,No,No,No,No,No,No,No,No,No,No,No,No,No,No,No,No,No,No,No,No,No,No,No,No,No,No,No,No,No,No,No,No,
53055,20,132,Tetralogy of Fallot Repair,"TOF repair, Ventriculotomy, Transanular patch",,,Pulmonary stenosis,,No,No,No,No,No,No,No,No,No,No,No,No,No,No,No,No,No,No,No,No,No,No,No,No,No,No,No,No,No,No,No,No,No,No,No,No,No,No,No,No,No,No,No,No,
53056,20,197,Tetralogy of Fallot Repair,"TOF repair, Ventriculotomy, Transanular patch",,,Pulmonary stenosis,,No,No,No,No,No,No,No,No,No,No,No,No,No,No,No,No,No,No,No,No,No,No,No,No,No,No,No,No,No,No,No,No,No,No,No,No,No,No,No,No,No,No,No,No,
53057,20,227,Coarctation of Aorta Repair,,"Coarctation repair, End to end",,,Isolated Coarctation,No,No,No,No,No,No,No,No,No,No,No,No,No,No,No,No,No,No,No,No,No,No,No,No,No,No,No,No,No,No,No,No,No,No,No,No,No,No,No,No,No,No,No,No,
53058,20,3,Coarctation of Aorta Repair,,"Coarctation repair, Other","end to end, reverse subclavian flap and PDA division",,Coarctation + Other Lesion,No,No,No,No,No,No,No,No,No,No,No,No,No,No,No,No,No,No,No,No,No,No,No,No,No,No,No,No,No,No,No,No,No,No,No,No,No,No,No,No,No,No,No,No,
53059,20,158,Tetralogy of Fallot Repair,"TOF repair, Ventriculotomy, Transanular patch",,,Pulmonary stenosis,,No,No,No,No,No,No,No,No,No,No,No,No,No,No,No,No,No,No,No,No,No,No,No,No,No,No,No,No,No,No,No,No,No,No,No,No,No,No,No,No,No,No,No,No,
53060,20,187,Tetralogy of Fallot Repair,"TOF repair, Ventriculotomy, Transanular patch",,,Pulmonary stenosis,,No,No,No,No,No,No,No,No,No,No,No,No,No,No,No,No,No,No,No,No,No,No,No,No,No,No,No,No,No,No,No,No,No,No,No,No,No,No,No,No,No,No,No,No,
53061,20,35,Coarctation of Aorta Repair,,"Coarctation repair, End to end, Extended",,,Coarctation + Other Lesion,No,No,No,No,No,No,No,No,No,No,No,No,No,No,No,No,No,No,No,No,No,No,No,No,No,No,No,No,No,No,No,No,No,No,No,No,No,No,No,No,No,No,No,No,
53062,20,174,Tetralogy of Fallot Repair,"TOF repair, Ventriculotomy, Nontransanular patch",,,Pulmonary stenosis,,No,No,No,No,No,No,No,No,No,No,No,No,No,No,No,No,No,No,No,No,No,No,No,No,No,No,No,No,No,No,No,No,No,No,No,No,No,No,No,No,No,No,No,No,
53063,20,247,Tetralogy of Fallot Repair,"TOF repair, Ventriculotomy, Nontransanular patch",,,Pulmonary stenosis,,No,No,No,No,No,No,No,No,No,No,No,No,No,No,No,No,No,No,No,No,No,No,No,No,No,No,No,No,No,No,No,No,No,No,No,No,No,No,No,No,No,No,No,No,
53064,20,82,Tetralogy of Fallot Repair,"TOF repair, Ventriculotomy, Transanular patch",,,Pulmonary stenosis,,Yes,No,No,No,No,No,No,No,No,No,No,No,No,No,No,No,No,No,No,No,No,No,No,No,No,No,No,No,No,No,No,No,No,No,No,No,No,No,No,No,No,No,No,Yes,Charge Syndrome
53065,20,4,Coarctation of Aorta Repair,,"Coarctation repair, End to end",,,Isolated Coarctation + VSD (not requiring intervention),No,No,No,No,No,No,No,No,No,No,No,No,No,No,No,No,No,No,No,No,No,No,No,No,No,No,No,No,No,No,No,No,No,No,No,No,No,No,No,No,No,No,No,No,
53066,20,242,Tetralogy of Fallot Repair,"TOF repair, No ventriculotomy",,,Pulmonary stenosis,,No,No,No,No,No,No,No,No,No,No,No,No,No,No,No,No,No,No,No,No,No,No,No,No,No,No,No,No,No,No,No,No,No,No,No,No,No,No,No,No,No,No,No,No,
53067,20,63,Tetralogy of Fallot Repair,"TOF repair, Ventriculotomy, Transanular patch",,,Pulmonary stenosis,,No,No,No,No,No,No,No,No,No,No,No,No,No,No,No,No,No,No,No,No,No,No,No,No,No,No,No,No,No,No,No,No,No,No,No,No,No,No,No,No,No,No,No,No,
53068,20,222,Tetralogy of Fallot Repair,"TOF repair, Ventriculotomy, Nontransanular patch",,,Pulmonary stenosis,,No,No,No,No,No,No,No,No,No,No,No,No,No,No,No,No,No,No,No,No,No,No,No,No,No,No,No,No,No,No,No,No,No,No,No,No,No,No,No,No,No,No,No,No,
53069,20,18,Coarctation of Aorta Repair,,"Coarctation repair, Other","coarc end to end extended, reverse subclavian flap repair hypoplastic arch",,Coarctation + Other Lesion,No,No,No,No,No,No,No,No,No,No,No,No,No,No,No,No,No,No,No,No,No,No,No,No,No,No,No,No,No,No,No,No,No,No,No,No,No,No,No,No,No,No,No,Yes,"dysmorphic, downslanting eyes, short palpebral fissures"
53070,20,68,Tetralogy of Fallot Repair,TOF - AVC (AVSD) repair,,,AVC (AVSD),,No,No,No,No,No,No,No,No,No,No,No,No,No,No,No,No,No,No,No,No,No,No,No,No,No,No,No,No,No,No,No,No,No,No,No,No,No,No,No,No,No,No,No,No,
53071,20,84,Tetralogy of Fallot Repair,"TOF repair, No ventriculotomy",,,Pulmonary stenosis,,No,No,No,No,No,No,No,No,No,No,No,No,No,No,No,No,No,No,No,No,No,No,No,No,No,No,No,No,No,No,No,No,No,No,No,No,No,No,No,No,No,No,No,No,
53072,20,10,Coarctation of Aorta Repair,,"Coarctation repair, End to end, Extended",,,Isolated Coarctation,No,No,No,No,No,No,No,No,No,No,No,No,No,No,No,No,No,No,No,No,No,No,No,No,No,No,No,No,No,No,No,No,No,No,No,No,No,No,No,No,No,No,No,No,
53073,20,96,Tetralogy of Fallot Repair,"TOF repair, Ventriculotomy, Nontransanular patch",,,Pulmonary stenosis,,No,No,No,No,No,No,No,No,No,No,No,No,No,No,No,No,No,No,No,No,No,No,No,No,No,No,No,No,No,No,No,No,No,No,No,No,No,No,No,No,No,No,No,No,
53074,20,135,Tetralogy of Fallot Repair,"TOF repair, No ventriculotomy",,,Pulmonary stenosis,,No,No,No,No,No,No,No,No,No,No,No,No,No,No,No,No,No,No,No,No,No,No,No,No,No,No,No,No,No,No,No,No,No,No,No,No,No,No,No,No,No,No,No,No,
53075,20,278,Tetralogy of Fallot Repair,"TOF repair, Ventriculotomy, Transanular patch",,,Pulmonary stenosis,,No,No,No,No,No,No,No,No,No,No,No,No,No,No,No,No,No,No,No,No,No,No,No,No,No,No,No,No,No,No,No,No,No,No,No,No,No,No,No,No,No,No,No,No,
53076,20,161,Tetralogy of Fallot Repair,TOF - AVC (AVSD) repair,,,AVC (AVSD),,No,No,No,No,No,No,No,No,No,No,No,No,No,No,No,No,No,No,No,No,No,No,No,No,No,No,No,No,No,No,No,No,No,No,No,No,No,No,No,No,Yes,No,No,No,
53077,20,6,Coarctation of Aorta Repair,,"Coarctation repair, Other",end to end extended reverse subclavian flap arch augmentation PDA ligation and division PA band,,Coarctation + Other Lesion,No,No,No,No,No,No,No,No,No,No,No,No,No,No,No,No,No,No,No,No,No,No,No,No,No,No,No,No,No,No,No,No,No,No,No,No,No,No,No,No,Yes,No,No,No,
53078,20,174,Tetralogy of Fallot Repair,"TOF repair, Ventriculotomy, Transanular patch",,,Pulmonary stenosis,,No,No,No,No,No,No,No,No,No,No,No,No,No,No,No,No,No,No,No,No,No,No,No,No,No,No,No,No,No,No,No,No,No,No,No,No,No,No,No,No,No,No,No,No,
53079,20,188,Tetralogy of Fallot Repair,"TOF repair, Ventriculotomy, Nontransanular patch",,,Pulmonary stenosis,,No,No,No,No,No,No,No,No,No,No,No,No,No,No,No,No,No,No,No,No,No,No,No,No,No,No,No,No,No,No,No,No,No,No,No,No,No,No,No,No,No,No,No,No,
53080,20,243,Tetralogy of Fallot Repair,"TOF repair, RV-PA conduit",,,Pulmonary stenosis,,No,No,No,No,No,No,No,No,No,No,No,No,No,No,No,No,No,No,No,No,No,No,No,No,No,No,No,No,No,No,No,No,No,No,No,No,No,Yes,No,No,No,No,No,No,
53081,20,134,Tetralogy of Fallot Repair,"TOF repair, Ventriculotomy, Transanular patch",,,Pulmonary stenosis,,No,No,No,No,No,No,No,No,No,No,No,No,No,No,No,No,No,No,No,No,No,No,No,No,No,No,No,No,No,No,No,No,No,No,No,No,No,Yes,No,No,No,No,No,No,
53082,20,212,Tetralogy of Fallot Repair,"TOF repair, Ventriculotomy, Transanular patch",,,Pulmonary stenosis,,No,No,No,No,No,No,No,No,No,No,No,No,No,No,No,No,No,No,No,No,No,No,No,No,No,No,No,No,No,No,No,No,No,No,No,No,No,No,No,No,No,No,No,No,
53083,20,245,Coarctation of Aorta Repair,,"Coarctation repair, End to end",,,Isolated Coarctation,No,No,No,No,No,No,No,No,No,No,No,No,No,No,No,No,No,No,No,No,No,No,No,No,No,No,No,No,No,No,No,No,No,No,No,No,No,No,No,No,No,No,No,No,
53084,20,85,Tetralogy of Fallot Repair,"TOF repair, Ventriculotomy, Nontransanular patch",,,Pulmonary stenosis,,No,No,No,No,No,No,No,No,No,No,No,No,No,No,No,No,No,No,No,No,No,No,No,No,No,No,No,No,No,No,No,No,No,No,No,No,No,No,No,No,No,No,No,No,
53085,20,270,Coarctation of Aorta Repair,,"Coarctation repair, End to end, Extended",,,Isolated Coarctation,No,No,No,No,No,No,No,No,No,No,No,No,No,No,No,No,No,No,No,No,No,No,Yes,No,No,No,No,No,No,No,No,No,No,No,No,No,No,No,No,No,No,No,No,No,
53086,20,92,Tetralogy of Fallot Repair,"TOF repair, Ventriculotomy, Nontransanular patch",,,Pulmonary stenosis,,No,No,No,No,No,No,No,No,No,No,No,No,No,No,No,No,No,No,No,No,No,No,No,No,No,No,No,No,No,No,No,No,No,No,No,No,No,Yes,No,No,No,No,No,No,
53087,20,5,Coarctation of Aorta Repair,,"Coarctation repair, End to end, Extended",,,Isolated Coarctation + VSD (not requiring intervention),No,No,No,No,No,No,No,No,No,No,No,No,No,No,No,No,No,No,No,No,No,No,No,No,No,No,No,No,No,No,No,No,No,No,No,No,No,No,No,No,No,No,No,No,
53088,20,1,Coarctation of Aorta Repair,,"Coarctation repair, End to end, Extended",,,Coarctation + Other Lesion,No,No,No,No,No,No,No,No,No,No,No,No,No,No,No,No,No,No,No,No,No,No,No,No,No,No,No,No,No,No,No,No,No,No,No,No,No,No,No,No,No,No,No,No,
53089,20,146,Tetralogy of Fallot Repair,"TOF repair, Ventriculotomy, Transanular patch",,,Pulmonary stenosis,,No,No,No,No,No,No,No,No,No,No,No,No,No,No,No,No,No,No,No,No,No,No,No,No,No,No,No,No,No,No,No,No,No,No,No,No,No,No,No,No,No,No,No,No,
53090,20,159,Tetralogy of Fallot Repair,"TOF repair, No ventriculotomy",,,Pulmonary stenosis,,No,No,No,No,No,No,No,No,No,No,No,No,No,No,No,No,No,No,No,No,No,No,No,No,No,No,No,No,No,No,No,No,No,No,No,No,No,No,No,No,No,No,No,No,
53091,20,208,Tetralogy of Fallot Repair,"TOF repair, Ventriculotomy, Transanular patch",,,Pulmonary stenosis,,No,No,No,No,No,No,No,No,No,No,No,No,No,No,No,No,No,No,No,No,No,No,No,No,No,No,No,No,No,No,No,No,No,No,No,No,No,No,No,No,No,No,No,No,
53092,20,293,Tetralogy of Fallot Repair,"TOF repair, Ventriculotomy, Nontransanular patch",,,Pulmonary stenosis,,No,No,No,No,No,No,No,No,No,No,No,No,No,No,No,No,No,No,No,No,No,No,No,No,No,No,No,No,No,No,No,No,No,No,No,No,No,No,No,No,Yes,No,No,No,