BLIND_ID,VISITID,preop_hosp_day,INTUB_Y_N,intub_d_day,INTUB_T,REINTUB_OR_YN,REINTUB_OR_T,INTUB_OR_T,BYPASS,NO_XCLAMP_T,XCLAMP_T,CPB_T,icu_d_day,ICU_T,extub_d_day,EXTUB_T,RE_INTUB,reintub_d_day,REINTUB_T,reextub_d_day,REEXTUB_T,cicu_end_d_day,CICU_END_T,cicu_discharge_d_day,CICU_DISCHARGE_T,ICU_RETURN,icu_return_d_day,discharge_d_day,MORT_STAT,DISCHARGE_LOC
53001,40,0,No,,,,,12:27,Yes,0,50,99,0,17:05,1,12:18,No,,,,,2,12:16,2,12:16,No,,5,Alive,Home
53002,40,2,No,,,,,14:52,No,25,,,0,16:37,1,1:52,No,,,,,1,4:55,1,12:51,No,,5,Alive,Home
53007,40,13,No,,,,,6:42,Yes,0,124,168,0,13:20,1,10:35,No,,,,,4,7:02,4,7:02,No,,6,Alive,Home
53014,40,3,No,,,,,12:59,No,28,,,0,18:10,2,16:30,No,,,,,27,12:00,27,12:00,No,,32,Alive,Home
53017,40,0,No,,,,,14:50,Yes,0,87,113,0,20:29,1,12:46,No,,,,,2,10:45,2,12:18,No,,6,Alive,Home
53020,40,1,No,,,,,13:22,Yes,0,56,84,0,19:10,5,11:26,No,,,,,6,8:00,6,14:10,No,,14,Alive,Home
53022,40,0,No,,,,,9:12,Yes,0,38,66,0,13:36,0,18:00,No,,,,,2,11:18,2,11:18,No,,5,Alive,Home
53026,40,1,No,,,,,9:18,No,15,,,0,12:34,0,17:20,No,,,,,2,13:11,2,13:11,No,,9,Alive,Home
53029,40,1,No,,,,,6:45,Yes,0,126,188,0,13:00,6,17:12,No,,,,,10,13:45,10,13:45,No,,12,Alive,Home
53032,40,0,No,,,,,7:36,Yes,0,104,129,0,12:42,1,4:12,No,,,,,3,13:32,3,13:32,No,,7,Alive,Home
53033,40,0,No,,,,,7:56,No,23,,,0,11:40,0,12:15,No,,,,,1,8:54,1,15:10,No,,4,Alive,Home
53034,40,0,No,,,,,14:15,No,38,,,0,17:42,0,23:50,No,,,,,1,12:08,1,12:08,No,,3,Alive,Home
53038,40,0,No,,,,,8:42,Yes,0,78,123,0,14:54,0,14:43,No,,,,,3,11:12,3,16:28,No,,4,Alive,Home
53040,40,0,No,,,,,9:51,Yes,0,84,132,0,14:32,1,18:40,No,,,,,2,11:29,2,11:29,No,,6,Alive,Home
53042,40,2,No,,,,,7:36,No,33,,,0,12:16,2,10:00,No,,,,,3,11:32,3,11:32,No,,5,Alive,Home
53048,40,0,No,,,,,8:13,Yes,0,57,192,0,14:47,1,21:05,No,,,,,3,15:15,3,15:15,No,,6,Alive,Home
53050,40,3,No,,,,,8:08,No,27,,,0,12:27,1,6:50,No,,,,,4,13:08,4,13:08,No,,7,Alive,Home
53053,40,0,No,,,,,9:15,No,24,,,0,13:23,0,13:16,No,,,,,2,13:54,2,13:54,No,,4,Alive,Home
53055,40,5,No,,,,,12:02,Yes,0,82,131,0,19:07,1,12:05,No,,,,,4,19:26,5,12:01,No,,11,Alive,Home
53056,40,0,No,,,,,8:07,Yes,0,72,163,0,15:10,1,2:47,No,,,,,1,12:15,1,14:10,No,,8,Alive,Home
53059,40,0,No,,,,,8:00,Yes,0,105,140,0,13:50,1,1:09,No,,,,,2,11:24,2,14:08,No,,4,Alive,Home
53062,40,0,No,,,,,8:39,Yes,0,82,135,0,14:45,1,17:00,No,,,,,2,12:49,2,12:49,No,,5,Alive,Home
53065,40,2,No,,,,,13:10,No,28,,,0,17:25,2,11:36,No,,,,,3,8:20,3,14:09,No,,6,Alive,Home
53067,40,4,Yes,0,10:30,No,,,Yes,0,76,100,0,18:25,5,14:16,No,,,,,7,7:20,7,14:09,No,,21,Alive,Home
53068,40,0,No,,,,,8:46,Yes,0,33,48,0,12:52,0,20:13,No,,,,,1,10:45,1,10:45,No,,5,Alive,Home
53070,40,0,No,,,,,8:41,Yes,0,140,165,0,14:55,1,14:40,No,,,,,3,12:43,3,12:43,No,,6,Alive,Home
53073,40,0,No,,,,,8:35,Yes,0,102,137,0,14:38,1,17:44,No,,,,,2,14:15,2,14:15,No,,5,Alive,Home
53082,40,0,No,,,,,7:30,Yes,0,85,174,0,14:56,13,14:20,No,,,,,22,9:08,22,9:08,No,,33,Alive,Home
53083,40,0,No,,,,,8:09,No,28,,,0,12:40,0,12:30,No,,,,,2,12:10,2,21:13,No,,5,Alive,Home
53084,40,0,No,,,,,12:18,Yes,0,53,70,0,17:35,1,17:40,No,,,,,3,18:15,3,18:15,No,,7,Alive,Home
53087,40,6,No,,,,,7:42,No,12,,,0,12:05,0,15:50,Yes,1,12:00,6,15:30,9,13:23,9,13:23,No,,13,Alive,Home
53088,40,1,No,,,,,15:34,No,18,,,0,18:24,1,22:53,No,,,,,2,13:48,2,13:48,No,,8,Alive,Home
53090,40,0,No,,,,,7:58,Yes,0,102,132,0,13:20,1,8:40,No,,,,,2,9:02,2,9:59,No,,4,Alive,Home
53091,40,0,No,,,,,6:53,Yes,0,80,119,0,12:45,1,11:30,No,,,,,4,10:53,4,10:53,No,,6,Alive,Home
53093,40,0,No,,,,,8:25,Yes,0,130,177,0,14:45,1,19:04,No,,,,,3,11:23,3,11:23,No,,6,Alive,Home
53095,40,10,No,,,,,7:49,No,41,,,0,12:30,1,9:01,No,,,,,4,7:50,4,11:17,No,,7,Alive,Home
53103,40,0,No,,,,,7:30,Yes,0,95,183,0,13:49,0,13:30,No,,,,,3,8:47,3,8:47,No,,8,Alive,Home
53105,40,2,No,,,,,11:34,No,20,,,0,15:04,0,15:00,No,,,,,2,12:00,2,12:00,No,,4,Alive,Home
53109,40,0,No,,,,,8:06,Yes,0,97,118,0,13:00,0,16:40,No,,,,,1,13:20,1,15:07,No,,5,Alive,Home
53110,40,0,No,,,,,11:48,Yes,0,106,123,0,18:45,0,18:47,No,,,,,1,10:41,1,17:40,No,,4,Alive,Home
53113,40,20,No,,,,,14:10,No,18,,,0,17:29,10,9:09,No,,,,,20,11:14,20,11:14,No,,34,Alive,Home
53115,40,0,No,,,,,7:47,No,21,,,0,11:05,0,22:30,No,,,,,1,12:22,1,12:22,No,,3,Alive,Home
53116,40,0,No,,,,,7:37,Yes,0,82,165,0,14:13,0,19:35,No,,,,,4,12:00,4,12:00,No,,7,Alive,Home
53120,40,4,No,,,,,12:17,No,16,,,0,17:10,1,11:30,No,,,,,3,11:43,3,11:43,No,,6,Alive,Home
53123,40,2,No,,,,,10:01,No,12,,,0,12:28,0,17:00,No,,,,,1,13:23,1,13:23,No,,6,Alive,Home
53125,40,0,No,,,,,10:08,Yes,0,114,141,0,17:33,1,13:39,No,,,,,3,14:42,3,22:27,No,,6,Alive,Home
53127,40,0,No,,,,,7:47,Yes,0,76,106,0,12:55,0,18:34,No,,,,,1,8:36,1,11:20,No,,7,Alive,Home
53131,40,4,No,,,,,15:51,No,66,,,0,20:38,1,17:45,No,,,,,3,16:15,3,16:15,No,,8,Alive,Home
53134,40,2,Yes,0,1:30,No,,,No,19,,,0,17:19,1,11:35,No,,,,,4,10:50,4,10:50,No,,18,Alive,Home
53136,40,0,No,,,,,6:46,Yes,0,72,119,0,11:47,0,19:48,No,,,,,2,15:20,2,15:20,No,,5,Alive,Home
53137,40,0,No,,,,,7:53,Yes,0,193,230,0,15:39,1,6:37,No,,,,,5,16:00,5,16:00,No,,8,Alive,Home
53139,40,3,No,,,,,8:05,No,18,,,0,15:25,2,11:32,No,,,,,5,8:20,5,11:06,No,,9,Alive,Home
53140,40,4,No,,,,,15:56,No,22,,,0,20:04,1,12:35,No,,,,,2,12:31,2,12:31,No,,5,Alive,Home
53143,40,0,No,,,,,8:10,Yes,0,127,167,1,12:05,1,22:00,Yes,3,,4,14:00,5,8:53,5,8:53,No,,12,Alive,Home
53144,40,11,No,,,,,7:00,No,0,,,0,20:00,1,9:00,No,,,,,2,16:00,2,16:00,No,,4,Alive,Home
53145,40,6,No,,,,,8:47,No,0,,,0,12:55,1,4:00,No,,,,,1,20:00,1,20:00,No,,3,Alive,Home
53148,40,0,No,,,,,7:28,Yes,0,71,88,0,12:29,1,4:11,No,,,,,2,17:45,2,17:45,No,,6,Alive,Home
53149,40,0,No,,,,,7:31,Yes,0,110,152,0,13:19,1,8:00,No,,,,,2,12:30,2,12:30,No,,4,Alive,Home
53150,40,1,No,,,,,6:35,No,18,,,0,17:00,3,15:00,No,,,,,4,10:00,4,10:00,No,,6,Alive,Home
53151,40,0,No,,,,,13:14,Yes,0,92,141,0,19:00,1,17:30,No,,,,,3,16:26,3,16:26,No,,6,Alive,Home
53153,40,0,No,,,,,8:00,Yes,0,100,121,0,13:40,0,23:30,No,,,,,1,8:10,1,12:32,Yes,1,32,Alive,Home
53155,40,0,No,,,,,6:46,Yes,0,46,201,0,14:31,1,10:45,No,,,,,3,22:23,3,22:23,No,,9,Alive,Home
53163,40,0,No,,,,,7:43,Yes,0,124,194,0,14:30,4,15:00,No,,,,,11,14:39,11,14:39,No,,15,Alive,Home
53164,40,0,No,,,,,8:01,Yes,0,100,184,0,16:30,1,14:30,No,,,,,2,12:37,2,12:37,No,,6,Alive,Home
53165,40,3,No,,,,,13:25,No,19,,,0,19:20,1,6:30,No,,,,,1,12:43,1,16:39,No,,3,Alive,Home
53171,40,3,No,,,,,10:49,No,0,,,0,14:00,1,10:50,No,,,,,2,9:00,2,9:00,No,,5,Alive,Home
53174,40,20,No,,,,,13:13,No,0,,,0,16:00,3,6:00,No,,,,,4,11:00,4,11:00,No,,7,Alive,Home
53176,40,1,No,,,,,8:38,Yes,0,206,356,0,21:17,1,3:10,Yes,2,1:17,5,12:12,5,12:12,5,12:12,No,,5,Dead,
53177,40,0,No,,,,,8:23,Yes,0,106,143,0,14:21,1,8:15,No,,,,,2,11:00,2,11:00,No,,5,Alive,Home
53185,40,1,No,,,,,12:51,Yes,0,98,115,0,19:20,12,19:29,Yes,13,22:48,19,11:55,27,13:07,27,13:51,No,,45,Alive,Home
53188,40,0,No,,,,,8:01,Yes,0,129,146,0,14:30,1,6:17,No,,,,,2,8:30,2,11:26,No,,9,Alive,Home
53191,40,0,No,,,,,7:30,Yes,0,61,181,0,14:15,2,2:00,No,,,,,2,9:28,2,9:28,No,,7,Alive,Home
53194,40,0,No,,,,,7:33,No,14,,,0,11:26,1,3:00,Yes,6,18:26,8,10:34,3,17:30,3,17:30,Yes,6,8,Dead,
53198,40,0,No,,,,,6:46,Yes,0,107,52,0,11:44,0,23:30,No,,,,,2,17:19,2,17:19,No,,5,Alive,Home
53215,40,2,No,,,,,6:57,Yes,0,93,156,0,12:00,1,11:15,No,,,,,3,9:00,3,9:00,No,,4,Alive,Home
53216,40,0,No,,,,,8:15,No,19,,,0,11:10,0,23:00,No,,,,,1,16:10,1,16:10,No,,4,Alive,Home
53218,40,2,No,,,,,14:03,No,17,,,0,17:15,1,14:45,No,,,,,3,11:00,3,11:00,No,,5,Alive,Home
53219,40,0,No,,,,,16:57,Yes,0,99,132,0,23:25,1,12:00,No,,,,,1,20:00,1,20:00,No,,6,Alive,Home
53220,40,0,No,,,,,8:51,Yes,0,111,148,0,15:00,1,13:00,No,,,,,2,10:34,2,10:34,No,,5,Alive,Home
53222,40,1,No,,,,,12:02,No,12,,,0,16:22,1,13:55,No,,,,,2,15:49,2,15:49,No,,12,Alive,Home
53226,40,7,No,,,,,11:03,Yes,0,60,152,31,19:39,39,8:30,No,,,,,47,4:44,47,4:44,No,,72,Alive,Home
53230,40,3,No,,,,,7:24,No,22,,,0,12:00,1,8:58,No,,,,,2,16:30,2,16:30,No,,5,Alive,Home
53233,40,0,No,,,,,7:55,Yes,0,82,139,0,14:45,1,0:38,Yes,2,20:15,3,13:00,6,9:00,6,9:45,No,,42,Alive,Home
53239,40,0,No,,,,,12:30,Yes,0,73,130,0,17:20,1,5:45,No,,,,,4,8:00,4,8:00,No,,6,Alive,Home
53241,40,0,No,,,,,7:41,Yes,0,40,71,0,11:58,1,4:13,No,,,,,1,18:25,1,18:25,No,,5,Alive,Home
53242,40,10,No,,,,,14:00,No,18,,,0,17:35,1,22:52,No,,,,,2,10:50,2,14:18,No,,5,Alive,Other Acute Care Center
53244,40,0,No,,,,,6:39,Yes,0,60,104,0,12:36,1,2:25,No,,,,,4,11:59,4,11:59,No,,5,Alive,Home
53245,40,9,Yes,9,1:30,Yes,12:15,,No,21,,,0,18:11,6,15:15,No,,,,,56,10:07,56,10:07,No,,82,Alive,Home
53246,40,0,No,,,,,7:54,Yes,0,51,132,0,13:45,0,13:30,No,,,,,1,8:30,1,14:03,No,,4,Alive,Home
53253,40,0,No,,,,,9:14,Yes,0,71,94,0,14:10,0,23:59,Yes,1,5:00,4,15:20,8,7:06,8,12:41,No,,28,Alive,Home
53255,40,0,No,,,,,7:31,No,20,,,0,11:15,1,9:21,No,,,,,2,15:02,2,15:02,No,,4,Alive,Home
53257,40,3,No,,,,,11:36,No,12,,,0,11:09,0,15:25,No,,,,,2,9:49,2,9:49,No,,4,Alive,Home
53258,40,0,No,,,,,6:33,Yes,0,112,176,0,12:55,0,22:29,No,,,,,3,10:49,3,10:49,No,,6,Alive,Home
53260,40,0,No,,,,,13:43,Yes,0,129,162,0,19:50,1,4:33,No,,,,,5,7:10,5,11:55,No,,7,Alive,Home
53263,40,0,No,,,,,8:01,Yes,0,113,128,0,13:37,1,6:45,No,,,,,2,7:47,2,12:49,No,,7,Alive,Home
53265,40,4,No,,,,,10:57,No,13,,,0,14:30,0,16:39,No,,,,,2,10:27,2,10:27,No,,4,Alive,Home
53267,40,0,No,,,,,7:40,Yes,0,129,177,0,17:19,2,21:41,No,,,,,8,11:17,8,11:17,No,,11,Alive,Home
53268,40,0,No,,,,,7:26,Yes,0,131,225,0,14:58,1,9:55,No,,,,,4,17:25,4,17:25,No,,7,Alive,Home
53276,40,1,No,,,,,11:35,No,22,,,0,15:28,1,10:23,No,,,,,2,10:19,2,10:19,No,,4,Alive,Home
53278,40,5,No,,,,,7:28,No,0,,,0,11:51,1,2:52,No,,,,,1,16:30,1,16:30,No,,8,Alive,Home
53279,40,7,No,,,,,8:29,No,40,,,0,12:51,3,6:45,No,,,,,8,12:36,8,20:38,No,,28,Alive,Home
53281,40,1,No,,,,,12:35,Yes,0,58,93,0,17:36,1,9:26,No,,,,,1,17:11,1,17:11,No,,4,Alive,Home
53287,40,0,No,,,,,8:12,Yes,0,119,156,0,15:20,1,10:49,No,,,,,2,12:38,2,12:38,No,,7,Alive,Home
53294,40,11,No,,,,,7:54,Yes,0,75,128,0,13:40,0,13:36,No,,,,,1,8:15,1,12:30,No,,6,Alive,Home
53300,40,0,No,,,,,10:59,Yes,0,82,154,0,18:25,1,13:15,No,,,,,6,6:05,6,11:06,No,,11,Alive,Home
53301,40,0,No,,,,,9:00,Yes,0,94,116,0,14:15,0,22:22,No,,,,,1,8:40,1,12:10,No,,4,Alive,Home
53302,40,3,No,,,,,12:37,Yes,0,102,122,0,18:55,1,14:40,No,,,,,2,13:32,2,13:32,No,,7,Alive,Home
53303,40,0,No,,,,,10:50,No,23,,,0,15:31,1,7:30,No,,,,,2,10:14,2,10:14,No,,4,Alive,Home
53306,40,0,No,,,,,8:24,Yes,0,91,130,0,14:46,1,0:40,No,,,,,4,6:12,4,6:12,No,,8,Alive,Home
53307,40,0,No,,,,,8:29,Yes,0,55,99,0,14:01,0,13:50,No,,,,,1,17:30,1,17:30,No,,5,Alive,Home
53309,40,8,No,,,,,13:17,Yes,0,99,127,0,18:55,1,5:00,No,,,,,2,14:09,2,14:09,No,,5,Alive,Home
53311,40,0,No,,,,,8:43,Yes,0,105,130,0,14:08,1,22:35,No,,,,,2,9:36,2,9:36,No,,6,Alive,Home
53313,40,0,No,,,,,7:57,Yes,0,72,99,0,12:28,1,17:16,No,,,,,3,13:00,3,13:00,No,,7,Alive,Home
53314,40,5,No,,,,,7:46,Yes,0,51,118,0,13:12,3,6:10,No,,,,,5,12:00,5,12:00,No,,9,Alive,Home
53318,40,4,No,,,,,8:01,Yes,0,104,124,0,13:40,2,21:05,No,,,,,4,9:20,4,13:35,No,,7,Alive,Home
53319,40,0,No,,,,,9:14,No,26,,,0,13:51,1,0:00,No,,,,,2,12:05,2,12:05,No,,4,Alive,Home
53323,40,0,No,,,,,7:44,No,0,,,0,11:15,1,3:13,No,,,,,2,16:31,2,16:31,No,,4,Alive,Home
53325,40,0,No,,,,,7:59,Yes,0,76,99,0,13:05,0,22:19,No,,,,,1,7:15,1,13:10,No,,4,Alive,Home
53328,40,0,No,,,,,6:38,Yes,0,129,167,0,12:15,1,19:00,No,,,,,4,13:10,4,13:10,No,,5,Alive,Home
53329,40,2,No,,,,,8:05,Yes,0,94,103,0,13:20,5,11:00,No,,,,,6,10:38,6,12:08,No,,8,Alive,Home
53330,40,0,No,,,,,8:32,No,20,,,0,11:38,0,23:40,No,,,,,1,14:00,1,14:00,No,,3,Alive,Home
53332,40,1,No,,,,,6:35,Yes,0,115,167,0,12:30,0,21:20,No,,,,,3,14:05,3,14:05,No,,5,Alive,Home
53336,40,0,No,,,,,7:59,Yes,0,87,119,0,13:58,0,13:50,No,,,,,2,10:32,2,10:32,No,,6,Alive,Home
53341,40,4,No,,,,,7:37,No,16,,,0,11:00,1,4:50,No,,,,,2,5:43,2,5:43,No,,4,Alive,Home
53346,40,0,No,,,,,8:05,Yes,0,66,106,0,16:20,1,16:38,No,,,,,4,20:53,4,20:53,No,,6,Alive,Home
53350,40,7,Yes,4,0:00,Yes,8:17,,No,23,,,0,11:50,1,20:05,No,,,,,2,13:39,2,13:39,No,,6,Alive,Home
53353,40,0,No,,,,,10:06,No,27,,,0,15:01,0,22:40,No,,,,,3,9:15,3,9:15,No,,5,Alive,Home
53354,40,0,No,,,,,8:52,No,26,,,0,13:55,0,19:06,No,,,,,1,17:23,1,17:23,No,,4,Alive,Home
53356,40,6,No,,,,,14:10,No,40,,,0,19:05,2,13:21,No,,,,,3,10:21,3,15:33,No,,8,Alive,Home
53361,40,1,No,,,,,13:30,No,20,,,0,16:10,1,12:46,No,,,,,1,17:20,1,17:46,No,,4,Alive,Home
53363,40,0,No,,,,,8:00,Yes,0,109,156,0,14:20,1,2:34,No,,,,,3,8:45,3,14:38,No,,6,Alive,Home
53364,40,0,No,,,,,7:55,Yes,0,114,131,0,13:55,0,20:25,No,,,,,2,13:00,2,15:37,No,,11,Alive,Home
53366,40,0,No,,,,,7:58,Yes,0,0,201,0,14:50,0,14:30,Yes,1,4:33,1,13:25,4,9:46,4,12:44,No,,31,Alive,Home
53370,40,0,No,,,,,7:53,Yes,0,105,124,0,13:30,1,10:52,No,,,,,4,7:15,4,13:00,No,,6,Alive,Home
53373,40,1,No,,,,,10:28,Yes,0,75,236,0,18:52,2,9:00,No,,,,,5,9:34,5,9:34,No,,10,Alive,Home
53376,40,0,No,,,,,8:07,Yes,0,110,213,0,15:37,1,9:48,No,,,,,3,11:34,3,11:34,No,,6,Alive,Home
53389,40,1,No,,,,,9:15,Yes,0,78,133,0,15:41,2,14:44,No,,,,,4,9:38,4,9:38,No,,9,Alive,Home
53391,40,0,No,,,,,7:38,Yes,0,192,286,0,20:56,7,13:40,No,,,,,15,10:28,15,10:28,No,,22,Alive,Home
53392,40,0,No,,,,,7:33,Yes,0,99,155,0,13:00,1,4:25,No,,,,,2,10:00,2,10:00,No,,8,Alive,Home
53393,40,6,No,,,,,15:02,No,22,,,0,17:54,1,5:57,No,,,,,2,8:51,2,13:35,No,,3,Alive,Home
53394,40,4,No,,,,,11:28,No,15,,,0,15:59,1,16:15,No,,,,,4,14:05,4,14:05,No,,7,Alive,Home
53399,40,0,No,,,,,7:48,Yes,0,73,90,0,12:48,1,3:15,No,,,,,1,12:30,1,12:30,No,,5,Alive,Home
53400,40,0,No,,,,,7:27,Yes,0,51,84,0,12:25,1,18:00,No,,,,,2,13:51,2,13:51,No,,6,Alive,Home
53401,40,8,No,,,,,8:28,No,18,,,0,11:35,1,15:25,No,,,,,5,12:00,5,12:00,No,,11,Alive,Home
53403,40,5,No,,,,,7:38,No,13,,,0,10:28,0,20:36,No,,,,,1,11:16,1,11:16,No,,3,Alive,Home
53404,40,0,No,,,,,6:33,Yes,0,143,239,0,15:03,1,18:48,No,,,,,4,18:37,4,18:37,No,,11,Alive,Home
53410,40,6,No,,,,,14:48,No,15,,,0,17:46,1,13:31,No,,,,,2,12:58,2,12:58,No,,4,Alive,Home
53411,40,1,No,,,,,8:31,Yes,0,96,199,0,15:15,1,21:34,No,,,,,2,12:00,2,12:00,No,,6,Alive,Home
53413,40,0,No,,,,,7:45,Yes,0,77,151,0,14:04,1,7:40,No,,,,,4,14:03,4,16:35,No,,8,Alive,Home
53414,40,1,No,,,,,7:37,No,15,,,0,11:32,0,16:05,Yes,7,7:50,45,11:40,57,11:41,57,11:41,No,,73,Alive,Home
53417,40,3,No,,,,,8:48,No,32,,,0,11:30,1,20:45,No,,,,,3,8:20,3,13:33,No,,4,Alive,Home
53419,40,0,No,,,,,8:00,Yes,0,94,134,0,14:55,1,17:15,No,,,,,3,11:24,3,13:12,No,,7,Alive,Home
53423,40,0,No,,,,,8:21,Yes,0,66,86,0,13:56,1,22:25,No,,,,,2,16:00,2,16:00,No,,4,Alive,Home
53425,40,6,No,,,,,13:49,No,15,,,0,17:35,1,14:10,Yes,1,14:10,2,15:05,4,10:23,4,10:23,No,,7,Alive,Home
53426,40,1,No,,,,,7:29,Yes,0,95,135,0,13:42,1,11:00,No,,,,,2,16:55,2,16:55,No,,5,Alive,Home
53441,40,1,No,,,,,12:43,Yes,0,110,159,0,19:45,4,11:30,No,,,,,5,18:01,5,18:01,No,,10,Alive,Home
53448,40,0,No,,,,,8:10,Yes,0,70,89,0,12:07,1,23:00,No,,,,,2,9:00,2,14:50,No,,5,Alive,Home
53449,40,4,No,,,,,7:53,No,12,,,0,11:38,0,15:18,No,,,,,1,9:58,1,9:58,No,,6,Alive,Home
53450,40,0,No,,,,,8:50,No,0,,,0,19:50,3,11:35,Yes,5,13:28,6,9:20,13,12:00,13,12:00,No,,17,Alive,Home
53457,40,0,No,,,,,14:31,Yes,0,101,125,0,20:33,1,12:00,No,,,,,1,17:51,1,17:51,No,,5,Alive,Home
53459,40,2,No,,,,,18:18,No,15,,,0,20:35,1,14:54,No,,,,,2,11:00,2,13:51,No,,9,Alive,Home
53460,40,6,No,,,,,13:03,Yes,0,78,99,0,18:30,1,16:58,No,,,,,2,17:00,2,17:00,No,,7,Alive,Home
53462,40,2,No,,,,,12:40,No,15,,,0,14:40,0,23:40,No,,,,,2,8:15,2,12:30,No,,7,Alive,Home
53464,40,2,No,,,,,15:32,No,29,,,0,17:30,1,10:45,No,,,,,2,8:13,2,15:47,No,,5,Alive,Home
53465,40,1,No,,,,,6:48,Yes,0,170,262,0,15:21,1,13:00,No,,,,,5,12:40,5,12:40,No,,7,Alive,Home
53468,40,2,Yes,19,8:47,No,,,Yes,0,155,240,0,16:19,1,11:20,No,,,,,4,14:30,4,14:30,No,,5,Alive,Home
53471,40,1,No,,,,,6:35,Yes,0,102,171,0,12:38,2,6:35,No,,,,,4,9:30,4,9:30,No,,5,Alive,Home
53473,40,0,No,,,,,7:47,Yes,0,100,178,0,16:08,1,8:20,No,,,,,3,19:44,3,19:44,No,,8,Alive,Home
53480,40,1,Yes,1,8:45,Yes,7:19,,Yes,0,81,125,0,13:15,2,6:42,No,,,,,3,10:30,3,10:30,No,,5,Alive,Home
53481,40,1,No,,,,,12:19,No,15,,,0,16:55,1,17:15,No,,,,,2,10:15,2,10:15,No,,7,Alive,Home
53482,40,5,No,,,,,9:20,No,17,,,0,12:40,0,19:34,Yes,0,19:34,1,11:44,3,8:00,3,8:49,No,,4,Alive,Home
53487,40,0,No,,,,,12:22,Yes,0,88,135,0,17:46,2,13:10,No,,,,,4,5:57,4,5:57,No,,6,Alive,Home
53493,40,16,No,,,,,12:32,No,15,,,0,15:10,2,5:36,No,,,,,3,13:25,3,14:37,No,,6,Alive,Other Acute Care Center
53495,40,7,No,,,,,13:30,No,23,,,0,18:09,1,6:40,No,,,,,1,9:00,1,12:19,Yes,2,11,Alive,Home
53496,40,52,No,,,,,14:50,No,15,,,0,18:54,1,17:02,Yes,17,12:30,25,12:04,31,13:32,31,13:32,No,,31,Alive,Home
53497,40,0,No,,,,,7:48,Yes,0,92,138,0,13:15,1,0:00,No,,,,,1,8:30,1,10:57,No,,6,Alive,Home
53498,40,1,No,,,,,7:04,No,0,,,0,12:30,0,16:34,No,,,,,1,13:13,1,13:13,No,,6,Alive,Home
53499,40,0,No,,,,,8:50,Yes,0,52,94,0,14:27,1,0:25,No,,,,,2,15:00,2,15:00,No,,6,Alive,Home
53503,40,4,No,,,,,9:50,No,27,,,0,12:19,1,11:01,No,,,,,2,7:00,2,10:27,No,,3,Alive,Home
53504,40,0,Yes,0,7:47,No,,,Yes,0,78,114,0,14:15,1,11:00,No,,,,,2,13:35,2,13:35,No,,8,Alive,Home
53509,40,2,No,,,,,14:30,No,28,,,0,18:00,3,17:00,No,,,,,11,5:00,11,5:00,No,,11,Alive,Other Acute Care Center
53512,40,0,No,,,,,7:35,Yes,0,54,117,0,12:43,1,9:55,No,,,,,3,8:43,3,8:43,No,,5,Alive,Home
53521,40,0,No,,,,,8:31,Yes,0,70,108,0,13:15,1,8:30,No,,,,,1,17:00,1,17:00,No,,5,Alive,Home
53523,40,7,No,,,,,8:24,Yes,0,101,183,0,15:04,1,12:55,No,,,,,3,10:51,3,10:51,No,,6,Alive,Home
53526,40,0,No,,,,,7:45,Yes,0,80,94,0,12:00,1,11:00,No,,,,,2,15:07,2,15:07,No,,4,Alive,Home
53529,40,1,No,,,,,8:00,Yes,0,129,163,0,13:30,0,19:45,No,,,,,8,7:40,8,13:13,No,,12,Alive,Home
53537,40,0,No,,,,,8:57,Yes,0,79,118,0,14:20,0,21:32,No,,,,,3,9:08,3,12:14,No,,14,Alive,Home
53542,40,0,No,,,,,7:30,Yes,0,74,129,0,14:20,4,11:35,No,,,,,13,10:30,13,10:30,No,,21,Alive,Home
53544,40,0,No,,,,,8:07,Yes,0,84,95,0,12:50,1,12:43,No,,,,,2,8:16,2,11:23,No,,6,Alive,Home
53545,40,0,No,,,,,12:02,Yes,0,102,138,0,16:55,1,10:35,No,,,,,3,16:47,3,16:47,No,,4,Alive,Home
53552,40,0,No,,,,,8:36,Yes,0,33,63,0,11:39,0,17:30,No,,,,,1,11:45,1,11:45,No,,5,Alive,Home
53556,40,5,No,,,,,14:33,No,15,,,0,17:54,1,10:00,No,,,,,2,11:20,2,11:20,No,,4,Alive,Home
53563,40,0,No,,,,,7:32,Yes,0,83,110,0,13:25,0,13:09,No,,,,,1,11:58,1,11:58,No,,7,Alive,Home
53564,40,2,No,,,,,8:22,No,28,,,0,13:58,1,9:50,No,,,,,5,9:17,5,11:55,No,,5,Alive,Home
53571,40,2,No,,,,,14:06,No,17,,,0,17:11,1,5:37,No,,,,,1,14:56,1,14:56,No,,11,Alive,Home
53577,40,1,No,,,,,8:56,Yes,0,141,195,0,14:40,0,22:00,No,,,,,3,11:58,3,11:58,No,,6,Alive,Home
53580,40,6,No,,,,,13:09,No,26,,,0,16:00,1,14:31,No,,,,,3,13:28,7,12:05,No,,9,Alive,Home
53581,40,0,No,,,,,7:20,Yes,0,58,85,0,12:06,1,1:49,No,,,,,1,15:33,1,15:33,No,,4,Alive,Home
53589,40,66,Yes,67,3:00,Yes,13:49,,Yes,0,50,119,0,18:44,7,11:00,No,,,,,8,16:17,8,16:17,No,,14,Alive,Home
53594,40,1,No,,,,,6:52,Yes,0,86,153,0,12:49,1,19:00,No,,,,,3,18:32,3,18:32,No,,5,Alive,Home
53601,40,0,No,,,,,8:00,Yes,0,124,143,0,14:05,1,13:31,No,,,,,2,7:25,2,13:52,No,,8,Alive,Home
53605,40,2,No,,,,,12:33,No,16,,,0,15:50,1,4:25,No,,,,,2,13:50,2,13:50,No,,4,Alive,Home
53606,40,4,Yes,3,10:50,Yes,7:44,,Yes,0,51,74,0,12:41,1,13:30,No,,,,,2,11:34,2,11:34,No,,6,Alive,Home
53607,40,0,No,,,,,7:45,Yes,0,97,113,0,12:20,0,20:23,No,,,,,1,14:40,1,14:40,No,,12,Alive,Home
53619,40,0,No,,,,,8:02,Yes,0,140,169,0,14:30,1,18:07,No,,,,,2,8:19,3,11:54,No,,6,Alive,Home
53625,40,0,No,,,,,8:15,Yes,0,116,141,0,14:20,1,14:00,No,,,,,2,14:55,2,14:55,No,,5,Alive,Home
53629,40,0,No,,,,,8:59,Yes,0,144,163,0,15:40,1,6:00,No,,,,,4,8:05,4,12:43,No,,6,Alive,Home
53631,40,3,No,,,,,14:37,No,22,,,0,17:30,2,12:00,No,,,,,4,7:48,5,12:19,No,,8,Alive,Home
53636,40,2,No,,,,,8:01,No,19,,,0,11:05,1,10:37,No,,,,,5,9:00,5,9:03,No,,9,Alive,Home
53638,40,2,No,,,,,13:24,No,26,,,0,22:25,2,11:20,No,,,,,3,8:20,3,12:24,No,,8,Alive,Home
53642,40,0,No,,,,,6:38,Yes,0,84,151,0,13:03,1,16:45,No,,,,,3,5:46,3,5:46,No,,4,Alive,Home
53643,40,3,No,,,,,8:19,Yes,0,110,178,0,13:43,1,6:35,No,,,,,3,11:18,3,11:18,No,,7,Alive,Home
53648,40,1,Yes,1,,No,,,No,19,,,0,11:53,1,16:17,No,,,,,2,15:05,2,15:05,No,,5,Alive,Home
53652,40,8,No,,,,,7:23,No,15,,,0,11:27,1,0:08,No,,,,,1,13:45,1,13:45,No,,5,Alive,Home
53655,40,0,No,,,,,8:44,Yes,0,111,145,0,14:05,0,20:00,No,,,,,1,11:39,1,11:39,No,,6,Alive,Home
53659,40,0,No,,,,,7:57,Yes,0,82,218,0,16:45,1,20:15,No,,,,,2,8:30,2,14:28,No,,7,Alive,Home
53660,40,0,No,,,,,8:05,Yes,0,91,105,0,13:15,0,13:10,No,,,,,1,9:13,1,13:57,No,,4,Alive,Home
53664,40,4,Yes,4,17:30,Yes,15:21,,No,14,,,0,18:59,1,8:15,No,,,,,2,17:06,2,17:06,No,,7,Alive,Home
53670,40,0,No,,,,,9:10,No,14,,,0,5:00,2,7:01,No,,,,,3,8:30,3,14:12,No,,20,Alive,Home
53679,40,3,No,,,,,13:22,No,15,,,0,15:53,0,22:34,No,,,,,1,11:45,1,11:45,No,,4,Alive,Home
53680,40,3,No,,,,,15:35,No,18,,,0,18:00,1,9:00,No,,,,,2,11:00,2,11:00,No,,4,Alive,Home
53690,40,2,No,,,,,13:53,No,19,,,0,16:14,1,22:58,No,,,,,2,9:15,2,16:09,No,,4,Alive,Home
53696,40,0,No,,,,,8:16,No,0,,,0,11:00,1,12:50,No,,,,,3,8:00,3,8:00,No,,4,Alive,Home
53697,40,1,No,,,,,8:19,Yes,0,129,180,0,14:05,3,1:00,No,,,,,7,9:00,7,9:00,No,,24,Alive,Home
53699,40,0,No,,,,,12:53,No,11,,,0,17:23,0,22:15,No,,,,,3,14:07,3,14:07,No,,9,Alive,Home
53704,40,0,No,,,,,6:41,Yes,0,70,105,0,11:00,1,4:20,No,,,,,2,15:00,2,15:00,No,,4,Alive,Home
53705,40,0,No,,,,,7:55,Yes,0,68,87,0,13:00,1,3:06,No,,,,,1,6:30,1,11:13,No,,4,Alive,Home
53707,40,2,Yes,2,,No,,,No,18,,,0,10:51,1,12:45,No,,,,,4,13:00,4,13:00,No,,8,Alive,Home
53709,40,36,No,,,,,14:27,No,25,,,0,18:00,1,10:58,No,,,,,13,0:54,13,0:59,No,,13,Alive,Other Acute Care Center
53719,40,0,No,,,,,14:18,Yes,0,79,95,0,18:50,1,11:10,No,,,,,2,8:50,2,11:31,No,,6,Alive,Home
53720,40,6,No,,,,,14:14,No,15,,,0,16:58,1,0:15,No,,,,,2,10:08,2,10:08,No,,4,Alive,Home
53721,40,2,No,,,,,13:53,No,12,,,0,17:00,1,22:50,No,,,,,2,9:16,5,11:12,No,,12,Alive,Home
53729,40,0,No,,,,,6:45,No,0,,,0,10:00,1,1:30,No,,,,,2,11:00,2,11:00,No,,4,Alive,Home
53737,40,0,No,,,,,6:44,No,0,,,0,10:00,0,18:28,No,,,,,3,14:00,3,14:00,No,,4,Alive,Home
53741,40,0,No,,,,,7:23,No,15,,,0,16:22,1,14:09,No,,,,,2,14:17,2,14:17,No,,4,Alive,Home
53742,40,4,No,,,,,14:49,No,15,,,0,16:50,1,17:42,No,,,,,2,9:32,2,12:39,No,,3,Alive,Home
53743,40,1,No,,,,,6:50,Yes,0,89,140,0,11:00,1,5:30,No,,,,,3,12:00,3,12:00,No,,5,Alive,Home
53744,40,0,No,,,,,7:32,No,24,,,0,12:25,0,19:25,No,,,,,2,16:09,2,16:09,No,,4,Alive,Home
53745,40,0,No,,,,,9:02,No,17,,,0,12:26,0,12:16,No,,,,,2,9:13,2,9:13,No,,3,Alive,Home
53748,40,1,No,,,,,7:37,Yes,0,97,125,0,13:25,1,16:15,No,,,,,2,14:37,2,14:37,No,,6,Alive,Home
53751,40,0,No,,,,,6:32,No,0,,,0,19:00,1,9:30,No,,,,,2,9:00,2,9:00,No,,3,Alive,Home
53764,40,4,No,,,,,16:44,No,28,,,0,20:30,1,3:45,No,,,,,3,16:40,3,16:40,No,,6,Alive,Home
53766,40,1,No,,,,,8:16,Yes,0,75,90,0,12:40,1,0:37,No,,,,,1,8:18,1,11:59,No,,4,Alive,Home
53767,40,0,No,,,,,6:40,Yes,0,107,146,0,13:14,1,0:05,No,,,,,4,9:55,4,9:55,No,,8,Alive,Home
53777,40,0,No,,,,,7:30,Yes,0,82,103,0,14:00,1,11:10,No,,,,,3,17:54,3,17:54,No,,6,Alive,Home
53779,40,3,No,,,,,14:13,No,0,,,0,20:00,2,12:55,No,,,,,4,11:00,4,11:00,No,,8,Alive,Home
53782,40,0,No,,,,,8:45,Yes,0,67,105,0,13:54,3,11:00,No,,,,,4,17:34,4,17:34,No,,8,Alive,Home
53785,40,0,No,,,,,7:30,Yes,0,66,108,0,13:17,1,10:20,No,,,,,3,16:18,3,16:18,No,,8,Alive,Home
53787,40,1,No,,,,,12:00,No,14,,,0,14:50,1,4:50,No,,,,,3,9:27,3,9:27,No,,4,Alive,Home
53789,40,0,No,,,,,7:58,Yes,0,34,441,0,20:52,18,12:47,No,,,,,24,10:53,24,12:15,No,,42,Alive,Home
53790,40,1,No,,,,,14:47,No,25,,,0,17:10,1,14:05,No,,,,,2,14:20,2,16:02,No,,5,Alive,Home
53792,40,0,No,,,,,8:08,Yes,0,69,124,0,13:51,0,20:55,No,,,,,3,12:41,3,12:41,No,,4,Alive,Home
53793,40,1,No,,,,,10:30,No,23,,,0,12:14,0,20:45,No,,,,,1,1:50,1,9:23,No,,3,Alive,Home
53794,40,1,No,,,,,12:57,No,21,,,0,15:45,1,12:22,No,,,,,2,8:50,2,12:49,No,,3,Alive,Home
53797,40,1,No,,,,,15:26,No,35,,,0,19:00,1,11:24,No,,,,,3,8:31,3,12:50,No,,6,Alive,Home
53811,40,3,No,,,,,7:27,No,14,,,0,11:52,2,10:57,No,,,,,8,15:14,8,15:14,No,,15,Alive,Home