random_ID,VISIT,SCREEN_NUM,COMP_AGE,GENDER,HISPANIC,RACE,AO_OLDECHO,AOECHO_AGE,AOECHO_HT,AOECHO_WT,MPA_AVAIL,MPA_DIM,MPAECHO_AGE,MPAECHO_HT,MPAECHO_WT,VER_ID
144501,BASELINE,1,9,FEMALE,NO,WHITE,2.57,9,152.9,42.4,NO,,,,,C
144502,BASELINE,1,13.1,MALE,YES,WHITE,4.06,13,170.2,49.9,YES,2.44,13,170.2,49.9,C
144503,BASELINE,1,5.1,FEMALE,NO,WHITE,4.00,5,,,NO,,,,,C
144504,BASELINE,1,4.2,MALE,YES,WHITE,2.52,4.2,110.0,21.0,NO,,,,,C
144505,BASELINE,1,12.9,FEMALE,NO,WHITE,3.61,12.8,171.6,55.7,NO,,,,,C
144506,BASELINE,1,17.1,FEMALE,NO,WHITE,3.70,17.1,190.0,86.2,NO,,,,,B
144507,BASELINE,1,3.3,MALE,NO,WHITE,3.07,3.2,97.0,14.4,NO,,,,,C
144508,BASELINE,1,16,MALE,NO,WHITE,4.76,16,192.0,91.5,YES,3.25,16,192.0,91.5,A
144509,BASELINE,1,6.3,FEMALE,UNKNOWN,UNKNOWN,2.70,6.2,131.0,19.4,NO,,,,,C
144510,BASELINE,1,7.9,MALE,NO,WHITE,2.70,7.9,143.5,29.7,YES,2.48,7.9,143.5,29.7,B
144511,BASELINE,1,8.3,MALE,YES,WHITE,2.90,8.3,99.8,29.4,NO,,,,,B
144512,BASELINE,1,16.7,FEMALE,UNKNOWN,UNKNOWN,3.70,16.4,174.0,58.1,NO,,,,,C
144513,BASELINE,1,5.2,FEMALE,NO,WHITE,2.35,4.9,113.0,16.8,YES,1.51,4.9,113.0,16.8,B
144514,BASELINE,1,14.4,MALE,UNKNOWN,WHITE,3.50,14.4,181.3,64.5,YES,1.64,14.4,181.3,64.5,C
144515,BASELINE,1,11.6,MALE,NO,BLACK OR AFRICAN AMERICAN,3.75,11.5,168.0,42.8,NO,,,,,C
144516,BASELINE,1,10,FEMALE,NO,WHITE,3.40,9.5,147.0,34.0,NO,,,,,B
144517,BASELINE,1,19.3,MALE,NO,WHITE,4.10,18.9,186.0,44.5,NO,,,,,C
144518,BASELINE,1,18,MALE,NO,WHITE,3.81,18,187.0,69.4,NO,,,,,B
144519,BASELINE,1,23.7,MALE,NO,WHITE,4.60,23.7,208.0,119.0,NO,,,,,B
144520,BASELINE,1,5,MALE,NO,WHITE,2.80,5,119.0,20.6,NO,,,,,B
144521,BASELINE,1,11,FEMALE,NO,WHITE,3.50,11,151.4,27.3,NO,,,,,B
144522,BASELINE,1,10.7,FEMALE,NO,WHITE,2.99,10.7,164.0,61.2,YES,2.13,10.7,164.0,61.2,C
144523,BASELINE,1,24.6,MALE,NO,WHITE,5.40,23.8,,,NO,,,,,C
144524,BASELINE,1,10.5,MALE,NO,WHITE,2.83,10.5,146.0,28.8,YES,1.95,10.5,146.0,28.8,C
144525,BASELINE,1,1.5,FEMALE,NO,WHITE,1.97,1.5,83.5,11.2,NO,,,,,C
144526,BASELINE,1,10.2,FEMALE,NO,WHITE,3.10,10,135.0,38.0,NO,,,,,B
144527,BASELINE,1,11.3,MALE,NO,WHITE,3.31,10.8,153.6,38.9,NO,,,,,A
144528,BASELINE,1,24,MALE,UNKNOWN,WHITE,3.68,24,168.0,59.1,NO,,,,,B
144529,BASELINE,1,3.6,FEMALE,NO,WHITE,2.30,3.1,103.0,17.3,YES,1.80,3.1,103.0,17.3,C
144530,BASELINE,1,6.6,MALE,NO,ASIAN,2.67,6.6,133.0,23.5,NO,,,,,C
144531,BASELINE,1,5.8,MALE,NO,Other/mixed,2.80,5.7,124.5,21.4,NO,,,,,C
144531,BASELINE,2,,SKIPPED,SKIPPED,SKIPPED,2.80,,127.6,21.8,NO,,,,,C
144532,BASELINE,1,12.6,MALE,NO,ASIAN,3.50,12.6,162.0,47.0,NO,,,,,C
144533,BASELINE,1,7.1,MALE,YES,WHITE,2.99,7.1,129.0,28.7,YES,2.16,7.1,129.0,28.7,C
144534,BASELINE,1,12.5,FEMALE,NO,WHITE,3.50,12.3,174.0,45.0,YES,2.20,12.3,174.0,45.0,B
144535,BASELINE,1,16.7,MALE,NO,WHITE,4.20,16.7,194.7,70.7,NO,,,,,B
144536,BASELINE,1,16.2,FEMALE,NO,UNKNOWN,3.48,15.6,179.0,60.0,NO,,,,,C
144537,BASELINE,1,19.6,MALE,NO,Other/mixed,4.20,19.1,173.0,50.5,NO,,,,,C
144538,BASELINE,1,13.9,MALE,NO,WHITE,4.06,13.6,190.9,78.8,NO,,,,,C
144539,BASELINE,1,3.5,MALE,UNKNOWN,UNKNOWN,2.90,3.5,106.6,15.8,NO,,,,,C
144540,BASELINE,1,15.6,MALE,NO,WHITE,4.90,15.6,196.6,85.1,YES,3.21,15.6,196.6,85.1,C
144541,BASELINE,1,23.5,FEMALE,NO,WHITE,3.80,23.1,185.4,60.9,NO,,,,,B
144542,BASELINE,1,16,MALE,NO,BLACK OR AFRICAN AMERICAN,3.62,16,186.0,66.1,YES,2.37,16,186.0,66.1,C
144543,BASELINE,1,17,MALE,NO,WHITE,4.32,16.6,193.0,71.8,NO,,,,,C
144544,BASELINE,1,17.9,MALE,NO,WHITE,3.82,17.9,191.0,62.2,YES,3.24,17.9,191.0,62.2,C
144545,BASELINE,1,1.3,FEMALE,NO,WHITE,3.07,1.1,,,NO,,,,,C
144545,BASELINE,2,,SKIPPED,SKIPPED,SKIPPED,3.24,,,,YES,2.40,,166.0,45.0,C
144546,BASELINE,1,11.7,FEMALE,NO,WHITE,2.60,11.7,157.0,49.0,NO,,,,,C
144547,BASELINE,1,24.7,MALE,NO,WHITE,5.43,24.7,179.0,62.9,YES,2.33,24.7,179.0,62.9,B
144548,BASELINE,1,14.2,MALE,NO,WHITE,3.51,14.2,180.0,53.4,YES,2.91,14.2,180.0,53.4,A
144549,BASELINE,1,5.1,FEMALE,YES,WHITE,2.42,5.1,115.0,19.2,NO,,,,,C
144550,BASELINE,1,13,MALE,UNKNOWN,UNKNOWN,3.67,12.6,180.0,67.3,NO,,,,,C
144551,BASELINE,1,8.7,FEMALE,UNKNOWN,WHITE,2.74,8.7,150.0,28.6,YES,2.00,8.7,150.0,28.6,C
144552,BASELINE,1,19,MALE,NO,BLACK OR AFRICAN AMERICAN,4.26,18.1,194.4,66.4,NO,,,,,C
144553,BASELINE,1,4.4,MALE,NO,WHITE,2.45,4.1,114.3,18.6,NO,,,,,B
144554,BASELINE,1,14.9,FEMALE,NO,WHITE,4.20,14.4,180.0,73.3,NO,,,,,C
144555,BASELINE,1,3.9,FEMALE,NO,WHITE,2.60,3.8,111.8,19.1,NO,,,,,C
144556,BASELINE,1,9.2,MALE,NO,WHITE,4.26,8.9,155.0,40.5,NO,,,,,A
144557,BASELINE,1,24.2,MALE,NO,WHITE,3.80,24,189.0,82.0,NO,,,,,A
144558,BASELINE,1,2.2,MALE,NO,WHITE,2.30,2.2,97.0,14.1,NO,,,,,C
144559,BASELINE,1,1.6,FEMALE,NO,WHITE,1.91,1.6,83.5,9.4,YES,1.66,1.6,83.5,9.4,C
144560,BASELINE,1,17.5,FEMALE,NO,WHITE,2.50,17.5,183.0,74.0,NO,,,,,C
144561,BASELINE,1,14.8,MALE,NO,WHITE,4.00,14.7,193.0,81.4,YES,2.50,14.7,193.0,81.4,C
144562,BASELINE,1,23,MALE,NO,WHITE,4.57,23,199.5,90.7,NO,,,,,A
144563,BASELINE,1,18.8,FEMALE,NO,WHITE,3.40,18.8,179.1,57.6,NO,,,,,C
144564,BASELINE,1,13.1,MALE,NO,WHITE,3.00,13.1,162.0,33.4,YES,2.13,13.1,162.0,33.4,B
144564,BASELINE,2,,SKIPPED,SKIPPED,SKIPPED,3.11,,173.0,39.7,YES,2.63,,173.0,39.7,C
144565,BASELINE,1,17.2,MALE,NO,WHITE,3.20,17.1,193.0,68.2,NO,,,,,C
144566,BASELINE,1,5.5,MALE,NO,WHITE,2.69,5.5,126.6,28.5,NO,,,,,B
144567,BASELINE,1,19.8,MALE,NO,WHITE,4.70,19.7,194.0,82.5,NO,,,,,B
144568,BASELINE,1,13.7,MALE,NO,WHITE,3.80,13.4,172.0,44.0,NO,,,,,C
144569,BASELINE,1,1.3,MALE,NO,WHITE,1.91,1.3,79.0,10.1,YES,1.46,1.3,79.0,10.1,C
144570,BASELINE,1,16.5,MALE,NO,WHITE,5.00,15.8,198.4,74.1,NO,,,,,B
144571,BASELINE,1,5.2,MALE,NO,WHITE,4.10,5.1,94.0,10.5,NO,,,,,B
144572,BASELINE,1,11.2,FEMALE,NO,WHITE,3.40,10.9,158.0,35.4,NO,,,,,B
144573,BASELINE,1,6.9,MALE,NO,WHITE,2.77,6.9,126.0,26.4,NO,,,,,C
144574,BASELINE,1,17.5,FEMALE,NO,WHITE,4.04,17.4,185.4,60.3,NO,,,,,C
144575,BASELINE,1,2.3,MALE,NO,Other/mixed,2.12,1.9,97.0,14.6,NO,,,,,B
144575,BASELINE,2,,SKIPPED,SKIPPED,SKIPPED,2.17,,102.2,12.5,YES,1.74,,102.2,12.5,B
144575,BASELINE,3,,SKIPPED,SKIPPED,SKIPPED,2.17,,102.2,12.5,YES,1.74,,102.2,12.5,C
144576,BASELINE,1,4,FEMALE,NO,WHITE,2.40,4,110.5,19.1,NO,,,,,C
144577,BASELINE,1,7.9,MALE,NO,WHITE,2.40,6.9,126.0,21.5,NO,,,,,C
144578,BASELINE,1,18.1,MALE,NO,BLACK OR AFRICAN AMERICAN,3.71,18.1,180.5,66.4,YES,2.49,18.1,180.5,66.4,C
144579,BASELINE,1,11.3,MALE,NO,WHITE,3.37,10.8,146.0,39.0,YES,2.56,10.8,146.0,39.0,B
144580,BASELINE,1,25.5,MALE,NO,WHITE,4.60,25.3,190.0,70.0,NO,,,,,C
144581,BASELINE,1,13.3,MALE,NO,WHITE,4.16,13.3,172.5,45.3,NO,,,,,B
144582,BASELINE,1,10.6,MALE,NO,WHITE,3.30,10.6,144.0,27.7,NO,,,,,A
144583,BASELINE,1,11.6,MALE,NO,WHITE,3.40,11.6,165.0,51.0,YES,2.70,11.6,165.0,51.0,C
144584,BASELINE,1,15.2,MALE,NO,WHITE,4.20,15.2,188.0,66.8,NO,,,,,B
144585,BASELINE,1,16.9,MALE,UNKNOWN,UNKNOWN,3.51,16.9,189.4,60.4,NO,,,,,C
144586,BASELINE,1,6.3,FEMALE,UNKNOWN,UNKNOWN,2.50,6.2,131.0,18.4,NO,,,,,C
144587,BASELINE,1,22,MALE,NO,WHITE,3.80,21.8,194.0,68.3,NO,,,,,B
144587,BASELINE,2,,SKIPPED,SKIPPED,SKIPPED,4.00,,196.5,74.0,NO,,,,,B
144588,BASELINE,1,12.1,FEMALE,NO,WHITE,3.50,12,162.0,31.3,NO,,,,,C
144589,BASELINE,1,5.6,FEMALE,NO,WHITE,2.97,5.2,121.0,17.5,NO,,,,,B
144590,BASELINE,1,11.9,FEMALE,NO,WHITE,3.35,11.9,172.0,50.4,YES,3.50,11.9,172.0,50.4,B
144591,BASELINE,1,15.5,MALE,NO,Other/mixed,4.18,15.5,199.8,85.4,NO,,,,,B
144592,BASELINE,1,11.7,MALE,NO,WHITE,2.70,11.7,161.0,34.5,NO,,,,,B
144593,BASELINE,1,14.3,FEMALE,NO,WHITE,3.83,14.1,169.1,49.1,NO,,,,,B
144594,BASELINE,1,11.4,FEMALE,NO,WHITE,3.40,11.2,156.0,32.6,NO,,,,,B
144595,BASELINE,1,17.9,MALE,NO,WHITE,4.30,17.9,203.0,75.0,NO,,,,,C
144596,BASELINE,1,17.5,FEMALE,UNKNOWN,WHITE,3.50,17.3,173.0,62.4,NO,,,,,B
144596,BASELINE,2,,SKIPPED,SKIPPED,SKIPPED,3.50,,172.4,60.0,NO,,,,,B
144597,BASELINE,1,1.2,FEMALE,YES,WHITE,2.00,1.2,83.0,9.9,YES,1.10,1.2,83.0,9.9,C
144598,BASELINE,1,18.3,FEMALE,NO,WHITE,3.80,18,166.3,52.3,NO,,,,,C
144599,BASELINE,1,22.2,FEMALE,YES,WHITE,4.11,22.1,169.5,47.5,NO,,,,,B
144600,BASELINE,1,6.4,MALE,NO,WHITE,3.81,6,131.0,32.2,NO,,,,,C
144601,BASELINE,1,23.7,MALE,NO,WHITE,3.80,23.3,178.5,78.1,NO,,,,,C
144602,BASELINE,1,16.4,FEMALE,NO,WHITE,3.52,16.4,169.0,65.2,YES,2.62,16.4,169.0,65.2,C
144603,BASELINE,1,14.1,MALE,NO,ASIAN,5.80,14.1,194.0,85.5,YES,2.99,14.1,194.0,85.5,C
144604,BASELINE,1,7.6,MALE,YES,UNKNOWN,2.60,7.6,124.0,25.4,NO,,,,,C
144605,BASELINE,1,0.6,FEMALE,NO,WHITE,1.68,0.5,67.8,6.7,NO,,,,,C
144606,BASELINE,1,9.7,MALE,NO,WHITE,3.40,9.6,148.0,32.0,NO,,,,,C
144607,BASELINE,1,22.8,FEMALE,NO,WHITE,4.80,22.8,165.0,62.8,YES,2.77,22.8,165.0,62.8,A
144608,BASELINE,1,11,MALE,YES,WHITE,3.04,10.8,160.0,37.5,YES,1.93,10.8,160.0,37.5,C
144608,BASELINE,2,,SKIPPED,SKIPPED,SKIPPED,3.04,,160.0,37.5,YES,1.93,,160.0,37.5,C
144609,BASELINE,1,22,MALE,NO,WHITE,4.10,22,192.0,68.7,NO,,,,,C
144610,BASELINE,1,12.3,FEMALE,NO,WHITE,3.08,12.3,161.0,39.5,YES,2.39,12.3,161.0,39.5,C
144611,BASELINE,1,21.3,MALE,NO,WHITE,4.25,21.3,178.5,53.3,NO,,,,,C
144612,BASELINE,1,5.9,FEMALE,NO,WHITE,2.87,5.8,129.0,24.7,YES,2.16,5.8,129.0,24.7,A
144613,BASELINE,1,9.8,MALE,NO,ASIAN,2.90,8.8,140.0,23.8,NO,,,,,C
144614,BASELINE,1,19.6,FEMALE,NO,WHITE,3.61,19.6,170.0,65.0,YES,2.94,19.6,170.0,65.0,C
144614,BASELINE,2,,SKIPPED,SKIPPED,SKIPPED,3.96,,171.0,65.0,YES,2.91,,171.0,65.0,C
144615,BASELINE,1,7.7,MALE,NO,WHITE,4.00,7.6,138.5,25.5,NO,,,,,C
144616,BASELINE,1,8.1,FEMALE,UNKNOWN,WHITE,2.68,7.2,122.6,19.4,NO,,,,,A
144616,BASELINE,2,,SKIPPED,SKIPPED,SKIPPED,2.82,,135.0,23.2,NO,,,,,C
144616,BASELINE,3,,SKIPPED,SKIPPED,SKIPPED,2.85,,141.1,25.2,NO,,,,,C
144617,BASELINE,1,16.9,MALE,YES,WHITE,3.40,16.8,181.5,82.0,NO,,,,,B
144618,BASELINE,1,13.5,FEMALE,NO,BLACK OR AFRICAN AMERICAN,4.40,12.9,182.0,49.3,YES,2.70,12.9,182.0,49.3,B
144619,BASELINE,1,18.1,FEMALE,NO,BLACK OR AFRICAN AMERICAN,3.98,18,170.0,68.0,NO,,,,,B
144620,BASELINE,1,11.9,FEMALE,NO,WHITE,3.50,11.7,171.5,49.5,NO,,,,,C
144621,BASELINE,1,8.2,MALE,NO,BLACK OR AFRICAN AMERICAN,2.70,7.9,138.2,29.5,YES,1.87,7.9,138.2,29.5,B
144621,BASELINE,2,,SKIPPED,SKIPPED,SKIPPED,3.00,,157.0,38.2,NO,,,,,C
144622,BASELINE,1,1.3,MALE,YES,WHITE,2.05,1.3,82.5,9.6,YES,1.23,1.3,82.5,9.6,C
144623,BASELINE,1,4.2,MALE,NO,WHITE,2.50,4.1,119.4,21.0,NO,,,,,B
144624,BASELINE,1,9.8,MALE,NO,WHITE,4.20,9.8,137.0,25.0,NO,,,,,C
144625,BASELINE,1,4.8,MALE,YES,WHITE,2.38,4.8,112.0,17.2,NO,,,,,C
144626,BASELINE,1,0.5,MALE,NO,WHITE,2.00,0.5,69.0,8.8,NO,,,,,C
144627,BASELINE,1,21,FEMALE,NO,WHITE,4.00,21,185.4,57.1,NO,,,,,B
144627,BASELINE,2,,SKIPPED,SKIPPED,SKIPPED,4.24,,186.0,56.9,NO,,,,,C
144628,BASELINE,1,12.1,MALE,NO,WHITE,4.20,12,170.0,54.4,NO,,,,,C
144629,BASELINE,1,20.3,FEMALE,NO,WHITE,3.40,20.3,174.0,54.0,NO,,,,,B
144630,BASELINE,1,14.3,FEMALE,NO,WHITE,3.87,14.3,174.0,60.1,NO,,,,,C
144631,BASELINE,1,3.4,MALE,NO,WHITE,2.26,3.4,104.0,17.3,NO,,,,,C
144632,BASELINE,1,4.5,MALE,NO,WHITE,2.42,4.5,112.4,19.7,YES,2.20,4.5,112.4,19.7,C
144633,BASELINE,1,9,MALE,NO,WHITE,3.15,9,137.8,32.0,NO,,,,,C
144634,BASELINE,1,18.4,MALE,NO,WHITE,4.11,17.8,199.9,92.0,NO,,,,,B
144635,BASELINE,1,11.3,MALE,NO,WHITE,3.30,10.4,156.0,36.7,NO,,,,,A
144636,BASELINE,1,14,MALE,NO,WHITE,3.28,13.9,177.0,44.1,NO,,,,,C
144637,BASELINE,1,24.3,MALE,NO,BLACK OR AFRICAN AMERICAN,3.90,24.2,182.0,89.0,NO,,,,,C
144637,BASELINE,2,,SKIPPED,SKIPPED,SKIPPED,4.02,,182.0,82.0,YES,3.28,,182.0,82.0,C
144638,BASELINE,1,14.1,FEMALE,NO,WHITE,3.77,13.6,185.8,55.7,NO,,,,,A
144638,BASELINE,2,,SKIPPED,SKIPPED,SKIPPED,3.40,,188.7,59.7,YES,3.10,,188.7,59.7,A
144638,BASELINE,3,,SKIPPED,SKIPPED,SKIPPED,3.84,,188.5,62.2,YES,2.99,,188.5,62.2,C
144639,BASELINE,1,6.2,MALE,NO,WHITE,2.70,6.1,135.0,28.0,NO,,,,,C
144639,BASELINE,2,,SKIPPED,SKIPPED,SKIPPED,2.80,,139.7,32.6,NO,,,,,C
144639,BASELINE,3,,SKIPPED,SKIPPED,SKIPPED,2.90,,145.4,37.6,YES,2.80,,145.4,37.6,C
144640,BASELINE,1,2.1,MALE,NO,WHITE,2.60,2.1,90.0,12.2,NO,,,,,B
144641,BASELINE,1,24.7,FEMALE,NO,WHITE,4.40,24.1,176.0,55.0,NO,,,,,C
144642,BASELINE,1,8.5,MALE,NO,WHITE,2.98,8.4,128.2,29.6,NO,,,,,C
144643,BASELINE,1,19.3,MALE,NO,ASIAN,3.80,18.3,189.0,55.7,NO,,,,,C
144644,BASELINE,1,15.3,MALE,NO,WHITE,3.00,15.1,184.3,93.6,NO,,,,,B
144645,BASELINE,1,7.8,FEMALE,NO,WHITE,3.60,7.8,147.0,48.0,YES,0.42,7.8,147.0,48.0,B
144646,BASELINE,1,15.3,FEMALE,NO,WHITE,3.80,14.8,187.0,54.7,NO,,,,,B
144647,BASELINE,1,18.4,MALE,NO,WHITE,3.94,18.4,191.0,82.0,YES,2.49,18.4,191.0,82.0,B
144648,BASELINE,1,18.7,FEMALE,NO,WHITE,3.65,17.7,176.0,63.5,NO,,,,,B
144648,BASELINE,2,,SKIPPED,SKIPPED,SKIPPED,3.46,,176.0,65.7,NO,,,,,C
144648,BASELINE,3,,SKIPPED,SKIPPED,SKIPPED,3.64,,175.0,61.2,NO,,,,,C
144649,BASELINE,1,1.4,MALE,NO,WHITE,2.75,1.4,83.0,9.7,NO,,,,,B
144650,BASELINE,1,25.1,FEMALE,NO,WHITE,4.40,25.1,180.0,64.0,NO,,,,,C
144651,BASELINE,1,25,FEMALE,UNKNOWN,WHITE,3.50,24.5,165.0,60.7,NO,,,,,B
144652,BASELINE,1,23.1,FEMALE,NO,WHITE,4.30,23,181.0,53.6,NO,,,,,B
144653,BASELINE,1,2.4,MALE,NO,WHITE,2.24,2.4,93.8,13.7,NO,,,,,A
144654,BASELINE,1,6.2,FEMALE,NO,WHITE,2.49,6.2,117.0,16.6,YES,1.89,6.2,117.0,16.6,C
144655,BASELINE,1,2.2,MALE,NO,WHITE,2.20,2.2,95.3,14.1,NO,,,,,C
144656,BASELINE,1,14.8,MALE,NO,WHITE,3.80,14.4,189.0,53.2,NO,,,,,C
144657,BASELINE,1,24.2,MALE,NO,WHITE,4.90,24,176.0,80.4,YES,2.70,24,176.0,80.4,C
144658,BASELINE,1,19.3,FEMALE,NO,WHITE,3.62,19.3,180.8,53.3,NO,,,,,C
144659,BASELINE,1,0.6,MALE,NO,WHITE,3.81,,109.0,14.3,YES,1.59,,109.0,14.3,B
144660,BASELINE,1,1.5,MALE,YES,WHITE,2.10,1.5,87.0,11.0,NO,,,,,C
144661,BASELINE,1,14.8,MALE,UNKNOWN,WHITE,3.31,14.3,175.0,51.8,NO,,,,,B
144661,BASELINE,2,,SKIPPED,SKIPPED,SKIPPED,3.67,,178.0,59.6,NO,,,,,B
144662,BASELINE,1,22.6,FEMALE,NO,WHITE,3.60,22.6,160.6,50.0,YES,2.40,22.6,160.6,50.0,B
144663,BASELINE,1,9.5,MALE,NO,WHITE,3.16,9.5,149.0,29.8,NO,,,,,A
144664,BASELINE,1,4,FEMALE,NO,WHITE,2.39,4,107.0,18.4,YES,1.48,4,107.0,18.4,A
144665,BASELINE,1,24.8,MALE,NO,WHITE,4.30,24.5,195.0,80.0,NO,,,,,C
144666,BASELINE,1,2.5,FEMALE,UNKNOWN,WHITE,2.20,2.5,94.0,12.1,YES,1.53,2.5,94.0,12.1,C
144667,BASELINE,1,16.6,FEMALE,NO,WHITE,3.36,15.7,180.0,54.5,NO,,,,,C
144668,BASELINE,1,16,FEMALE,NO,ASIAN,3.10,16,157.2,56.1,NO,,,,,B
144669,BASELINE,1,13.5,FEMALE,NO,WHITE,4.20,13.4,172.8,77.3,NO,,,,,C
144670,BASELINE,1,6.7,FEMALE,NO,BLACK OR AFRICAN AMERICAN,2.97,6.4,136.5,33.6,NO,,,,,B
144671,BASELINE,1,11.6,FEMALE,UNKNOWN,WHITE,2.70,10.7,150.0,37.0,NO,,,,,C
144672,BASELINE,1,17.4,FEMALE,NO,WHITE,3.80,17.1,177.8,44.5,NO,,,,,B
144673,BASELINE,1,15,FEMALE,NO,WHITE,4.20,14.9,170.0,76.0,NO,,,,,C
144673,BASELINE,2,,SKIPPED,SKIPPED,SKIPPED,4.30,,171.0,68.2,NO,,,,,C
144674,BASELINE,1,16.7,MALE,NO,WHITE,3.90,16.6,185.5,52.9,NO,,,,,C
144675,BASELINE,1,11.8,FEMALE,NO,Other/mixed,4.10,11.8,170.0,53.4,NO,,,,,B
144676,BASELINE,1,18.8,FEMALE,NO,BLACK OR AFRICAN AMERICAN,3.54,18.8,172.0,54.1,NO,,,,,C
144677,BASELINE,1,14.1,MALE,NO,BLACK OR AFRICAN AMERICAN,4.48,14,183.0,66.7,NO,,,,,C
144678,BASELINE,1,22.5,MALE,NO,WHITE,4.30,22.5,191.0,68.9,NO,,,,,B
144679,BASELINE,1,13.4,FEMALE,NO,ASIAN,3.00,12.8,162.0,45.5,NO,,,,,B
144680,BASELINE,1,18.3,FEMALE,NO,WHITE,3.68,18,165.0,66.0,NO,,,,,C
144681,BASELINE,1,5.5,MALE,YES,WHITE,2.39,4.7,111.0,19.4,NO,,,,,C
144682,BASELINE,1,9.4,FEMALE,NO,WHITE,3.10,8.7,146.5,30.3,NO,,,,,A
144683,BASELINE,1,17.2,MALE,NO,ASIAN,3.50,17,186.0,60.0,NO,,,,,B
144683,BASELINE,2,,SKIPPED,SKIPPED,SKIPPED,3.68,,187.0,66.8,YES,2.61,,187.0,66.8,C
144684,BASELINE,1,7.6,MALE,NO,WHITE,4.10,7.6,148.0,30.5,YES,2.50,7.6,148.0,30.5,B
144685,BASELINE,1,18.3,FEMALE,NO,WHITE,4.01,18,177.0,52.8,NO,,,,,B
144686,BASELINE,1,0.8,FEMALE,UNKNOWN,UNKNOWN,1.70,0.8,71.1,8.0,NO,,,,,C
144687,BASELINE,1,17.3,MALE,NO,WHITE,4.00,17.2,187.0,58.5,NO,,,,,C
144688,BASELINE,1,13.1,MALE,NO,WHITE,3.30,13.1,162.0,37.0,YES,1.64,13.1,162.0,37.0,B
144688,BASELINE,2,,SKIPPED,SKIPPED,SKIPPED,3.30,,170.0,46.0,NO,,,,,C
144689,BASELINE,1,2.8,MALE,NO,WHITE,2.30,2.7,106.0,16.0,NO,,,,,C
144690,BASELINE,1,6,MALE,NO,WHITE,2.79,6,123.7,23.6,NO,,,,,C
144691,BASELINE,1,12.4,MALE,NO,WHITE,3.80,12.4,177.2,72.0,NO,,,,,B
144692,BASELINE,1,10.2,FEMALE,YES,UNKNOWN,3.50,10,151.2,29.4,YES,2.20,10,151.2,29.4,C
144693,BASELINE,1,8.6,MALE,UNKNOWN,UNKNOWN,2.93,8.5,141.0,32.0,YES,2.11,8.5,141.0,32.0,C
144694,BASELINE,1,6,MALE,NO,UNKNOWN,3.44,5.6,124.5,20.9,NO,,,,,B
144694,BASELINE,2,,SKIPPED,SKIPPED,SKIPPED,3.10,,130.9,22.8,NO,,,,,C
144695,BASELINE,1,16.9,MALE,NO,WHITE,5.20,16.5,,,NO,,,,,B
144696,BASELINE,1,13.9,MALE,NO,WHITE,3.62,13.8,182.3,47.9,NO,,,,,A
144697,BASELINE,1,16.6,MALE,NO,BLACK OR AFRICAN AMERICAN,4.00,16.6,176.5,50.3,NO,,,,,C
144698,BASELINE,1,14.1,MALE,NO,WHITE,3.30,13.9,180.0,66.8,NO,,,,,B
144699,BASELINE,1,13.8,MALE,NO,WHITE,3.83,13.8,200.8,66.4,NO,,,,,C
144700,BASELINE,1,14.4,MALE,NO,WHITE,3.80,14.1,168.9,65.4,NO,,,,,C
144701,BASELINE,1,19.4,FEMALE,NO,WHITE,4.13,19.3,175.0,70.0,YES,2.83,19.3,175.0,70.0,B
144702,BASELINE,1,17.5,MALE,NO,WHITE,3.80,17.2,180.0,64.0,NO,,,,,C
144703,BASELINE,1,18.2,FEMALE,NO,WHITE,4.40,18.2,189.0,77.0,NO,,,,,C
144704,BASELINE,1,17.2,MALE,NO,WHITE,4.20,17.2,195.6,80.9,NO,,,,,B
144705,BASELINE,1,15.1,MALE,NO,WHITE,3.95,15.1,183.5,78.2,YES,2.69,15.1,183.5,78.2,C
144706,BASELINE,1,10.5,MALE,NO,WHITE,2.90,10.1,164.5,36.5,NO,,,,,C
144707,BASELINE,1,18.5,FEMALE,YES,WHITE,4.30,18.4,173.4,58.7,NO,,,,,C
144708,BASELINE,1,12.1,MALE,NO,WHITE,3.35,12.1,161.1,37.6,NO,,,,,C
144709,BASELINE,1,5.6,FEMALE,YES,WHITE,3.08,5.3,125.1,25.4,YES,2.29,5.3,125.1,25.4,B
144710,BASELINE,1,22.2,FEMALE,NO,WHITE,4.80,22.2,172.5,63.5,NO,,,,,B
144711,BASELINE,1,12.1,FEMALE,NO,WHITE,3.31,11.3,157.0,37.9,YES,2.41,11.3,157.0,37.9,B
144712,BASELINE,1,19.1,MALE,NO,WHITE,3.76,19.1,178.3,67.9,NO,,,,,C
144713,BASELINE,1,17.1,FEMALE,NO,WHITE,3.70,17.1,173.0,74.0,NO,,,,,C
144714,BASELINE,1,9.5,FEMALE,YES,WHITE,3.25,9.5,154.1,34.9,NO,,,,,C
144715,BASELINE,1,11.4,FEMALE,NO,WHITE,3.70,11.4,156.0,39.3,YES,2.33,11.4,156.0,39.3,C
144716,BASELINE,1,18.7,MALE,NO,WHITE,3.77,18.6,189.0,61.7,YES,2.98,18.6,189.0,61.7,C
144717,BASELINE,1,24,FEMALE,NO,WHITE,4.01,24,173.9,55.9,NO,,,,,C
144718,BASELINE,1,16.3,FEMALE,NO,WHITE,3.67,15.7,177.9,52.8,NO,,,,,B
144719,BASELINE,1,20.1,FEMALE,NO,WHITE,4.36,19.9,179.1,84.5,NO,,,,,B
144720,BASELINE,1,15.9,MALE,NO,WHITE,4.20,15.7,172.0,62.0,NO,,,,,B
144721,BASELINE,1,14.9,FEMALE,NO,WHITE,5.01,14.9,168.0,40.0,NO,,,,,C
144722,BASELINE,1,20.3,MALE,NO,WHITE,3.72,20,196.5,69.8,NO,,,,,B
144723,BASELINE,1,14,FEMALE,NO,WHITE,3.83,13.9,185.5,76.0,NO,,,,,A
144724,BASELINE,1,2.3,MALE,NO,WHITE,2.20,2.1,97.0,15.0,NO,,,,,C
144725,BASELINE,1,4.9,FEMALE,NO,WHITE,1.70,4.9,106.0,15.8,NO,,,,,C
144726,BASELINE,1,12.7,MALE,NO,ASIAN,2.93,12.7,148.0,30.4,NO,,,,,C
144727,BASELINE,1,22.4,MALE,NO,BLACK OR AFRICAN AMERICAN,4.19,22.4,185.0,89.0,YES,3.63,22.4,185.0,89.0,B
144728,BASELINE,1,5.8,FEMALE,NO,WHITE,2.54,5.8,121.5,21.5,NO,,,,,C
144729,BASELINE,1,4.9,MALE,YES,UNKNOWN,2.32,4.1,109.0,16.5,NO,,,,,A
144729,BASELINE,2,,SKIPPED,SKIPPED,SKIPPED,2.59,,125.6,22.6,NO,,,,,C
144729,BASELINE,3,,SKIPPED,SKIPPED,SKIPPED,2.67,,132.0,28.5,NO,,,,,C
144730,BASELINE,1,21,MALE,UNKNOWN,WHITE,3.97,20.9,187.0,69.1,NO,,,,,A
144731,BASELINE,1,3.1,FEMALE,NO,WHITE,2.36,3.1,101.5,14.6,NO,,,,,B
144732,BASELINE,1,5.9,MALE,NO,WHITE,2.80,5.8,124.5,24.4,NO,,,,,C
144733,BASELINE,1,20.5,FEMALE,NO,WHITE,3.90,20.5,156.2,58.2,NO,,,,,B
144734,BASELINE,1,6.2,MALE,NO,WHITE,3.00,6,126.2,21.2,NO,,,,,B
144735,BASELINE,1,1.5,MALE,UNKNOWN,WHITE,1.80,1.1,78.5,9.5,NO,,,,,C
144736,BASELINE,1,14.1,MALE,NO,WHITE,3.94,14.1,180.0,56.0,YES,2.25,14.1,180.0,56.0,B
144737,BASELINE,1,15.9,MALE,NO,WHITE,3.00,15.9,169.0,72.3,NO,,,,,C
144738,BASELINE,1,0.5,FEMALE,NO,WHITE,1.76,0.5,68.9,7.9,YES,1.39,0.5,68.9,7.9,C
144739,BASELINE,1,9.4,MALE,NO,WHITE,3.30,9.4,142.5,43.8,NO,,,,,C
144740,BASELINE,1,16.4,MALE,NO,WHITE,3.80,16.4,191.5,62.6,NO,,,,,B
144741,BASELINE,1,9.3,MALE,YES,WHITE,3.19,9.3,155.1,32.3,NO,,,,,B
144742,BASELINE,1,14.2,MALE,NO,WHITE,3.80,14,173.0,50.5,NO,,,,,C
144743,BASELINE,1,17.2,MALE,YES,WHITE,4.60,16.5,178.5,53.8,YES,1.66,16.5,178.5,53.8,C
144744,BASELINE,1,6.4,MALE,NO,WHITE,2.69,6.4,125.0,25.6,YES,1.94,6.4,125.0,25.6,B
144745,BASELINE,1,20.7,FEMALE,NO,WHITE,3.70,20.3,170.3,56.0,YES,2.90,20.3,170.3,56.0,C
144746,BASELINE,1,4.1,MALE,NO,WHITE,3.20,4.1,112.0,16.2,NO,,,,,B
144747,BASELINE,1,0.7,FEMALE,NO,WHITE,2.16,0,72.0,6.0,NO,,,,,C
144748,BASELINE,1,4.1,FEMALE,NO,WHITE,2.80,4.1,121.0,23.6,NO,,,,,C
144749,BASELINE,1,21.2,MALE,NO,BLACK OR AFRICAN AMERICAN,3.72,21.2,192.5,65.5,YES,2.74,21.2,192.5,65.5,B
144750,BASELINE,1,10.7,FEMALE,NO,WHITE,3.67,10.7,175.0,59.4,YES,1.98,10.7,175.0,59.4,B
144751,BASELINE,1,5.1,MALE,NO,ASIAN,2.65,5.1,121.5,26.4,YES,2.03,5.1,121.5,26.4,C
144752,BASELINE,1,3.2,MALE,NO,WHITE,2.39,3.1,102.0,13.5,YES,1.69,3.1,102.0,13.5,C
144753,BASELINE,1,10.4,MALE,YES,WHITE,2.84,10.2,155.0,34.7,NO,,,,,C
144754,BASELINE,1,8.6,MALE,UNKNOWN,UNKNOWN,2.93,8.4,145.0,31.5,YES,2.42,8.4,145.0,31.5,C
144755,BASELINE,1,5.1,FEMALE,YES,WHITE,2.61,5.1,124.0,24.4,YES,2.06,5.1,124.0,24.4,C
144756,BASELINE,1,19,FEMALE,UNKNOWN,WHITE,3.60,19,170.0,61.0,NO,,,,,C
144757,BASELINE,1,11.1,MALE,YES,WHITE,2.89,10.4,147.0,36.7,NO,,,,,C
144758,BASELINE,1,2.4,FEMALE,NO,WHITE,2.20,2.3,96.0,15.0,NO,,,,,C
144759,BASELINE,1,16.6,FEMALE,NO,WHITE,3.21,16.6,162.5,46.4,NO,,,,,C
144760,BASELINE,1,14.3,MALE,NO,WHITE,3.80,14,184.0,57.0,NO,,,,,B
144761,BASELINE,1,7.3,MALE,NO,WHITE,2.80,6.7,138.0,28.0,NO,,,,,C
144762,BASELINE,1,22.4,MALE,NO,WHITE,3.20,22.4,192.5,74.1,NO,,,,,B
144763,BASELINE,1,8.6,FEMALE,NO,WHITE,3.94,8.6,148.0,29.6,YES,1.94,8.6,148.0,29.6,B
144764,BASELINE,1,8.6,MALE,NO,WHITE,3.00,8.4,138.0,27.0,NO,,,,,C
144765,BASELINE,1,11,MALE,NO,WHITE,3.70,10,188.0,68.2,NO,,,,,B
144766,BASELINE,1,12.2,MALE,NO,WHITE,3.10,12.1,160.8,34.6,NO,,,,,C
144767,BASELINE,1,15.8,MALE,NO,WHITE,4.00,15.8,198.0,71.6,YES,2.56,15.8,198.0,71.6,C
144768,BASELINE,1,3.3,FEMALE,NO,WHITE,2.54,3.2,109.0,16.8,NO,,,,,C
144769,BASELINE,1,11.9,MALE,YES,WHITE,3.50,11.4,180.0,48.5,NO,,,,,B
144770,BASELINE,1,15.7,FEMALE,NO,UNKNOWN,2.94,15,178.0,52.8,NO,,,,,C
144771,BASELINE,1,4.3,MALE,NO,WHITE,2.82,4,122.0,23.0,YES,1.87,4,122.0,23.0,B
144772,BASELINE,1,15,FEMALE,NO,WHITE,3.73,15,177.0,60.1,YES,2.34,15,177.0,60.1,C
144773,BASELINE,1,18,MALE,NO,WHITE,3.99,17.7,182.0,86.5,NO,,,,,B
144774,BASELINE,1,24.8,FEMALE,YES,WHITE,3.75,24.6,161.0,71.0,NO,,,,,B
144775,BASELINE,1,3.2,FEMALE,YES,WHITE,2.76,3.2,107.9,20.3,NO,,,,,B
144776,BASELINE,1,24.8,MALE,NO,WHITE,4.10,23.9,183.0,63.6,NO,,,,,B
144777,BASELINE,1,14,FEMALE,NO,ASIAN,4.03,13.4,171.6,60.0,NO,,,,,A
144778,BASELINE,1,7.1,FEMALE,UNKNOWN,UNKNOWN,2.83,7,134.0,28.4,NO,,,,,B
144778,BASELINE,2,,SKIPPED,SKIPPED,SKIPPED,2.86,,152.4,40.8,NO,,,,,C
144778,BASELINE,3,,SKIPPED,SKIPPED,SKIPPED,3.20,,160.0,45.3,NO,,,,,C
144779,BASELINE,1,16.1,MALE,NO,WHITE,4.20,16,192.0,68.1,NO,,,,,B
144780,BASELINE,1,8.2,MALE,YES,WHITE,3.48,7.9,137.0,29.0,NO,,,,,B
144781,BASELINE,1,17.7,FEMALE,UNKNOWN,UNKNOWN,4.90,16.7,181.0,71.0,NO,,,,,B
144782,BASELINE,1,3.7,FEMALE,NO,Other/mixed,2.27,3.7,104.0,14.7,YES,1.83,3.7,104.0,14.7,B
144782,BASELINE,2,,SKIPPED,SKIPPED,SKIPPED,2.59,,127.5,23.2,NO,,,,,C
144783,BASELINE,1,23.9,MALE,NO,WHITE,4.30,23.9,188.0,65.9,NO,,,,,C
144784,BASELINE,1,6,MALE,UNKNOWN,UNKNOWN,2.50,5.7,124.3,22.7,NO,,,,,B
144785,BASELINE,1,18.8,FEMALE,NO,WHITE,3.90,18.7,178.0,60.4,NO,,,,,C
144786,BASELINE,1,4.8,FEMALE,NO,WHITE,2.39,4.4,109.0,18.0,YES,2.18,4.4,109.0,18.0,B
144787,BASELINE,1,4.5,MALE,NO,ASIAN,2.45,4.5,118.0,23.5,NO,,,,,B
144787,BASELINE,2,,SKIPPED,SKIPPED,SKIPPED,2.70,,124.5,26.0,NO,,,,,C
144788,BASELINE,1,8.9,FEMALE,NO,WHITE,2.50,8.5,136.0,25.5,NO,,,,,B
144788,BASELINE,2,,SKIPPED,SKIPPED,SKIPPED,2.79,,136.0,27.3,NO,,,,,B
144789,BASELINE,1,11.6,MALE,NO,WHITE,3.81,11.5,154.4,29.6,NO,,,,,B
144790,BASELINE,1,5.1,MALE,NO,BLACK OR AFRICAN AMERICAN,3.40,5.1,116.0,19.7,YES,2.60,5.1,116.0,19.7,C
144791,BASELINE,1,3.6,MALE,NO,WHITE,2.53,3.6,112.0,20.9,NO,,,,,C
144792,BASELINE,1,19.1,MALE,NO,BLACK OR AFRICAN AMERICAN,3.90,19,198.0,79.5,NO,,,,,B