random_ID,VISIT,SCREEN_NUM,VISIT_AGE,WT1_SCRN,WT2_SCRN,WT3_SCRN,meanwt,HT1_SCRN,HT2_SCRN,HT3_SCRN,meanht,bsa_vis,agemos,BMI,WAZ,WTPCT,BMIZ,BMIPCT,HAZ,HTPCT,WHZ,WHPCT,HTMEAS_SCRN,ARMSPAN_SCRN,arm_ht,LOWSEG_SCRN,up_low,VER_ID
144508,BASELINE,1,16,91.5,91.5,,91.5,192.0,192.0,,192,2.21,191.6,24.82,2.02,97.82,1.18,88.04,2.63,99.57,,,STANDING,202.0,1.052,105.0,0.83,A
144511,BASELINE,1,8.3,31.4,31.3,,31.35,144.8,144.9,,144.85,1.11,99.1,14.94,0.98,83.57,-0.63,26.53,2.55,99.46,,,STANDING,146.0,1.008,73.0,0.98,A
144515,BASELINE,1,11.6,43.1,43.0,,43.05,169.5,170.5,,170,1.41,139.7,14.9,0.52,69.68,-1.57,5.82,3.04,99.88,,,STANDING,185.0,1.088,97.5,0.74,A
144517,BASELINE,1,19.3,46.0,46.0,,46,178.6,178.5,,178.55,1.49,231.5,14.43,-3.21,0.07,-5.27,0,0.26,60.3,,,STANDING,195.6,1.095,112.0,0.59,A
144519,BASELINE,1,23.8,121.7,121.7,,121.7,208.2,208.0,,208.1,2.66,286.1,28.1,,,,,,,,,STANDING,208.1,1,106.5,0.95,A
144520,BASELINE,1,5.1,20.6,20.6,,20.6,118.5,119.0,,118.75,0.82,61,14.61,0.76,77.51,-0.76,22.44,2.02,97.84,-0.69,24.6,STANDING,120.0,1.011,62.5,0.9,A
144525,BASELINE,1,1.5,11.2,11.2,,11.2,83.5,83.5,,83.5,0.51,17.9,,0.2,58.01,,,1.04,85.09,-0.17,43.12,RECUMBENT,87.0,1.042,39.0,1.14,A
144527,BASELINE,1,11.3,42.1,42.1,,42.1,157.2,157.4,,157.3,1.35,135.6,17.01,0.61,72.78,-0.16,43.71,1.68,95.31,,,STANDING,166.2,1.057,86.0,0.83,A
144529,BASELINE,1,3.6,19.9,19.9,,19.9,112.0,112.0,,112,0.79,43.7,15.86,1.88,96.97,0.35,63.51,3.12,99.91,0.35,63.82,STANDING,109.0,0.973,53.5,1.09,A
144530,BASELINE,1,6.6,23.3,23.2,,23.25,130.0,130.0,,130,0.91,79,13.76,0.36,64,-1.6,5.53,2.07,98.07,,,STANDING,129.2,0.994,64.3,1.02,A
144531,BASELINE,2,6.8,23.8,23.8,,23.8,129.4,129.3,,129.35,0.92,82,14.22,0.33,62.93,-1.08,14.06,1.61,94.63,,,STANDING,138.0,1.067,67.5,0.92,A
144533,BASELINE,1,7.1,28.7,28.6,,28.65,129.0,128.5,,128.75,1.01,85.2,17.28,1.23,89.07,0.97,83.49,1.16,87.7,,,STANDING,136.0,1.056,67.0,0.92,A
144534,BASELINE,1,12.5,54.0,53.9,,53.95,174.0,174.0,,174,1.6,149.6,17.82,0.96,83.27,-0.21,41.63,2.8,99.74,,,STANDING,182.0,1.046,96.0,0.81,A
144535,BASELINE,1,16.7,70.7,70.7,,70.7,194.7,194.7,,194.7,1.94,200.2,18.65,0.61,72.85,-1,15.84,2.84,99.78,,,STANDING,204.0,1.048,104.0,0.87,A
144537,BASELINE,1,19.6,48.1,48.1,,48.1,173.0,173.0,,173,1.5,234.6,16.07,-2.83,0.24,-3.67,0.01,-0.53,29.97,,,STANDING,187.5,1.084,92.0,0.88,A
144538,BASELINE,1,13.9,77.4,77.0,77.0,77.133333333,190.5,190.6,,190.55,2.01,167,21.24,1.93,97.33,0.71,76.06,3.55,99.98,,,STANDING,190.5,1,110.0,0.73,A
144544,BASELINE,1,17.9,62.7,62.7,,62.7,191.0,191.5,,191.25,1.8,214.7,17.14,-0.42,33.78,-2.3,1.08,2.15,98.44,,,STANDING,208.5,1.09,104.5,0.83,A
144548,BASELINE,1,14.2,53.4,53.3,,53.35,180.0,180.0,,180,1.61,170.3,16.47,0.13,55.2,-1.39,8.3,1.91,97.2,,,STANDING,188.0,1.044,99.5,0.81,A
144549,BASELINE,1,5.1,19.2,19.3,,19.25,115.0,115.0,,115,0.78,61.6,14.56,0.37,64.57,-0.5,30.73,1.29,90.19,-0.59,27.87,STANDING,115.0,1,56.6,1.03,A
144552,BASELINE,1,19,66.2,66.1,,66.15,193.7,193.8,,193.75,1.87,228.4,17.62,-0.29,38.76,-2.32,1.01,2.43,99.24,,,STANDING,212.0,1.094,108.0,0.79,A
144553,BASELINE,1,4.5,18.6,18.5,,18.55,119.4,119.0,,119.2,0.78,54,13.06,0.55,70.78,-2.84,0.23,3.09,99.9,-2.79,0.26,STANDING,118.0,0.99,56.2,1.12,A
144554,BASELINE,1,14.9,74.1,74.1,,74.1,179.4,179.4,,179.4,1.92,178.4,23.02,1.59,94.39,0.85,80.34,2.71,99.66,,,STANDING,193.2,1.077,99.0,0.81,A
144555,BASELINE,1,3.9,18.5,18.5,,18.5,112.0,112.1,,112.05,0.76,47,14.73,1.17,87.97,-0.54,29.51,2.63,99.57,-0.41,33.97,STANDING,114.2,1.019,55.0,1.04,A
144556,BASELINE,1,9.3,41.5,41.5,,41.5,158.0,158.5,,158.25,1.34,111,16.57,1.64,94.99,0.16,56.46,3.57,99.98,,,STANDING,162.0,1.024,84.0,0.88,A
144558,BASELINE,1,2.3,13.9,13.9,,13.9,102.0,102.0,,102,0.63,27.4,,0.52,69.73,,,3.21,99.93,-2.04,2.06,RECUMBENT,98.5,0.966,53.0,0.92,A
144568,BASELINE,1,13.7,45.0,45.0,,45,173.0,173.0,,173,1.45,163.8,15.04,-0.46,32.16,-2.21,1.35,1.49,93.18,,,STANDING,175.0,1.012,94.0,0.84,A
144572,BASELINE,1,11.3,36.8,36.5,36.5,36.6,164.5,163.0,164.0,163.83333333,1.27,136,13.64,-0.28,39.05,-2.33,0.99,2.36,99.1,,,STANDING,165.0,1.007,88.5,0.85,A
144573,BASELINE,1,6.9,26.4,26.4,,26.4,124.3,124.7,,124.5,0.96,82.7,17.03,0.92,82.13,0.9,81.61,0.64,73.78,,,STANDING,127.4,1.023,66.5,0.87,A
144574,BASELINE,1,17.7,60.4,60.4,,60.4,182.3,182.3,,182.3,1.73,212.6,18.17,0.45,67.39,-1.24,10.8,2.98,99.85,,,STANDING,192.2,1.054,98.0,0.86,A
144575,BASELINE,2,2.3,12.5,12.5,,12.5,102.0,102.0,,102,0.59,27.4,12.01,-0.46,32.28,-5.38,0,3.45,99.97,-4.24,0,STANDING,103.0,1.01,95.5,0.07,A
144576,BASELINE,1,4,19.1,19.1,,19.1,110.5,110.5,,110.5,0.77,48.4,15.64,1.27,89.8,0.27,60.68,2.11,98.26,0.23,59.22,STANDING,112.0,1.014,51.0,1.17,A
144579,BASELINE,1,11.8,43.3,43.3,,43.3,150.0,150.0,,150,1.34,141.8,19.24,0.44,66.96,0.59,72.17,0.28,60.88,,,STANDING,158.5,1.057,80.5,0.86,A
144581,BASELINE,1,13.3,45.3,45.3,,45.3,172.5,172.5,,172.5,1.45,159.6,15.22,-0.21,41.56,-1.92,2.74,1.77,96.16,,,STANDING,178.4,1.034,99.1,0.74,A
144582,BASELINE,1,10.7,27.6,27.6,,27.6,145.5,145.2,,145.35,1.04,128.3,13.06,-1.37,8.47,-3.05,0.11,0.49,68.66,,,STANDING,148.5,1.022,81.0,0.79,A
144584,BASELINE,1,15.3,64.5,65.0,65.0,64.833333333,189.5,189.5,,189.5,1.83,183.5,18.05,0.62,73.35,-0.86,19.45,2.52,99.42,,,STANDING,200.0,1.055,101.0,0.88,A
144587,BASELINE,2,22.3,74.0,74.0,,74,196.5,196.8,,196.65,1.99,267.4,19.14,,,,,,,,,STANDING,193.5,0.984,98.5,1,A
144588,BASELINE,1,12.2,33.8,33.8,,33.8,168.0,168.5,,168.25,1.23,146.2,11.94,-1.24,10.8,-4.41,0,2.2,98.6,,,STANDING,165.0,0.981,92.0,0.83,A
144589,BASELINE,1,5.6,17.7,17.8,,17.75,124.9,125.0,,124.95,0.77,67.3,11.37,-0.61,26.98,-5.4,0,2.43,99.25,,,STANDING,127.0,1.016,67.0,0.86,A
144591,BASELINE,1,15.5,86.2,86.1,,86.15,199.9,199.9,,199.9,2.18,186.5,21.56,1.88,96.99,0.45,67.35,4,100,,,STANDING,204.5,1.023,112.3,0.78,A
144593,BASELINE,1,14.3,49.5,49.5,,49.5,171.2,171.2,,171.2,1.52,171.8,16.89,-0.09,46.46,-1.11,13.37,1.56,94.02,,,STANDING,177.8,1.039,99.1,0.73,A
144594,BASELINE,1,11.5,33.5,33.6,,33.55,159.0,159.0,,159,1.2,137.9,13.27,-0.84,19.96,-2.7,0.34,1.56,94.03,,,STANDING,165.0,1.038,83.2,0.91,A
144595,BASELINE,1,18,73.5,73.5,,73.5,203.5,203.5,,203.5,2.01,215.4,17.75,0.54,70.42,-1.92,2.77,3.94,100,,,STANDING,214.0,1.052,112.0,0.82,A
144597,BASELINE,1,1.2,10.2,9.9,10.1,10.066666667,83.0,83.0,,83,0.48,14.8,,-0.19,42.6,,,2.02,97.82,-1.47,7.15,RECUMBENT,80.0,0.964,37.5,1.21,A
144600,BASELINE,1,6.4,34.0,34.0,,34,136.0,136.0,,136,1.13,76.4,18.38,2.51,99.4,1.56,94.05,3.53,99.98,,,STANDING,144.0,1.059,70.0,0.94,A
144605,BASELINE,1,0.6,6.6,6.6,,6.6,67.2,66.5,,66.85,0.35,6.6,,-1.09,13.78,,,0.22,58.69,-1.64,5.03,RECUMBENT,63.0,0.942,27.0,1.48,A
144606,BASELINE,1,9.9,34.0,34.0,,34,147.0,149.0,148.0,148,1.17,118.3,15.52,0.42,66.43,-0.59,27.64,1.51,93.5,,,STANDING,161.9,1.094,74.9,0.98,A
144607,BASELINE,1,22.8,62.8,62.8,,62.8,165.0,165.0,,165,1.7,274,23.07,,,,,,,,,STANDING,172.0,1.042,89.5,0.84,A
144609,BASELINE,1,22,68.7,68.7,,68.7,192.0,191.5,,191.75,1.9,263.5,18.68,,,,,,,,,STANDING,197.5,1.03,99.0,0.94,A
144612,BASELINE,1,5.8,24.7,24.7,,24.7,129.0,129.0,,129,0.93,69.7,14.84,1.3,90.36,-0.26,39.77,2.84,99.78,,,STANDING,128.5,0.996,63.0,1.05,A
144613,BASELINE,1,9.7,25.9,25.9,,25.9,147.0,147.0,,147,1.01,117,11.99,-1.16,12.32,-4.4,0,1.46,92.75,,,STANDING,150.0,1.02,78.0,0.88,A
144614,BASELINE,2,21.4,75.4,75.4,,75.4,169.6,169.3,,169.45,1.9,256.7,26.26,,,,,,,,,STANDING,171.9,1.014,86.5,0.96,A
144615,BASELINE,1,7.6,25.0,25.0,,25,139.0,139.0,,139,0.97,91.7,12.94,0.08,53.33,-2.7,0.35,2.3,98.94,,,STANDING,142.0,1.022,75.0,0.85,A
144620,BASELINE,1,12,49.1,49.1,,49.1,168.6,168.8,,168.7,1.5,144.1,17.25,0.76,77.56,-0.33,37.01,2.4,99.19,,,STANDING,177.0,1.049,102.0,0.65,A
144622,BASELINE,1,1.3,9.6,9.6,,9.6,82.5,82.4,,82.45,0.47,15.6,,-1.46,7.23,,,0.92,82.07,-2.34,0.98,RECUMBENT,82.5,1.001,38.0,1.17,A
144625,BASELINE,1,4.8,17.2,17.2,,17.2,114.3,114.4,,114.35,0.73,57.6,13.15,-0.34,36.68,-2.63,0.42,1.5,93.27,-2.52,0.59,STANDING,116.0,1.014,54.0,1.12,A
144626,BASELINE,1,0.5,8.6,8.6,,8.6,69.5,69.5,,69.5,0.41,6.4,,0.53,70.08,,,0.69,75.58,0.43,66.52,RECUMBENT,70.5,1.014,35.5,0.96,A
144627,BASELINE,2,21.9,56.9,56.9,,56.9,186.0,186.0,,186,1.69,262.4,16.45,,,,,,,,,STANDING,192.0,1.032,104.0,0.79,A
144628,BASELINE,1,12,54.8,54.1,54.8,54.566666667,170.0,170.8,,170.4,1.6,144.6,18.79,1.32,90.68,0.38,64.77,2.71,99.67,,,STANDING,178.5,1.048,90.0,0.89,A
144630,BASELINE,1,15,60.8,60.9,,60.85,173.6,174.0,,173.8,1.71,180,20.14,0.79,78.5,0.08,53.1,1.83,96.66,,,STANDING,186.8,1.075,98.0,0.77,A
144631,BASELINE,1,3.4,17.3,17.3,,17.3,104.0,104.0,,104,0.71,41.2,15.99,1.12,86.92,0.14,55.48,1.42,92.18,0.35,63.85,STANDING,104.0,1,60.0,0.73,A
144632,BASELINE,1,4.5,19.7,19.7,,19.7,112.4,112.3,,112.35,0.78,53.6,15.61,1.01,84.49,0.08,53.09,1.58,94.29,0.18,57.31,STANDING,116.0,1.032,64.0,0.76,A
144633,BASELINE,1,9.1,33.0,33.0,,33,138.3,138.3,,138.3,1.12,108.8,17.25,0.75,77.35,0.52,69.93,0.71,76,,,STANDING,141.0,1.02,69.0,1,A
144635,BASELINE,1,11.4,36.8,36.8,,36.8,160.0,160.0,,160,1.26,137.2,14.38,-0.14,44.48,-1.93,2.67,1.93,97.31,,,STANDING,164.0,1.025,81.0,0.98,A
144637,BASELINE,2,24.3,82.0,81.5,82.0,81.833333333,182.0,182.1,,182.05,2.04,291.8,24.69,,,,,,,,,STANDING,196.0,1.077,98.0,0.86,A
144638,BASELINE,3,14.8,62.2,62.2,,62.2,188.5,188.5,,188.5,1.78,178.2,17.51,0.91,81.9,-0.94,17.41,4.09,100,,,STANDING,201.5,1.069,110.9,0.7,A
144640,BASELINE,1,2.3,12.3,12.6,12.3,12.4,94.1,94.2,,94.15,0.57,28,13.99,-0.59,27.67,-2.35,0.94,1.25,89.45,-1.91,2.78,STANDING,95.0,1.009,43.0,1.19,A
144643,BASELINE,1,19.4,61.0,61.1,,61.05,189.5,190.0,,189.75,1.77,233.2,16.96,-0.9,18.47,-2.91,0.18,1.84,96.7,,,STANDING,190.5,1.004,100.3,0.89,A
144653,BASELINE,1,2.5,13.4,13.4,,13.4,96.0,96.5,,96.25,0.6,30,14.46,-0.06,47.47,-1.72,4.3,1.38,91.67,-1.3,9.69,STANDING,96.5,1.003,46.0,1.09,A
144654,BASELINE,1,6.2,17.0,17.1,,17.05,120.5,120.5,,120.5,0.75,75,11.74,-1.52,6.45,-4.24,0,0.75,77.49,-4.28,0,STANDING,120.5,1,61.0,0.98,A
144655,BASELINE,1,2.3,13.8,13.8,,13.8,95.0,95.3,,95.15,0.61,27.6,15.24,0.43,66.59,-1,15.92,1.59,94.46,-0.62,26.76,STANDING,92.7,0.974,48.3,0.97,A
144656,BASELINE,1,14.8,60.5,60.5,,60.5,192.0,192.0,,192,1.77,177.5,16.41,0.48,68.53,-1.64,5.01,3.16,99.92,,,STANDING,194.0,1.01,101.0,0.9,A
144658,BASELINE,1,19.4,54.0,54.1,,54.05,180.4,180.3,,180.35,1.63,232.6,16.62,-0.42,33.66,-2.43,0.74,2.65,99.59,,,STANDING,,,101.0,0.79,A
144660,BASELINE,1,1.7,10.8,10.8,,10.8,87.0,87.0,,87,0.51,20.9,,-1.14,12.67,,,0.71,76.17,-1.87,3.04,RECUMBENT,92.2,1.06,44.0,0.98,A
144662,BASELINE,1,22.6,50.0,50.0,,50,160.6,160.6,,160.6,1.49,270.6,19.39,,,,,,,,,STANDING,175.0,1.09,85.0,0.89,A
144663,BASELINE,1,9.5,29.7,29.8,,29.75,149.5,149.0,,149.25,1.09,113.8,13.36,-0.07,47.2,-2.39,0.84,2.03,97.86,,,STANDING,152.0,1.018,79.0,0.89,A
144665,BASELINE,1,24.7,80.0,80.0,,80,195.0,195.0,,195,2.07,296.3,21.04,,,,,,,,,STANDING,197.0,1.01,95.0,1.05,A
144666,BASELINE,1,2.7,12.9,12.9,,12.9,96.0,96.0,,96,0.59,31.9,14,-0.24,40.53,-1.8,3.63,1.21,88.72,-1.52,6.45,STANDING,99.7,1.039,51.4,0.87,A
144669,BASELINE,1,13.6,78.9,78.9,,78.9,172.0,172.3,,172.15,1.96,162.8,26.62,2.03,97.88,1.62,94.74,1.93,97.29,,,STANDING,177.0,1.028,93.0,0.85,A
144670,BASELINE,1,6.7,34.7,34.7,,34.7,139.0,138.9,,138.95,1.16,80.3,17.97,2.22,98.67,1.24,89.21,3.28,99.95,,,STANDING,148.0,1.065,68.5,1.03,A
144672,BASELINE,1,17.5,42.7,42.7,,42.7,174.0,174.0,,174,1.41,210.1,14.1,-2.14,1.62,-4.45,0,1.7,95.5,,,STANDING,177.0,1.017,99.0,0.76,A
144673,BASELINE,2,17.4,66.7,66.8,,66.75,169.8,169.8,,169.8,1.78,208.9,23.15,0.97,83.31,0.58,71.92,1.05,85.29,,,STANDING,175.0,1.031,107.0,0.59,A
144674,BASELINE,1,16.7,50.9,50.9,,50.9,183.5,183.5,,183.5,1.59,199.8,15.12,-1.45,7.36,-3.46,0.03,1.21,88.72,,,STANDING,182.8,0.996,98.2,0.87,A
144677,BASELINE,1,14.1,61.5,61.5,,61.5,183.0,183.0,,183,1.75,169.3,18.36,0.87,80.87,-0.35,36.39,2.38,99.13,,,STANDING,193.0,1.055,102.0,0.79,A
144678,BASELINE,1,22.5,68.9,69.0,,68.95,191.0,191.5,,191.25,1.9,270.2,18.85,,,,,,,,,STANDING,202.0,1.056,102.5,0.87,A
144687,BASELINE,1,17.3,66.7,66.7,,66.7,187.8,187.6,,187.7,1.85,207.2,18.93,0.12,54.81,-1.04,14.95,1.71,95.66,,,STANDING,194.0,1.034,97.0,0.94,A
144688,BASELINE,1,13.1,37.4,37.0,37.4,37.266666667,161.8,162.0,,161.9,1.28,156.8,14.22,-1.15,12.53,-2.7,0.35,0.67,74.75,,,STANDING,161.2,0.996,85.0,0.9,A
144689,BASELINE,1,2.8,14.0,14.0,,14,108.0,108.0,,108,0.64,33.8,12,-0.01,49.43,-5.01,0,3.47,99.97,-4.42,0,STANDING,111.0,1.028,50.0,1.16,A
144690,BASELINE,1,6,23.6,23.6,,23.6,123.7,123.6,,123.65,0.9,71.8,15.44,0.9,81.65,0.04,51.71,1.68,95.33,,,STANDING,126.0,1.019,65.0,0.9,A
144691,BASELINE,1,12.7,68.5,68.5,,68.5,180.3,180.3,,180.3,1.85,151.8,21.07,1.93,97.32,0.93,82.27,3.36,99.96,,,STANDING,176.0,0.976,101.0,0.79,A
144697,BASELINE,1,16.6,50.3,50.3,,50.3,176.0,176.5,,176.25,1.55,199,16.19,-1.5,6.67,-2.51,0.61,0.21,58.42,,,STANDING,187.0,1.061,96.4,0.83,A
144699,BASELINE,1,13.8,66.4,66.4,,66.4,200.8,200.8,,200.8,1.9,165.2,16.47,1.37,91.41,-1.23,10.88,5.06,100,,,STANDING,204.4,1.018,111.0,0.81,A
144700,BASELINE,1,14.4,66.5,66.5,,66.5,183.0,183.0,,183,1.83,172.2,19.86,1.13,87.13,0.18,57.05,2.19,98.57,,,STANDING,193.2,1.056,101.8,0.8,A
144704,BASELINE,1,17.4,79.7,79.7,,79.7,196.6,196.6,,196.6,2.07,209.2,20.62,1.06,85.56,-0.33,37.14,2.99,99.86,,,STANDING,202.0,1.027,112.0,0.76,A
144705,BASELINE,1,15.1,78.2,78.2,,78.2,183.5,183.5,,183.5,2,181.1,23.22,1.59,94.45,0.98,83.57,1.77,96.13,,,STANDING,194.0,1.057,106.0,0.73,A
144708,BASELINE,1,12.1,37.6,37.6,,37.6,161.1,161.1,,161.1,1.28,144.8,14.49,-0.43,33.3,-2.06,1.98,1.52,93.59,,,STANDING,161.0,0.999,78.0,1.07,A
144709,BASELINE,1,5.6,25.9,25.9,,25.9,129.2,129.4,,129.3,0.96,67.2,15.49,1.67,95.29,0.23,59.12,3.19,99.93,,,STANDING,130.0,1.005,61.0,1.12,A
144711,BASELINE,1,12.3,42.5,42.5,,42.5,164.0,165.0,,164.5,1.38,148.2,15.71,-0.08,46.94,-1.19,11.64,1.53,93.68,,,STANDING,166.5,1.012,88.0,0.87,A
144714,BASELINE,1,9.5,34.9,34.9,,34.9,154.1,154.1,,154.1,1.21,113.6,14.7,0.63,73.46,-1.02,15.3,2.77,99.72,,,STANDING,157.0,1.019,80.0,0.93,A
144716,BASELINE,1,18.8,63.8,63.0,63.6,63.466666667,189.7,190.1,,189.9,1.81,225.6,17.6,-0.52,30.08,-2.27,1.15,1.89,97.07,,,STANDING,182.2,0.959,95.5,0.99,A
144717,BASELINE,1,24,55.9,55.9,,55.9,173.4,173.9,,173.65,1.63,288.4,18.54,,,,,,,,,STANDING,167.0,0.962,92.0,0.89,A
144719,BASELINE,1,20.1,88.9,88.9,,88.9,178.4,178.3,,178.35,2.12,241,27.95,,,,,,,,,STANDING,184.3,1.033,91.4,0.95,A
144720,BASELINE,1,16.1,66.6,66.5,,66.55,173.4,173.5,,173.45,1.79,193.7,22.12,0.45,67.2,0.49,68.67,-0.05,47.92,,,STANDING,180.0,1.038,100.0,0.73,A
144724,BASELINE,1,2.3,15.4,15.4,,15.4,98.0,99.0,,98.5,0.65,27.1,15.87,1.45,92.71,-0.44,32.93,2.59,99.53,0.08,53.23,STANDING,100.0,1.015,38.0,1.59,A
144727,BASELINE,1,22.5,90.3,90.4,,90.35,193.0,193.5,,193.25,2.2,269.8,24.19,,,,,,,,,STANDING,207.5,1.074,102.0,0.89,A
144728,BASELINE,1,5.8,21.5,21.5,,21.5,121.5,121.5,,121.5,0.85,70.1,14.56,0.51,69.52,-0.49,31.16,1.49,93.2,,,STANDING,124.0,1.021,68.5,0.77,A
144731,BASELINE,1,3.1,14.6,14.6,,14.6,101.5,101.5,,101.5,0.64,36.6,14.17,0.37,64.37,-1.45,7.36,1.79,96.35,-1.06,14.38,STANDING,103.2,1.017,49.5,1.05,A
144734,BASELINE,1,6.3,21.8,21.7,,21.75,130.8,130.8,,130.8,0.88,75.2,12.71,0.14,55.66,-3.14,0.09,2.67,99.62,,,STANDING,128.3,0.981,72.4,0.81,A
144736,BASELINE,1,14.1,56.0,56.0,,56,180.0,180.0,,180,1.66,169.6,17.28,0.41,65.87,-0.88,18.82,1.96,97.51,,,STANDING,186.0,1.033,96.5,0.87,A
144738,BASELINE,1,0.5,7.9,7.9,,7.9,68.7,68.9,,68.8,0.39,6.1,,0.73,76.73,,,1.3,90.3,-0.14,44.24,RECUMBENT,59.0,0.858,31.0,1.22,A
144739,BASELINE,1,9.5,45.2,45.2,,45.2,143.2,143.2,,143.2,1.35,114,22.04,1.83,96.63,1.73,95.78,1.09,86.32,,,STANDING,146.5,1.023,74.0,0.94,A
144740,BASELINE,1,16.4,62.6,62.6,,62.6,191.9,191.5,,191.7,1.8,196.4,17.03,0.02,50.76,-1.83,3.38,2.47,99.32,,,STANDING,196.0,1.022,99.5,0.93,A
144741,BASELINE,1,9.3,32.4,32.4,,32.4,155.1,155.1,,155.1,1.16,111.5,13.47,0.52,69.98,-2.22,1.32,3.07,99.89,,,STANDING,164.0,1.057,,,A
144742,BASELINE,1,14.2,51.0,50.9,,50.95,178.0,178.0,,178,1.57,170.8,16.08,-0.13,44.67,-1.65,4.9,1.61,94.66,,,STANDING,190.0,1.067,94.0,0.89,A
144743,BASELINE,1,17.2,55.0,55.0,,55,178.2,178.2,,178.2,1.63,206.4,17.32,-1.12,13.11,-1.94,2.62,0.37,64.53,,,STANDING,173.5,0.974,89.5,0.99,A
144744,BASELINE,1,6.4,25.6,25.6,,25.6,125.0,125.0,,125,0.94,76.4,16.38,1.1,86.5,0.65,74.12,1.4,91.9,,,STANDING,128.5,1.028,64.0,0.95,A
144746,BASELINE,1,4.1,16.2,16.2,,16.2,112.0,112.0,,112,0.7,49.3,12.91,-0.13,44.74,-3.12,0.09,2.1,98.23,-2.87,0.21,STANDING,114.5,1.022,58.8,0.9,A
144747,BASELINE,1,0.7,5.9,5.9,,5.9,71.9,71.9,,71.9,0.34,7.9,,-2.71,0.34,,,1.35,91.1,-5.92,0,RECUMBENT,73.0,1.015,33.0,1.18,A
144750,BASELINE,1,10.9,62.1,62.2,,62.15,176.0,176.0,,176,1.74,131.3,20.06,2.12,98.28,0.86,80.51,4.33,100,,,STANDING,184.0,1.045,93.5,0.88,A
144755,BASELINE,1,5.1,24.4,24.3,,24.35,125.0,124.5,,124.75,0.92,61.1,15.65,1.73,95.84,0.36,64.07,3.18,99.93,,,STANDING,129.5,1.038,63.0,0.98,A
144758,BASELINE,1,2.5,14.8,14.8,,14.8,97.0,96.8,,96.9,0.63,29.6,15.76,1.14,87.35,-0.23,40.9,1.92,97.24,0.14,55.54,STANDING,98.5,1.017,42.5,1.28,A
144760,BASELINE,1,14.2,62.0,62.0,,62,185.0,185.0,,185,1.77,170.9,18.12,0.85,80.31,-0.5,30.83,2.55,99.46,,,STANDING,194.0,1.049,102.0,0.81,A
144764,BASELINE,1,8.6,27.6,27.6,,27.6,141.5,141.5,,141.5,1.03,102.7,13.78,0.09,53.4,-1.74,4.14,1.7,95.53,,,STANDING,141.3,0.999,72.4,0.95,A
144766,BASELINE,1,12.3,35.3,35.2,,35.25,161.2,161.2,,161.2,1.24,147.2,13.57,-0.93,17.7,-3.04,0.12,1.35,91.19,,,STANDING,171.0,1.061,64.0,1.52,A
144768,BASELINE,1,3.4,17.5,17.4,,17.45,108.5,107.7,,108.1,0.72,40.6,14.93,1.32,90.69,-0.53,29.78,2.73,99.68,-0.25,39.95,STANDING,109.5,1.013,54.1,1,A
144769,BASELINE,1,11.8,50.0,50.0,,50,182.0,182.0,,182,1.57,142.2,15.09,1.06,85.6,-1.49,6.82,4.32,100,,,STANDING,186.0,1.022,103.1,0.77,A
144771,BASELINE,1,4.9,26.0,26.0,,26,131.0,131.0,,131,0.97,58.7,15.15,2.36,99.08,-0.26,39.83,5.1,100,,,STANDING,134.5,1.027,66.0,0.98,A
144772,BASELINE,1,15,60.1,60.1,,60.1,176.5,177.0,,176.75,1.71,179.5,19.24,0.74,77.02,-0.23,41.01,2.29,98.9,,,STANDING,185.5,1.05,97.5,0.81,A
144775,BASELINE,1,3.2,21.5,21.5,,21.5,107.0,107.0,,107,0.81,38.8,18.78,2.72,99.67,1.93,97.32,2.76,99.71,1.69,95.45,STANDING,114.5,1.07,51.0,1.1,A
144776,BASELINE,1,24.8,64.5,64.5,,64.5,181.0,181.5,,181.25,1.79,298.1,19.63,,,,,,,,,STANDING,193.0,1.065,93.0,0.95,A
144782,BASELINE,1,3.7,14.7,14.7,,14.7,104.0,104.0,,104,0.65,44.6,13.59,-0.28,38.89,-1.91,2.79,1.19,88.37,-1.6,5.46,STANDING,115.0,1.106,59.0,0.76,A
144785,BASELINE,1,18.9,59.9,59.8,,59.85,175.0,176.0,,175.5,1.7,226.8,19.43,0.27,60.6,-0.78,21.86,1.9,97.12,,,STANDING,175.8,1.002,88.9,0.97,A
144786,BASELINE,1,4.8,20.0,20.0,,20,112.5,113.0,,112.75,0.79,57.5,15.73,0.9,81.46,0.42,66.2,1.36,91.31,0.27,60.53,STANDING,112.0,0.993,56.0,1.01,A
144787,BASELINE,2,5.4,26.0,26.0,,26,125.0,124.5,,124.75,0.95,65.3,16.71,1.89,97.09,0.93,82.48,2.74,99.69,,,STANDING,130.8,1.048,64.2,0.94,A
144788,BASELINE,2,9,27.4,27.4,,27.4,139.1,139.1,,139.1,1.02,108.1,14.16,-0.32,37.4,-1.3,9.67,0.96,83.24,,,STANDING,141.6,1.018,78.7,0.77,A
144791,BASELINE,1,3.7,21.5,21.6,,21.55,114.2,114.2,,114.2,0.83,44.8,16.52,2.38,99.12,0.67,74.74,3.27,99.95,0.77,78.05,STANDING,116.2,1.018,54.6,1.09,A
144794,BASELINE,1,8.5,39.2,39.2,,39.2,148.2,148.0,,148.1,1.27,102,17.87,1.81,96.52,0.9,81.64,2.8,99.75,,,STANDING,148.0,0.999,77.0,0.92,A
144795,BASELINE,1,1.9,12.6,12.6,,12.6,96.5,96.5,,96.5,0.58,23,13.53,0.53,70.03,,,,,-2.03,2.11,STANDING,97.0,1.005,40.5,1.38,A
144797,BASELINE,1,12.3,35.4,35.4,,35.4,159.5,159.5,,159.5,1.23,148,13.91,-0.94,17.29,-2.7,0.35,1.08,85.99,,,STANDING,163.5,1.025,86.2,0.85,A
144801,BASELINE,1,20.7,88.9,88.8,,88.85,195.5,195.4,,195.45,2.19,249,23.26,,,,,,,,,STANDING,200.5,1.026,104.0,0.88,A
144806,BASELINE,1,6.6,22.0,21.7,22.0,21.9,125.0,125.0,,125,0.87,79.2,14.02,-0.06,47.52,-1.29,9.77,1.09,86.29,,,STANDING,126.0,1.008,66.0,0.89,A
144809,BASELINE,1,17.1,55.9,55.9,,55.9,176.5,176.5,,176.5,1.64,205.2,17.94,0.07,52.88,-1.24,10.7,2.1,98.19,,,STANDING,178.0,1.008,89.0,0.98,A
144813,BASELINE,2,21.4,76.1,76.1,,76.1,180.0,180.5,,180.25,1.95,257,23.42,,,,,,,,,STANDING,193.0,1.071,98.5,0.83,A
144816,BASELINE,1,8.8,25.4,25.4,,25.4,137.8,137.7,,137.75,0.97,105.1,13.39,-0.59,27.72,-2.22,1.33,0.9,81.66,,,STANDING,138.0,1.002,81.0,0.7,A
144817,BASELINE,1,15.4,39.9,39.9,,39.9,170.5,170.3,,170.4,1.35,184.6,13.74,-2.42,0.78,-4.31,0,-0.15,43.97,,,STANDING,183.7,1.078,97.0,0.76,A
144818,BASELINE,1,18.1,61.1,61.1,,61.1,179.9,179.9,,179.9,1.74,217.2,18.88,-0.64,26.08,-1.31,9.54,0.52,69.72,,,STANDING,180.0,1.001,94.9,0.9,A
144820,BASELINE,1,3,11.5,11.5,,11.5,92.5,92.5,,92.5,0.54,35.5,13.44,-2.06,1.98,-2.76,0.29,-0.57,28.45,-2.63,0.43,STANDING,95.0,1.027,40.0,1.31,A
144824,BASELINE,1,19.1,113.0,113.0,,113,186.5,186.0,,186.25,2.45,228.6,32.58,2.41,99.2,2.03,97.86,1.36,91.28,,,STANDING,206.0,1.106,97.0,0.92,A
144826,BASELINE,2,8.1,24.5,24.5,,24.5,125.0,125.1,,125.05,0.92,97.3,15.67,-0.38,35.23,-0.09,46.56,-0.6,27.33,,,STANDING,127.3,1.018,67.0,0.87,A
144827,BASELINE,1,17,60.8,60.8,,60.8,181.4,181.4,,181.4,1.74,204.4,18.48,0.55,70.89,-0.96,16.87,2.85,99.78,,,STANDING,183.2,1.01,95.0,0.91,A
144829,BASELINE,1,8.7,35.1,35.1,,35.1,152.5,152.5,,152.5,1.21,104.8,15.09,1.24,89.21,-0.61,27.03,3.24,99.94,,,STANDING,163.0,1.069,80.0,0.91,A
144831,BASELINE,1,0.9,8.4,8.4,,8.4,80.0,80.0,,80,0.43,11.4,,-1.72,4.28,,,1.69,95.44,-3.65,0.01,RECUMBENT,78.0,0.975,31.5,1.54,A
144832,BASELINE,2,11.2,43.8,43.8,,43.8,157.0,157.0,,157,1.37,133.9,17.77,0.67,74.98,0.09,53.49,1.61,94.66,,,STANDING,163.4,1.041,85.5,0.84,A
144836,BASELINE,1,10.7,57.0,57.0,,57,172.5,171.0,172.0,171.83333333,1.64,128.4,19.3,2.06,98.04,0.86,80.63,4.12,100,,,STANDING,188.0,1.094,99.0,0.74,A
144837,BASELINE,1,10,38.3,38.2,,38.25,150.6,150.5,,150.55,1.26,119.9,16.88,0.73,76.74,0.02,50.76,1.82,96.58,,,STANDING,159.5,1.059,85.5,0.76,A
144838,BASELINE,1,13.1,44.7,44.7,,44.7,165.8,165.8,,165.8,1.42,157.1,16.26,-0.16,43.82,-1.12,13.07,1.14,87.24,,,STANDING,171.5,1.034,87.0,0.91,A
144842,BASELINE,1,9.2,29.3,29.3,,29.3,133.3,133.0,,133.15,1.04,110.8,16.53,0,50.14,0.14,55.76,-0.25,40.01,,,STANDING,135.0,1.014,74.5,0.79,A
144847,BASELINE,1,19.8,51.8,51.8,,51.8,172.0,173.0,,172.5,1.56,237.7,17.41,-0.76,22.45,-1.9,2.89,1.42,92.24,,,STANDING,181.8,1.054,91.5,0.89,A
144850,BASELINE,1,11.6,34.0,34.0,,34,152.8,152.9,,152.85,1.19,139.7,14.55,-0.86,19.41,-1.71,4.32,0.58,71.83,,,STANDING,160.8,1.052,81.6,0.87,A
144852,BASELINE,1,4.7,17.6,17.7,,17.65,113.0,112.8,,112.9,0.74,56.8,13.85,-0.06,47.47,-1.7,4.48,1.28,90.04,-1.52,6.48,STANDING,118.1,1.046,59.2,0.91,A
144854,BASELINE,1,8.7,32.3,32.3,,32.3,148.0,148.0,,148,1.14,104.3,14.75,0.87,80.78,-0.87,19.23,2.59,99.52,,,STANDING,147.5,0.997,76.5,0.93,A
144855,BASELINE,1,9.4,23.6,23.6,,23.6,139.3,139.4,,139.35,0.94,113,12.15,-1.62,5.26,-4.07,0,0.57,71.55,,,STANDING,137.5,0.987,84.0,0.66,A
144857,BASELINE,1,0.7,7.6,7.6,,7.6,70.0,70.0,,70,0.39,7.8,,-0.48,31.49,,,0.69,75.65,-1.06,14.52,RECUMBENT,68.0,0.971,32.0,1.19,A
144860,BASELINE,1,14,55.6,55.6,,55.6,174.5,174.5,,174.5,1.63,168.4,18.26,0.42,66.42,-0.37,35.52,1.33,90.77,,,STANDING,176.5,1.011,103.5,0.69,A
144861,BASELINE,1,4.1,20.6,20.6,,20.6,118.0,118.0,,118,0.82,48.8,14.79,1.68,95.31,-0.44,32.97,3.6,99.98,-0.45,32.54,STANDING,124.0,1.051,60.0,0.97,A
144865,BASELINE,2,9.7,30.2,30.2,,30.2,152.7,153.0,,152.85,1.11,116,12.93,-0.11,45.76,-2.96,0.15,2.39,99.16,,,STANDING,156.9,1.026,87.6,0.74,A
144866,BASELINE,1,23.3,73.3,73.3,,73.3,190.5,191.0,,190.75,1.96,279.8,20.15,,,,,,,,,STANDING,204.0,1.069,104.0,0.83,A
144867,BASELINE,1,13.7,35.6,36.2,35.8,35.866666667,160.0,159.5,,159.75,1.24,164.3,14.05,-1.83,3.38,-3.14,0.09,-0.22,41.36,,,STANDING,161.5,1.011,85.0,0.88,A
144874,BASELINE,1,8.5,32.1,32.1,,32.1,146.5,146.5,,146.5,1.13,102,14.96,0.95,82.94,-0.66,25.32,2.55,99.46,,,STANDING,152.4,1.04,76.2,0.92,A
144875,BASELINE,1,16.5,56.7,56.7,,56.7,182.8,183.0,,182.9,1.68,198.4,16.95,-0.65,25.67,-1.94,2.6,1.15,87.53,,,STANDING,190.5,1.042,102.0,0.79,A