random_ID,VISIT,SCREEN_NUM,VISIT_AGE,ARR_EVER,ARR_AGE,ARR_ACT,HTN_EVER,HTN_AGE,HTN_ACT,HYPO_EVER,HYPO_AGE,HYPO_ACT,EXER_EVER,EXER_AGE,EXER_ACT,CHF_EVER,CHF_AGE,CHF_ACT,SYNC_EVER,SYNC_AGE,SYNC_ACT,OTHCV_NUM,OTHCV_SP_0,OTHCV_AGE_0,OTHCV_ACT_0,HORM_EVER,HORM_AGE,HORM_ACT,OTHEND_NUM,ADD_EVER,OTHEND_AGE_0,OTHEND_ACT_0,ADD_AGE,ADD_ACT,HYPER_EVER,HYPER_AGE,HYPER_ACT,DELAY_EVER,DELAY_AGE,DELAY_ACT,LDIFF_EVER,LDIFF_AGE,LDIFF_ACT,OTHNEURO_NUM,OTHNEURO_SP_0,OTHNEURO_AGE_0,OTHNEURO_AGE_1,OTHNEURO_AGE_2,OTHNEURO_ACT_0,OTHNEURO_ACT_1,OTHNEURO_ACT_2,DEP_EVER,DEP_AGE,DEP_ACT,OTHPSYCH_NUM,OTHPSYCH_SP_0,OTHPSYCH_AGE_0,OTHPSYCH_AGE_1,OTHPSYCH_ACT_0,OTHPSYCH_ACT_1,AVSURG_EVER,AVSURG_AGE,OTHSURG_NUM,OTHSURG_SP_0,OTHSURG_AGE_0,OTHSURG_AGE_1,BB_NUM,BB_CODE1_0,BB_CODE1_1,BB_CODE1_2,BB_CODE1_3,BB_CODE1_4,BB_CODE1_5,BB_CODE1_6,BB_CODE2_0,BB_CODE2_1,BB_CODE2_2,BB_CODE2_3,BB_CODE2_4,BB_CODE2_5,BB_CODE2_6,BB_DOSE_0,BB_DOSE_1,BB_DOSE_2,BB_DOSE_3,BB_DOSE_4,BB_DOSE_5,BB_DOSE_6,BB_START_0,BB_START_1,BB_START_2,BB_START_3,BB_START_4,BB_START_5,BB_START_6,BB_STOP_0,BB_STOP_1,BB_STOP_2,BB_STOP_3,BB_STOP_4,BB_STOP_5,BB_STOP_6,ACE_NUM,ACE_CODE1_0,ACE_CODE1_1,ACE_CODE1_2,ACE_CODE1_3,ACE_CODE1_4,ACE_CODE2_0,ACE_CODE2_1,ACE_CODE2_2,ACE_CODE2_3,ACE_CODE2_4,ACE_DOSE_0,ACE_DOSE_1,ACE_DOSE_2,ACE_DOSE_3,ACE_DOSE_4,ACE_START_0,ACE_START_1,ACE_START_2,ACE_START_3,ACE_START_4,ACE_STOP_0,ACE_STOP_1,ACE_STOP_2,ACE_STOP_3,ACE_STOP_4,CA_NUM,CA_CODE1_0,CA_CODE1_1,CA_CODE1_2,CA_CODE2_0,CA_CODE2_1,CA_CODE2_2,CA_DOSE_0,CA_DOSE_1,CA_DOSE_2,CA_START_0,CA_START_1,CA_START_2,CA_STOP_0,CA_STOP_1,CA_STOP_2,ANTI_NUM,ANTI_CODE1_0,ANTI_CODE1_1,ANTI_CODE1_2,ANTI_CODE2_0,ANTI_CODE2_1,ANTI_CODE2_2,ANTI_DOSE_0,ANTI_DOSE_1,ANTI_DOSE_2,ANTI_START_0,ANTI_START_1,ANTI_START_2,ANTI_STOP_0,ANTI_STOP_1,ANTI_STOP_2,OTHMED_NUM,OTHMED_CODE1_0,OTHMED_CODE1_1,OTHMED_CODE1_2,OTHMED_CODE1_3,OTHMED_CODE1_4,OTHMED_CODE1_5,OTHMED_CODE1_6,OTHMED_CODE1_7,OTHMED_CODE2_0,OTHMED_CODE2_1,OTHMED_CODE2_2,OTHMED_CODE2_3,OTHMED_CODE2_4,OTHMED_CODE2_5,OTHMED_CODE2_6,OTHMED_CODE2_7,OTHMED_DOSE_0,OTHMED_DOSE_1,OTHMED_DOSE_2,OTHMED_DOSE_3,OTHMED_DOSE_4,OTHMED_DOSE_5,OTHMED_DOSE_6,OTHMED_DOSE_7,OTHMED_START_0,OTHMED_START_1,OTHMED_START_2,OTHMED_START_3,OTHMED_START_4,OTHMED_START_5,OTHMED_START_6,OTHMED_START_7,OTHMED_STOP_0,OTHMED_STOP_1,OTHMED_STOP_2,OTHMED_STOP_3,OTHMED_STOP_4,OTHMED_STOP_5,OTHMED_STOP_6,OTHMED_STOP_7,ALLG_NUM,ALLG_MCODE1_0,ALLG_MCODE1_1,ALLG_MCODE1_2,ALLG_MCODE1_3,ALLG_MCODE2_0,ALLG_MCODE2_1,ALLG_MCODE2_2,ALLG_MCODE2_3,ALLG_RCODE_0,ALLG_RCODE_1,ALLG_RCODE_2,ALLG_RCODE_3,INTOL_NUM,INTOL_MCODE1_0,INTOL_MCODE1_1,INTOL_MCODE1_2,INTOL_MCODE2_0,INTOL_MCODE2_1,INTOL_MCODE2_2,INTOL_RCODE_0,INTOL_RCODE_1,INTOL_RCODE_2,VER_ID
144508,0:Baseline,1,16,2:No,,-2,2:No,,-2,2:No,,-2,2:No,,-2,2:No,,-2,2:No,,-2,0,,,,2:No,,-2,0,1:Yes,,,10,1:Yes,1:Yes,10,1:Yes,2:No,,-2,1:Yes,10,1:Yes,3,Oppositional defiant disorder,10,10,10,1:Yes,1:Yes,1:Yes,1:Yes,14,1:Yes,0,,,,,,2:No,,0,,,,1,08,M,M,M,M,M,M,20,M,M,M,M,M,M,80,,,,,,,10,,,,,,,16,,,,,,,0,M,M,M,M,M,M,M,M,M,M,,,,,,,,,,,,,,,,0,M,M,M,M,M,M,,,,,,,,,,0,M,M,M,M,M,M,,,,,,,,,,4,16,24,09,99,M,M,M,M,00,99,02,99,M,M,M,M,20,2,0.5,150,,,,,14,10,14,14,,,,,,,,,,,,,0,M,M,M,M,M,M,M,M,M,M,M,M,0,M,M,M,M,M,M,M,M,M,A
144511,0:Baseline,1,8.4,2:No,,-2,2:No,,-2,2:No,,-2,2:No,,-2,2:No,,-2,2:No,,-2,0,,,,2:No,,-2,0,2:No,,,,-2,2:No,,-2,2:No,,-2,2:No,,-2,0,,,,,,,,2:No,,-2,0,,,,,,2:No,,0,,,,0,M,M,M,M,M,M,M,M,M,M,M,M,M,M,,,,,,,,,,,,,,,,,,,,,,0,M,M,M,M,M,M,M,M,M,M,,,,,,,,,,,,,,,,0,M,M,M,M,M,M,,,,,,,,,,0,M,M,M,M,M,M,,,,,,,,,,0,M,M,M,M,M,M,M,M,M,M,M,M,M,M,M,M,,,,,,,,,,,,,,,,,,,,,,,,,0,M,M,M,M,M,M,M,M,M,M,M,M,0,M,M,M,M,M,M,M,M,M,A
144515,0:Baseline,1,11.7,2:No,,-2,2:No,,-2,2:No,,-2,2:No,,-2,2:No,,-2,1:Yes,11,2:No,0,,,,2:No,,-2,0,2:No,,,,-2,2:No,,-2,2:No,,-2,2:No,,-2,0,,,,,,,,2:No,,-2,0,,,,,,2:No,,0,,,,4,08,08,08,08,M,M,M,04,04,04,04,M,M,M,25,50,75,50,,,,6,7,8,11,,,,7,8,11,11,,,,0,M,M,M,M,M,M,M,M,M,M,,,,,,,,,,,,,,,,0,M,M,M,M,M,M,,,,,,,,,,0,M,M,M,M,M,M,,,,,,,,,,2,09,99,M,M,M,M,M,M,08,99,M,M,M,M,M,M,,,,,,,,,7,9,,,,,,,,,,,,,,,0,M,M,M,M,M,M,M,M,M,M,M,M,0,M,M,M,M,M,M,M,M,M,A
144517,0:Baseline,1,19.3,2:No,,-2,2:No,,-2,2:No,,-2,2:No,,-2,2:No,,-2,2:No,,-2,0,,,,2:No,,-2,0,2:No,,,,-2,2:No,,-2,2:No,,-2,2:No,,-2,0,,,,,,,,2:No,,-2,0,,,,,,2:No,,0,,,,1,08,M,M,M,M,M,M,04,M,M,M,M,M,M,50,,,,,,,3,,,,,,,,,,,,,,0,M,M,M,M,M,M,M,M,M,M,,,,,,,,,,,,,,,,0,M,M,M,M,M,M,,,,,,,,,,0,M,M,M,M,M,M,,,,,,,,,,1,18,M,M,M,M,M,M,M,08,M,M,M,M,M,M,M,25,,,,,,,,,,,,,,,,,,,,,,,,0,M,M,M,M,M,M,M,M,M,M,M,M,0,M,M,M,M,M,M,M,M,M,A
144519,0:Baseline,1,23.9,2:No,,-2,2:No,,-2,2:No,,-2,2:No,,-2,2:No,,-2,2:No,,-2,0,,,,2:No,,-2,0,2:No,,,,-2,2:No,,-2,2:No,,-2,2:No,,-2,0,,,,,,,,2:No,,-2,0,,,,,,2:No,,0,,,,0,M,M,M,M,M,M,M,M,M,M,M,M,M,M,,,,,,,,,,,,,,,,,,,,,,0,M,M,M,M,M,M,M,M,M,M,,,,,,,,,,,,,,,,0,M,M,M,M,M,M,,,,,,,,,,0,M,M,M,M,M,M,,,,,,,,,,0,M,M,M,M,M,M,M,M,M,M,M,M,M,M,M,M,,,,,,,,,,,,,,,,,,,,,,,,,0,M,M,M,M,M,M,M,M,M,M,M,M,0,M,M,M,M,M,M,M,M,M,A
144520,0:Baseline,1,5.1,2:No,,-2,2:No,,-2,2:No,,-2,2:No,,-2,2:No,,-2,2:No,,-2,0,,,,2:No,,-2,0,2:No,,,,-2,2:No,,-2,2:No,,-2,2:No,,-2,0,,,,,,,,2:No,,-2,0,,,,,,2:No,,0,,,,1,08,M,M,M,M,M,M,20,M,M,M,M,M,M,20,,,,,,,4,,,,,,,5,,,,,,,0,M,M,M,M,M,M,M,M,M,M,,,,,,,,,,,,,,,,0,M,M,M,M,M,M,,,,,,,,,,0,M,M,M,M,M,M,,,,,,,,,,0,M,M,M,M,M,M,M,M,M,M,M,M,M,M,M,M,,,,,,,,,,,,,,,,,,,,,,,,,0,M,M,M,M,M,M,M,M,M,M,M,M,0,M,M,M,M,M,M,M,M,M,A
144525,0:Baseline,1,1.5,2:No,,-2,2:No,,-2,2:No,,-2,2:No,,-2,2:No,,-2,2:No,,-2,0,,,,2:No,,-2,0,2:No,,,,-2,2:No,,-2,2:No,,-2,2:No,,-2,0,,,,,,,,2:No,,-2,0,,,,,,2:No,,0,,,,0,M,M,M,M,M,M,M,M,M,M,M,M,M,M,,,,,,,,,,,,,,,,,,,,,,0,M,M,M,M,M,M,M,M,M,M,,,,,,,,,,,,,,,,0,M,M,M,M,M,M,,,,,,,,,,0,M,M,M,M,M,M,,,,,,,,,,0,M,M,M,M,M,M,M,M,M,M,M,M,M,M,M,M,,,,,,,,,,,,,,,,,,,,,,,,,0,M,M,M,M,M,M,M,M,M,M,M,M,0,M,M,M,M,M,M,M,M,M,A
144527,0:Baseline,1,11.3,2:No,,-2,2:No,,-2,2:No,,-2,1:Yes,2,1:Yes,2:No,,-2,2:No,,-2,0,,,,2:No,,-2,0,2:No,,,,-2,2:No,,-2,2:No,,-2,2:No,,-2,0,,,,,,,,2:No,,-2,0,,,,,,2:No,,0,,,,0,M,M,M,M,M,M,M,M,M,M,M,M,M,M,,,,,,,,,,,,,,,,,,,,,,0,M,M,M,M,M,M,M,M,M,M,,,,,,,,,,,,,,,,0,M,M,M,M,M,M,,,,,,,,,,0,M,M,M,M,M,M,,,,,,,,,,1,10,M,M,M,M,M,M,M,01,M,M,M,M,M,M,M,,,,,,,,,2,,,,,,,,,,,,,,,,1,03,M,M,M,15,M,M,M,3,M,M,M,0,M,M,M,M,M,M,M,M,M,A
144529,0:Baseline,1,3.6,2:No,,-2,2:No,,-2,2:No,,-2,2:No,,-2,2:No,,-2,2:No,,-2,0,,,,2:No,,-2,0,2:No,,,,-2,2:No,,-2,2:No,,-2,2:No,,-2,0,,,,,,,,2:No,,-2,0,,,,,,2:No,,0,,,,0,M,M,M,M,M,M,M,M,M,M,M,M,M,M,,,,,,,,,,,,,,,,,,,,,,0,M,M,M,M,M,M,M,M,M,M,,,,,,,,,,,,,,,,0,M,M,M,M,M,M,,,,,,,,,,0,M,M,M,M,M,M,,,,,,,,,,1,09,M,M,M,M,M,M,M,08,M,M,M,M,M,M,M,,,,,,,,,2,,,,,,,,,,,,,,,,0,M,M,M,M,M,M,M,M,M,M,M,M,0,M,M,M,M,M,M,M,M,M,A
144530,0:Baseline,1,6.6,2:No,,-2,2:No,,-2,2:No,,-2,2:No,,-2,2:No,,-2,2:No,,-2,0,,,,2:No,,-2,0,2:No,,,,-2,2:No,,-2,2:No,,-2,2:No,,-2,0,,,,,,,,2:No,,-2,0,,,,,,2:No,,0,,,,0,M,M,M,M,M,M,M,M,M,M,M,M,M,M,,,,,,,,,,,,,,,,,,,,,,0,M,M,M,M,M,M,M,M,M,M,,,,,,,,,,,,,,,,0,M,M,M,M,M,M,,,,,,,,,,0,M,M,M,M,M,M,,,,,,,,,,0,M,M,M,M,M,M,M,M,M,M,M,M,M,M,M,M,,,,,,,,,,,,,,,,,,,,,,,,,0,M,M,M,M,M,M,M,M,M,M,M,M,0,M,M,M,M,M,M,M,M,M,A
144531,0:Baseline,2,6.8,2:No,,-2,2:No,,-2,2:No,,-2,2:No,,-2,2:No,,-2,2:No,,-2,0,,,,2:No,,-2,0,2:No,,,,-2,2:No,,-2,2:No,,-2,2:No,,-2,0,,,,,,,,2:No,,-2,0,,,,,,2:No,,0,,,,1,08,M,M,M,M,M,M,04,M,M,M,M,M,M,25,,,,,,,6,,,,,,,6,,,,,,,0,M,M,M,M,M,M,M,M,M,M,,,,,,,,,,,,,,,,0,M,M,M,M,M,M,,,,,,,,,,1,01,M,M,02,M,M,10,,,6,,,6,,,0,M,M,M,M,M,M,M,M,M,M,M,M,M,M,M,M,,,,,,,,,,,,,,,,,,,,,,,,,1,03,M,M,M,04,M,M,M,3,M,M,M,0,M,M,M,M,M,M,M,M,M,A
144533,0:Baseline,1,7.1,2:No,,-2,2:No,,-2,2:No,,-2,2:No,,-2,2:No,,-2,2:No,,-2,0,,,,2:No,,-2,0,2:No,,,,-2,2:No,,-2,2:No,,-2,1:Yes,7,1:Yes,0,,,,,,,,2:No,,-2,0,,,,,,2:No,,0,,,,1,08,M,M,M,M,M,M,04,M,M,M,M,M,M,12.5,,,,,,,3,,,,,,,4,,,,,,,0,M,M,M,M,M,M,M,M,M,M,,,,,,,,,,,,,,,,3,11,11,11,08,08,08,60,120,180,4,5,5,5,5,7,0,M,M,M,M,M,M,,,,,,,,,,3,09,16,18,M,M,M,M,M,08,01,99,M,M,M,M,M,,30,,,,,,,1,7,6,,,,,,,,,,,,,,0,M,M,M,M,M,M,M,M,M,M,M,M,0,M,M,M,M,M,M,M,M,M,A
144534,0:Baseline,1,12.5,2:No,,-2,2:No,,-2,2:No,,-2,2:No,,-2,2:No,,-2,2:No,,-2,0,,,,2:No,,-2,0,2:No,,,,-2,2:No,,-2,2:No,,-2,2:No,,-2,0,,,,,,,,2:No,,-2,0,,,,,,2:No,,0,,,,1,08,M,M,M,M,M,M,04,M,M,M,M,M,M,25,,,,,,,8,,,,,,,11,,,,,,,0,M,M,M,M,M,M,M,M,M,M,,,,,,,,,,,,,,,,0,M,M,M,M,M,M,,,,,,,,,,0,M,M,M,M,M,M,,,,,,,,,,0,M,M,M,M,M,M,M,M,M,M,M,M,M,M,M,M,,,,,,,,,,,,,,,,,,,,,,,,,0,M,M,M,M,M,M,M,M,M,M,M,M,0,M,M,M,M,M,M,M,M,M,A
144535,0:Baseline,1,16.8,2:No,,-2,2:No,,-2,2:No,,-2,1:Yes,5,1:Yes,2:No,,-2,2:No,,-2,0,,,,2:No,,-2,0,2:No,,,,-2,2:No,,-2,2:No,,-2,2:No,,-2,0,,,,,,,,2:No,,-2,0,,,,,,2:No,,0,,,,1,08,M,M,M,M,M,M,04,M,M,M,M,M,M,50,,,,,,,5,,,,,,,16,,,,,,,1,13,M,M,M,M,04,M,M,M,M,10,,,,,5,,,,,16,,,,,0,M,M,M,M,M,M,,,,,,,,,,0,M,M,M,M,M,M,,,,,,,,,,0,M,M,M,M,M,M,M,M,M,M,M,M,M,M,M,M,,,,,,,,,,,,,,,,,,,,,,,,,0,M,M,M,M,M,M,M,M,M,M,M,M,0,M,M,M,M,M,M,M,M,M,A
144537,0:Baseline,1,19.6,1:Yes,10,2:No,2:No,,-2,1:Yes,14,2:No,1:Yes,12,1:Yes,2:No,,-2,2:No,,-2,0,,,,2:No,,-2,0,1:Yes,,,8,2:No,2:No,,-2,2:No,,-2,1:Yes,8,2:No,0,,,,,,,,2:No,,-2,0,,,,,,2:No,,0,,,,1,08,M,M,M,M,M,M,04,M,M,M,M,M,M,25,,,,,,,11,,,,,,,12,,,,,,,1,13,M,M,M,M,04,M,M,M,M,20,,,,,14,,,,,19,,,,,0,M,M,M,M,M,M,,,,,,,,,,0,M,M,M,M,M,M,,,,,,,,,,0,M,M,M,M,M,M,M,M,M,M,M,M,M,M,M,M,,,,,,,,,,,,,,,,,,,,,,,,,0,M,M,M,M,M,M,M,M,M,M,M,M,0,M,M,M,M,M,M,M,M,M,A
144538,0:Baseline,1,13.9,2:No,,-2,2:No,,-2,2:No,,-2,2:No,,-2,2:No,,-2,2:No,,-2,0,,,,2:No,,-2,0,2:No,,,,-2,2:No,,-2,2:No,,-2,2:No,,-2,0,,,,,,,,2:No,,-2,0,,,,,,2:No,,0,,,,1,08,M,M,M,M,M,M,04,M,M,M,M,M,M,200,,,,,,,6,,,,,,,13,,,,,,,0,M,M,M,M,M,M,M,M,M,M,,,,,,,,,,,,,,,,0,M,M,M,M,M,M,,,,,,,,,,0,M,M,M,M,M,M,,,,,,,,,,0,M,M,M,M,M,M,M,M,M,M,M,M,M,M,M,M,,,,,,,,,,,,,,,,,,,,,,,,,0,M,M,M,M,M,M,M,M,M,M,M,M,0,M,M,M,M,M,M,M,M,M,A
144544,0:Baseline,1,17.9,2:No,,-2,2:No,,-2,2:No,,-2,2:No,,-2,2:No,,-2,2:No,,-2,0,,,,2:No,,-2,0,2:No,,,,-2,2:No,,-2,2:No,,-2,2:No,,-2,0,,,,,,,,2:No,,-2,0,,,,,,2:No,,0,,,,0,M,M,M,M,M,M,M,M,M,M,M,M,M,M,,,,,,,,,,,,,,,,,,,,,,0,M,M,M,M,M,M,M,M,M,M,,,,,,,,,,,,,,,,0,M,M,M,M,M,M,,,,,,,,,,0,M,M,M,M,M,M,,,,,,,,,,0,M,M,M,M,M,M,M,M,M,M,M,M,M,M,M,M,,,,,,,,,,,,,,,,,,,,,,,,,0,M,M,M,M,M,M,M,M,M,M,M,M,0,M,M,M,M,M,M,M,M,M,A
144548,0:Baseline,1,14.2,2:No,,-2,2:No,,-2,2:No,,-2,2:No,,-2,2:No,,-2,2:No,,-2,0,,,,2:No,,-2,0,1:Yes,,,9,1:Yes,1:Yes,9,1:Yes,2:No,,-2,2:No,,-2,0,,,,,,,,2:No,,-2,0,,,,,,2:No,,0,,,,0,M,M,M,M,M,M,M,M,M,M,M,M,M,M,,,,,,,,,,,,,,,,,,,,,,0,M,M,M,M,M,M,M,M,M,M,,,,,,,,,,,,,,,,0,M,M,M,M,M,M,,,,,,,,,,0,M,M,M,M,M,M,,,,,,,,,,1,24,M,M,M,M,M,M,M,01,M,M,M,M,M,M,M,10,,,,,,,,9,,,,,,,,,,,,,,,,0,M,M,M,M,M,M,M,M,M,M,M,M,0,M,M,M,M,M,M,M,M,M,A
144549,0:Baseline,1,5.3,2:No,,-2,2:No,,-2,2:No,,-2,2:No,,-2,2:No,,-2,2:No,,-2,0,,,,2:No,,-2,0,2:No,,,,-2,2:No,,-2,2:No,,-2,2:No,,-2,0,,,,,,,,2:No,,-2,0,,,,,,2:No,,0,,,,0,M,M,M,M,M,M,M,M,M,M,M,M,M,M,,,,,,,,,,,,,,,,,,,,,,0,M,M,M,M,M,M,M,M,M,M,,,,,,,,,,,,,,,,0,M,M,M,M,M,M,,,,,,,,,,0,M,M,M,M,M,M,,,,,,,,,,0,M,M,M,M,M,M,M,M,M,M,M,M,M,M,M,M,,,,,,,,,,,,,,,,,,,,,,,,,0,M,M,M,M,M,M,M,M,M,M,M,M,0,M,M,M,M,M,M,M,M,M,A
144552,0:Baseline,1,19,2:No,,-2,2:No,,-2,2:No,,-2,2:No,,-2,2:No,,-2,2:No,,-2,0,,,,2:No,,-2,0,2:No,,,,-2,2:No,,-2,2:No,,-2,2:No,,-2,0,,,,,,,,2:No,,-2,0,,,,,,2:No,,0,,,,0,M,M,M,M,M,M,M,M,M,M,M,M,M,M,,,,,,,,,,,,,,,,,,,,,,0,M,M,M,M,M,M,M,M,M,M,,,,,,,,,,,,,,,,0,M,M,M,M,M,M,,,,,,,,,,0,M,M,M,M,M,M,,,,,,,,,,0,M,M,M,M,M,M,M,M,M,M,M,M,M,M,M,M,,,,,,,,,,,,,,,,,,,,,,,,,0,M,M,M,M,M,M,M,M,M,M,M,M,0,M,M,M,M,M,M,M,M,M,A
144553,0:Baseline,1,4.5,2:No,,-2,2:No,,-2,2:No,,-2,2:No,,-2,2:No,,-2,2:No,,-2,0,,,,2:No,,-2,0,2:No,,,,-2,2:No,,-2,2:No,,-2,2:No,,-2,0,,,,,,,,2:No,,-2,0,,,,,,2:No,,0,,,,1,08,M,M,M,M,M,M,04,M,M,M,M,M,M,30,,,,,,,0,,,,,,,5,,,,,,,0,M,M,M,M,M,M,M,M,M,M,,,,,,,,,,,,,,,,0,M,M,M,M,M,M,,,,,,,,,,0,M,M,M,M,M,M,,,,,,,,,,1,25,M,M,M,M,M,M,M,05,M,M,M,M,M,M,M,5,,,,,,,,4,,,,,,,,,,,,,,,,0,M,M,M,M,M,M,M,M,M,M,M,M,0,M,M,M,M,M,M,M,M,M,A
144554,0:Baseline,1,14.9,2:No,,-2,2:No,,-2,2:No,,-2,2:No,,-2,2:No,,-2,2:No,,-2,0,,,,2:No,,-2,0,2:No,,,,-2,2:No,,-2,2:No,,-2,2:No,,-2,0,,,,,,,,2:No,,-2,0,,,,,,2:No,,0,,,,1,08,M,M,M,M,M,M,04,M,M,M,M,M,M,50,,,,,,,10,,,,,,,,,,,,,,0,M,M,M,M,M,M,M,M,M,M,,,,,,,,,,,,,,,,0,M,M,M,M,M,M,,,,,,,,,,0,M,M,M,M,M,M,,,,,,,,,,0,M,M,M,M,M,M,M,M,M,M,M,M,M,M,M,M,,,,,,,,,,,,,,,,,,,,,,,,,0,M,M,M,M,M,M,M,M,M,M,M,M,0,M,M,M,M,M,M,M,M,M,A
144555,0:Baseline,1,3.9,2:No,,-2,2:No,,-2,2:No,,-2,2:No,,-2,2:No,,-2,2:No,,-2,0,,,,2:No,,-2,0,2:No,,,,-2,2:No,,-2,2:No,,-2,2:No,,-2,0,,,,,,,,2:No,,-2,0,,,,,,2:No,,0,,,,1,08,M,M,M,M,M,M,04,M,M,M,M,M,M,,,,,,,,1,,,,,,,4,,,,,,,0,M,M,M,M,M,M,M,M,M,M,,,,,,,,,,,,,,,,0,M,M,M,M,M,M,,,,,,,,,,0,M,M,M,M,M,M,,,,,,,,,,1,09,M,M,M,M,M,M,M,08,M,M,M,M,M,M,M,,,,,,,,,2,,,,,,,,,,,,,,,,0,M,M,M,M,M,M,M,M,M,M,M,M,0,M,M,M,M,M,M,M,M,M,A
144556,0:Baseline,1,9.3,2:No,,-2,2:No,,-2,2:No,,-2,2:No,,-2,2:No,,-2,2:No,,-2,0,,,,2:No,,-2,0,2:No,,,,-2,2:No,,-2,2:No,,-2,2:No,,-2,0,,,,,,,,2:No,,-2,0,,,,,,2:No,,0,,,,1,08,M,M,M,M,M,M,04,M,M,M,M,M,M,70,,,,,,,5,,,,,,,,,,,,,,0,M,M,M,M,M,M,M,M,M,M,,,,,,,,,,,,,,,,0,M,M,M,M,M,M,,,,,,,,,,0,M,M,M,M,M,M,,,,,,,,,,0,M,M,M,M,M,M,M,M,M,M,M,M,M,M,M,M,,,,,,,,,,,,,,,,,,,,,,,,,0,M,M,M,M,M,M,M,M,M,M,M,M,0,M,M,M,M,M,M,M,M,M,A
144558,0:Baseline,1,2.3,2:No,,-2,2:No,,-2,2:No,,-2,2:No,,-2,2:No,,-2,2:No,,-2,0,,,,2:No,,-2,0,2:No,,,,-2,2:No,,-2,2:No,,-2,2:No,,-2,0,,,,,,,,2:No,,-2,0,,,,,,2:No,,0,,,,1,08,M,M,M,M,M,M,20,M,M,M,M,M,M,6,,,,,,,0,,,,,,,2,,,,,,,0,M,M,M,M,M,M,M,M,M,M,,,,,,,,,,,,,,,,0,M,M,M,M,M,M,,,,,,,,,,0,M,M,M,M,M,M,,,,,,,,,,1,09,M,M,M,M,M,M,M,08,M,M,M,M,M,M,M,,,,,,,,,2,,,,,,,,,,,,,,,,0,M,M,M,M,M,M,M,M,M,M,M,M,0,M,M,M,M,M,M,M,M,M,A
144568,0:Baseline,1,13.7,2:No,,-2,2:No,,-2,2:No,,-2,2:No,,-2,2:No,,-2,2:No,,-2,0,,,,2:No,,-2,0,2:No,,,,-2,2:No,,-2,2:No,,-2,2:No,,-2,0,,,,,,,,2:No,,-2,0,,,,,,2:No,,0,,,,0,M,M,M,M,M,M,M,M,M,M,M,M,M,M,,,,,,,,,,,,,,,,,,,,,,0,M,M,M,M,M,M,M,M,M,M,,,,,,,,,,,,,,,,0,M,M,M,M,M,M,,,,,,,,,,0,M,M,M,M,M,M,,,,,,,,,,0,M,M,M,M,M,M,M,M,M,M,M,M,M,M,M,M,,,,,,,,,,,,,,,,,,,,,,,,,0,M,M,M,M,M,M,M,M,M,M,M,M,0,M,M,M,M,M,M,M,M,M,A
144572,0:Baseline,1,11.3,2:No,,-2,2:No,,-2,2:No,,-2,2:No,,-2,2:No,,-2,2:No,,-2,0,,,,2:No,,-2,0,2:No,,,,-2,2:No,,-2,2:No,,-2,2:No,,-2,0,,,,,,,,2:No,,-2,0,,,,,,2:No,,0,,,,2,08,08,M,M,M,M,M,04,04,M,M,M,M,M,25,50,,,,,,4,9,,,,,,9,10,,,,,,0,M,M,M,M,M,M,M,M,M,M,,,,,,,,,,,,,,,,0,M,M,M,M,M,M,,,,,,,,,,0,M,M,M,M,M,M,,,,,,,,,,0,M,M,M,M,M,M,M,M,M,M,M,M,M,M,M,M,,,,,,,,,,,,,,,,,,,,,,,,,0,M,M,M,M,M,M,M,M,M,M,M,M,0,M,M,M,M,M,M,M,M,M,A
144573,0:Baseline,1,6.9,2:No,,-2,2:No,,-2,2:No,,-2,2:No,,-2,2:No,,-2,2:No,,-2,0,,,,2:No,,-2,0,2:No,,,,-2,2:No,,-2,2:No,,-2,1:Yes,6,1:Yes,0,,,,,,,,2:No,,-2,0,,,,,,2:No,,0,,,,0,M,M,M,M,M,M,M,M,M,M,M,M,M,M,,,,,,,,,,,,,,,,,,,,,,0,M,M,M,M,M,M,M,M,M,M,,,,,,,,,,,,,,,,0,M,M,M,M,M,M,,,,,,,,,,0,M,M,M,M,M,M,,,,,,,,,,0,M,M,M,M,M,M,M,M,M,M,M,M,M,M,M,M,,,,,,,,,,,,,,,,,,,,,,,,,0,M,M,M,M,M,M,M,M,M,M,M,M,0,M,M,M,M,M,M,M,M,M,A
144574,0:Baseline,1,17.7,2:No,,-2,2:No,,-2,2:No,,-2,2:No,,-2,2:No,,-2,2:No,,-2,0,,,,2:No,,-2,0,2:No,,,,-2,2:No,,-2,2:No,,-2,2:No,,-2,0,,,,,,,,2:No,,-2,0,,,,,,2:No,,0,,,,1,08,M,M,M,M,M,M,04,M,M,M,M,M,M,25,,,,,,,4,,,,,,,17,,,,,,,0,M,M,M,M,M,M,M,M,M,M,,,,,,,,,,,,,,,,0,M,M,M,M,M,M,,,,,,,,,,0,M,M,M,M,M,M,,,,,,,,,,0,M,M,M,M,M,M,M,M,M,M,M,M,M,M,M,M,,,,,,,,,,,,,,,,,,,,,,,,,1,22,M,M,M,15,M,M,M,4,M,M,M,0,M,M,M,M,M,M,M,M,M,A
144576,0:Baseline,1,4,2:No,,-2,2:No,,-2,2:No,,-2,2:No,,-2,2:No,,-2,2:No,,-2,0,,,,2:No,,-2,0,2:No,,,,-2,2:No,,-2,2:No,,-2,2:No,,-2,0,,,,,,,,2:No,,-2,0,,,,,,2:No,,0,,,,0,M,M,M,M,M,M,M,M,M,M,M,M,M,M,,,,,,,,,,,,,,,,,,,,,,0,M,M,M,M,M,M,M,M,M,M,,,,,,,,,,,,,,,,0,M,M,M,M,M,M,,,,,,,,,,0,M,M,M,M,M,M,,,,,,,,,,0,M,M,M,M,M,M,M,M,M,M,M,M,M,M,M,M,,,,,,,,,,,,,,,,,,,,,,,,,0,M,M,M,M,M,M,M,M,M,M,M,M,0,M,M,M,M,M,M,M,M,M,A
144579,0:Baseline,1,11.8,2:No,,-2,2:No,,-2,2:No,,-2,2:No,,-2,2:No,,-2,2:No,,-2,0,,,,2:No,,-2,0,2:No,,,,-2,2:No,,-2,2:No,,-2,2:No,,-2,0,,,,,,,,2:No,,-2,0,,,,,,2:No,,0,,,,2,08,08,M,M,M,M,M,04,04,M,M,M,M,M,25,50,,,,,,8,9,,,,,,9,12,,,,,,0,M,M,M,M,M,M,M,M,M,M,,,,,,,,,,,,,,,,0,M,M,M,M,M,M,,,,,,,,,,0,M,M,M,M,M,M,,,,,,,,,,2,22,25,M,M,M,M,M,M,06,01,M,M,M,M,M,M,400,,,,,,,,10,10,,,,,,,,,,,,,,,0,M,M,M,M,M,M,M,M,M,M,M,M,0,M,M,M,M,M,M,M,M,M,A
144581,0:Baseline,1,13.3,2:No,,-2,2:No,,-2,2:No,,-2,2:No,,-2,2:No,,-2,2:No,,-2,0,,,,2:No,,-2,0,2:No,,,,-2,2:No,,-2,2:No,,-2,2:No,,-2,0,,,,,,,,2:No,,-2,0,,,,,,2:No,,0,,,,0,M,M,M,M,M,M,M,M,M,M,M,M,M,M,,,,,,,,,,,,,,,,,,,,,,0,M,M,M,M,M,M,M,M,M,M,,,,,,,,,,,,,,,,0,M,M,M,M,M,M,,,,,,,,,,0,M,M,M,M,M,M,,,,,,,,,,0,M,M,M,M,M,M,M,M,M,M,M,M,M,M,M,M,,,,,,,,,,,,,,,,,,,,,,,,,0,M,M,M,M,M,M,M,M,M,M,M,M,0,M,M,M,M,M,M,M,M,M,A
144582,0:Baseline,1,10.8,2:No,,-2,2:No,,-2,2:No,,-2,2:No,,-2,2:No,,-2,2:No,,-2,0,,,,2:No,,-2,0,1:Yes,,,8,1:Yes,1:Yes,8,1:Yes,2:No,,-2,2:No,,-2,0,,,,,,,,2:No,,-2,1,ANXIETY,9,,2:No,,2:No,,0,,,,1,08,M,M,M,M,M,M,04,M,M,M,M,M,M,12.5,,,,,,,5,,,,,,,10,,,,,,,0,M,M,M,M,M,M,M,M,M,M,,,,,,,,,,,,,,,,0,M,M,M,M,M,M,,,,,,,,,,0,M,M,M,M,M,M,,,,,,,,,,1,24,M,M,M,M,M,M,M,03,M,M,M,M,M,M,M,10,,,,,,,,9,,,,,,,,,,,,,,,,0,M,M,M,M,M,M,M,M,M,M,M,M,0,M,M,M,M,M,M,M,M,M,A
144584,0:Baseline,1,15.3,2:No,,-2,2:No,,-2,2:No,,-2,2:No,,-2,2:No,,-2,2:No,,-2,0,,,,2:No,,-2,0,2:No,,,,-2,2:No,,-2,2:No,,-2,2:No,,-2,0,,,,,,,,2:No,,-2,0,,,,,,2:No,,0,,,,3,08,08,08,M,M,M,M,04,04,04,M,M,M,M,25,50,25,,,,,10,11,14,,,,,11,13,15,,,,,0,M,M,M,M,M,M,M,M,M,M,,,,,,,,,,,,,,,,0,M,M,M,M,M,M,,,,,,,,,,0,M,M,M,M,M,M,,,,,,,,,,2,25,25,M,M,M,M,M,M,04,04,M,M,M,M,M,M,5,10,,,,,,,12,15,,,,,,,14,,,,,,,,0,M,M,M,M,M,M,M,M,M,M,M,M,0,M,M,M,M,M,M,M,M,M,A
144587,0:Baseline,2,22.3,2:No,,-2,2:No,,-2,2:No,,-2,2:No,,-2,2:No,,-2,2:No,,-2,0,,,,2:No,,-2,0,2:No,,,,-2,2:No,,-2,2:No,,-2,2:No,,-2,0,,,,,,,,1:Yes,16,2:No,0,,,,,,2:No,,0,,,,3,08,08,08,M,M,M,M,04,14,14,M,M,M,M,,25,50,,,,,14,15,18,,,,,15,18,22,,,,,0,M,M,M,M,M,M,M,M,M,M,,,,,,,,,,,,,,,,0,M,M,M,M,M,M,,,,,,,,,,0,M,M,M,M,M,M,,,,,,,,,,1,16,M,M,M,M,M,M,M,09,M,M,M,M,M,M,M,,,,,,,,,21,,,,,,,,21,,,,,,,,1,18,M,M,M,04,M,M,M,99,M,M,M,0,M,M,M,M,M,M,M,M,M,A
144588,0:Baseline,1,12.2,2:No,,-2,2:No,,-2,2:No,,-2,2:No,,-2,2:No,,-2,2:No,,-2,0,,,,2:No,,-2,0,2:No,,,,-2,2:No,,-2,2:No,,-2,2:No,,-2,0,,,,,,,,2:No,,-2,0,,,,,,2:No,,0,,,,3,08,08,08,M,M,M,M,04,04,04,M,M,M,M,,12.5,,,,,,3,5,6,,,,,5,6,12,,,,,1,13,M,M,M,M,04,M,M,M,M,5,,,,,5,,,,,9,,,,,0,M,M,M,M,M,M,,,,,,,,,,2,01,01,M,02,02,M,12.5,25,,9,12,,12,12,,3,22,22,09,M,M,M,M,M,09,01,08,M,M,M,M,M,,,,,,,,,8,8,,,,,,,,,,,,,,,0,M,M,M,M,M,M,M,M,M,M,M,M,0,M,M,M,M,M,M,M,M,M,A
144589,0:Baseline,1,5.7,2:No,,-2,2:No,,-2,2:No,,-2,1:Yes,3,1:Yes,2:No,,-2,2:No,,-2,0,,,,2:No,,-2,0,2:No,,,,-2,2:No,,-2,2:No,,-2,2:No,,-2,0,,,,,,,,2:No,,-2,0,,,,,,2:No,,0,,,,1,08,M,M,M,M,M,M,04,M,M,M,M,M,M,12.5,,,,,,,0,,,,,,,5,,,,,,,1,13,M,M,M,M,04,M,M,M,M,5,,,,,1,,,,,5,,,,,0,M,M,M,M,M,M,,,,,,,,,,0,M,M,M,M,M,M,,,,,,,,,,0,M,M,M,M,M,M,M,M,M,M,M,M,M,M,M,M,,,,,,,,,,,,,,,,,,,,,,,,,0,M,M,M,M,M,M,M,M,M,M,M,M,0,M,M,M,M,M,M,M,M,M,A
144591,0:Baseline,1,15.6,2:No,,-2,2:No,,-2,2:No,,-2,2:No,,-2,2:No,,-2,2:No,,-2,0,,,,2:No,,-2,0,2:No,,,,-2,2:No,,-2,2:No,,-2,2:No,,-2,0,,,,,,,,2:No,,-2,0,,,,,,2:No,,0,,,,1,08,M,M,M,M,M,M,04,M,M,M,M,M,M,25,,,,,,,15,,,,,,,15,,,,,,,0,M,M,M,M,M,M,M,M,M,M,,,,,,,,,,,,,,,,0,M,M,M,M,M,M,,,,,,,,,,0,M,M,M,M,M,M,,,,,,,,,,0,M,M,M,M,M,M,M,M,M,M,M,M,M,M,M,M,,,,,,,,,,,,,,,,,,,,,,,,,0,M,M,M,M,M,M,M,M,M,M,M,M,0,M,M,M,M,M,M,M,M,M,A
144593,0:Baseline,1,14.3,2:No,,-2,2:No,,-2,2:No,,-2,2:No,,-2,2:No,,-2,2:No,,-2,0,,,,2:No,,-2,0,2:No,,,,-2,2:No,,-2,2:No,,-2,1:Yes,7,1:Yes,0,,,,,,,,1:Yes,9,1:Yes,1,mood swings,12,,1:Yes,,2:No,,0,,,,1,08,M,M,M,M,M,M,04,M,M,M,M,M,M,50,,,,,,,0,,,,,,,,,,,,,,0,M,M,M,M,M,M,M,M,M,M,,,,,,,,,,,,,,,,0,M,M,M,M,M,M,,,,,,,,,,0,M,M,M,M,M,M,,,,,,,,,,2,99,04,M,M,M,M,M,M,99,99,M,M,M,M,M,M,100,300,,,,,,,9,12,,,,,,,,,,,,,,,1,99,M,M,M,99,M,M,M,3,M,M,M,0,M,M,M,M,M,M,M,M,M,A
144594,0:Baseline,1,11.5,2:No,,-2,2:No,,-2,2:No,,-2,2:No,,-2,2:No,,-2,2:No,,-2,0,,,,2:No,,-2,0,2:No,,,,-2,2:No,,-2,2:No,,-2,2:No,,-2,0,,,,,,,,2:No,,-2,0,,,,,,2:No,,0,,,,1,08,M,M,M,M,M,M,04,M,M,M,M,M,M,25,,,,,,,11,,,,,,,11,,,,,,,0,M,M,M,M,M,M,M,M,M,M,,,,,,,,,,,,,,,,0,M,M,M,M,M,M,,,,,,,,,,0,M,M,M,M,M,M,,,,,,,,,,0,M,M,M,M,M,M,M,M,M,M,M,M,M,M,M,M,,,,,,,,,,,,,,,,,,,,,,,,,0,M,M,M,M,M,M,M,M,M,M,M,M,0,M,M,M,M,M,M,M,M,M,A
144595,0:Baseline,1,18,2:No,,-2,2:No,,-2,2:No,,-2,2:No,,-2,2:No,,-2,2:No,,-2,0,,,,2:No,,-2,0,2:No,,,,-2,2:No,,-2,2:No,,-2,2:No,,-2,0,,,,,,,,2:No,,-2,0,,,,,,2:No,,1,Pectus surgery,16,,0,M,M,M,M,M,M,M,M,M,M,M,M,M,M,,,,,,,,,,,,,,,,,,,,,,0,M,M,M,M,M,M,M,M,M,M,,,,,,,,,,,,,,,,0,M,M,M,M,M,M,,,,,,,,,,0,M,M,M,M,M,M,,,,,,,,,,0,M,M,M,M,M,M,M,M,M,M,M,M,M,M,M,M,,,,,,,,,,,,,,,,,,,,,,,,,0,M,M,M,M,M,M,M,M,M,M,M,M,0,M,M,M,M,M,M,M,M,M,A
144597,0:Baseline,1,1.2,2:No,,-2,2:No,,-2,2:No,,-2,2:No,,-2,2:No,,-2,2:No,,-2,0,,,,2:No,,-2,0,2:No,,,,-2,2:No,,-2,2:No,,-2,2:No,,-2,2,delayed walking,1,1,,1:Yes,1:Yes,,2:No,,-2,0,,,,,,2:No,,0,,,,0,M,M,M,M,M,M,M,M,M,M,M,M,M,M,,,,,,,,,,,,,,,,,,,,,,0,M,M,M,M,M,M,M,M,M,M,,,,,,,,,,,,,,,,0,M,M,M,M,M,M,,,,,,,,,,0,M,M,M,M,M,M,,,,,,,,,,0,M,M,M,M,M,M,M,M,M,M,M,M,M,M,M,M,,,,,,,,,,,,,,,,,,,,,,,,,0,M,M,M,M,M,M,M,M,M,M,M,M,0,M,M,M,M,M,M,M,M,M,A
144600,0:Baseline,1,6.4,2:No,,-2,2:No,,-2,2:No,,-2,2:No,,-2,2:No,,-2,2:No,,-2,0,,,,2:No,,-2,0,2:No,,,,-2,2:No,,-2,2:No,,-2,1:Yes,5,1:Yes,1,patent foramen ovale,0,,,1:Yes,,,2:No,,-2,0,,,,,,2:No,,0,,,,2,08,08,M,M,M,M,M,20,04,M,M,M,M,M,,,,,,,,1,1,,,,,,1,2,,,,,,0,M,M,M,M,M,M,M,M,M,M,,,,,,,,,,,,,,,,3,11,11,11,08,08,08,80,120,180,2,5,6,5,6,6,0,M,M,M,M,M,M,,,,,,,,,,2,25,09,M,M,M,M,M,M,04,08,M,M,M,M,M,M,5,,,,,,,,3,3,,,,,,,,,,,,,,,1,03,M,M,M,04,M,M,M,3,M,M,M,0,M,M,M,M,M,M,M,M,M,A
144605,0:Baseline,1,0.6,2:No,,-2,2:No,,-2,2:No,,-2,2:No,,-2,2:No,,-2,2:No,,-2,0,,,,2:No,,-2,0,2:No,,,,-2,2:No,,-2,2:No,,-2,2:No,,-2,0,,,,,,,,2:No,,-2,0,,,,,,2:No,,0,,,,0,M,M,M,M,M,M,M,M,M,M,M,M,M,M,,,,,,,,,,,,,,,,,,,,,,0,M,M,M,M,M,M,M,M,M,M,,,,,,,,,,,,,,,,0,M,M,M,M,M,M,,,,,,,,,,0,M,M,M,M,M,M,,,,,,,,,,0,M,M,M,M,M,M,M,M,M,M,M,M,M,M,M,M,,,,,,,,,,,,,,,,,,,,,,,,,0,M,M,M,M,M,M,M,M,M,M,M,M,0,M,M,M,M,M,M,M,M,M,A
144606,0:Baseline,1,9.9,2:No,,-2,2:No,,-2,2:No,,-2,2:No,,-2,2:No,,-2,2:No,,-2,0,,,,2:No,,-2,0,2:No,,,,-2,2:No,,-2,2:No,,-2,2:No,,-2,0,,,,,,,,2:No,,-2,0,,,,,,2:No,,0,,,,1,08,M,M,M,M,M,M,04,M,M,M,M,M,M,25,,,,,,,8,,,,,,,9,,,,,,,0,M,M,M,M,M,M,M,M,M,M,,,,,,,,,,,,,,,,0,M,M,M,M,M,M,,,,,,,,,,0,M,M,M,M,M,M,,,,,,,,,,0,M,M,M,M,M,M,M,M,M,M,M,M,M,M,M,M,,,,,,,,,,,,,,,,,,,,,,,,,0,M,M,M,M,M,M,M,M,M,M,M,M,0,M,M,M,M,M,M,M,M,M,A
144607,0:Baseline,1,22.8,2:No,,-2,1:Yes,19,2:No,2:No,,-2,2:No,,-2,2:No,,-2,1:Yes,,2:No,1,Shortness of Breath,23,1:Yes,2:No,,-2,0,2:No,,,,-2,2:No,,-2,2:No,,-2,2:No,,-2,0,,,,,,,,2:No,,-2,0,,,,,,2:No,,0,,,,3,08,08,08,M,M,M,M,04,04,14,M,M,M,M,25,50,50,,,,,11,13,16,,,,,13,15,23,,,,,0,M,M,M,M,M,M,M,M,M,M,,,,,,,,,,,,,,,,0,M,M,M,M,M,M,,,,,,,,,,0,M,M,M,M,M,M,,,,,,,,,,1,18,M,M,M,M,M,M,M,99,M,M,M,M,M,M,M,,,,,,,,,19,,,,,,,,,,,,,,,,0,M,M,M,M,M,M,M,M,M,M,M,M,0,M,M,M,M,M,M,M,M,M,A
144609,0:Baseline,1,22,2:No,,-2,2:No,,-2,2:No,,-2,2:No,,-2,2:No,,-2,2:No,,-2,0,,,,2:No,,-2,0,1:Yes,,,,2:No,1:Yes,5,2:No,2:No,,-2,2:No,,-2,0,,,,,,,,1:Yes,,2:No,0,,,,,,2:No,,0,,,,1,08,M,M,M,M,M,M,04,M,M,M,M,M,M,25,,,,,,,,,,,,,,21,,,,,,,0,M,M,M,M,M,M,M,M,M,M,,,,,,,,,,,,,,,,0,M,M,M,M,M,M,,,,,,,,,,0,M,M,M,M,M,M,,,,,,,,,,0,M,M,M,M,M,M,M,M,M,M,M,M,M,M,M,M,,,,,,,,,,,,,,,,,,,,,,,,,0,M,M,M,M,M,M,M,M,M,M,M,M,0,M,M,M,M,M,M,M,M,M,A
144612,0:Baseline,1,5.8,2:No,,-2,2:No,,-2,2:No,,-2,2:No,,-2,2:No,,-2,2:No,,-2,0,,,,2:No,,-2,0,2:No,,,,-2,2:No,,-2,2:No,,-2,2:No,,-2,0,,,,,,,,2:No,,-2,0,,,,,,2:No,,0,,,,1,08,M,M,M,M,M,M,04,M,M,M,M,M,M,10,,,,,,,2,,,,,,,6,,,,,,,0,M,M,M,M,M,M,M,M,M,M,,,,,,,,,,,,,,,,0,M,M,M,M,M,M,,,,,,,,,,0,M,M,M,M,M,M,,,,,,,,,,0,M,M,M,M,M,M,M,M,M,M,M,M,M,M,M,M,,,,,,,,,,,,,,,,,,,,,,,,,0,M,M,M,M,M,M,M,M,M,M,M,M,0,M,M,M,M,M,M,M,M,M,A
144613,0:Baseline,1,9.8,2:No,,-2,2:No,,-2,2:No,,-2,2:No,,-2,2:No,,-2,2:No,,-2,0,,,,2:No,,-2,0,2:No,,,,-2,2:No,,-2,2:No,,-2,2:No,,-2,0,,,,,,,,2:No,,-2,0,,,,,,2:No,,0,,,,1,08,M,M,M,M,M,M,04,M,M,M,M,M,M,25,,,,,,,8,,,,,,,,,,,,,,0,M,M,M,M,M,M,M,M,M,M,,,,,,,,,,,,,,,,0,M,M,M,M,M,M,,,,,,,,,,0,M,M,M,M,M,M,,,,,,,,,,0,M,M,M,M,M,M,M,M,M,M,M,M,M,M,M,M,,,,,,,,,,,,,,,,,,,,,,,,,0,M,M,M,M,M,M,M,M,M,M,M,M,0,M,M,M,M,M,M,M,M,M,A