random_ID,VISIT,SCREEN_NUM,VISIT_AGE,RELATIVE,REL_NUM,RELCODE_0,RELCODE_1,RELCODE_2,RELCODE_3,RELCODE_4,AORANEUR_0,AORANEUR_1,AORANEUR_2,AORANEUR_3,AORANEUR_4,ANEURLOC_0,ANEURLOC_1,ANEURLOC_2,ANEURLOC_3,ANEURLOC_4,AORDISS_0,AORDISS_1,AORDISS_2,AORDISS_3,AORDISS_4,aordiss,DISSLOC_0,DISSLOC_1,DISSLOC_2,DISSLOC_3,DISSLOC_4,AORSURG_0,AORSURG_1,AORSURG_2,AORSURG_3,AORSURG_4,aorsurg,SURGLOC_0,SURGLOC_1,SURGLOC_2,SURGLOC_3,SURGLOC_4,SURGAGE_0,SURGAGE_1,SURGAGE_2,SURGAGE_3,SURGAGE_4,MVSURG_0,MVSURG_1,MVSURG_2,MVSURG_3,MVSURG_4,ECTLENTIS_0,ECTLENTIS_1,ECTLENTIS_2,ECTLENTIS_3,ECTLENTIS_4,VITALSTAT_0,VITALSTAT_1,VITALSTAT_2,VITALSTAT_3,VITALSTAT_4,DEATHCAUSE_0,DEATHCAUSE_1,DEATHCAUSE_2,DEATHCAUSE_3,DEATHCAUSE_4,DEATHAGE_0,DEATHAGE_1,DEATHAGE_2,DEATHAGE_3,DEATHAGE_4,VER_ID
144508,0:Baseline,1,16,-8:Unknown,-2,,,,,,,,,,,,,,,,,,,,,2,,,,,,,,,,,2,,,,,,,,,,,,,,,,,,,,,,,,,,,,,,,,,,,,A
144511,0:Baseline,1,8.4,1:Yes,1,Father,,,,,1:Yes,,,,,Aortic root/ascending aorta,,,,,1:Yes,,,,,1,Aortic root/ascending aorta,,,,,1:Yes,,,,,1,Aortic root/ascending aorta,,,,,34,,,,,1:Yes,,,,,1:Yes,,,,,1:Yes,,,,,-2,,,,,,,,,,A
144515,0:Baseline,1,11.7,1:Yes,1,Mother,,,,,2:No,,,,,-2,,,,,2:No,,,,,2,-2,,,,,2:No,,,,,2,-2,,,,,,,,,,2:No,,,,,1:Yes,,,,,1:Yes,,,,,-2,,,,,,,,,,A
144517,0:Baseline,1,19.4,1:Yes,3,Father,Brother,Paternal Grandfather,,,1:Yes,2:No,1:Yes,,,Aortic root/ascending aorta,-2,-8,,,1:Yes,2:No,-8:Unknown,,,1,Both,-2,-2,,,1:Yes,2:No,2:No,,,1,Both,-2,-2,,,29,,,,,2:No,2:No,2:No,,,1:Yes,2:No,-8:Unknown,,,1:Yes,1:Yes,2:No,,,-2,-2,Aortic dissection,,,,,24,,,A
144519,0:Baseline,1,23.9,2:No,-2,,,,,,,,,,,,,,,,,,,,,2,,,,,,,,,,,2,,,,,,,,,,,,,,,,,,,,,,,,,,,,,,,,,,,,A
144520,0:Baseline,1,5.1,2:No,-2,,,,,,,,,,,,,,,,,,,,,2,,,,,,,,,,,2,,,,,,,,,,,,,,,,,,,,,,,,,,,,,,,,,,,,A
144525,0:Baseline,1,1.5,1:Yes,3,Mother,Maternal Grandfather,Brother,,,2:No,1:Yes,2:No,,,-2,Aortic root/ascending aorta,-2,,,2:No,2:No,2:No,,,2,-2,-2,-2,,,2:No,1:Yes,2:No,,,1,-2,Aortic root/ascending aorta,-2,,,,45,,,,2:No,2:No,2:No,,,1:Yes,1:Yes,1:Yes,,,1:Yes,1:Yes,1:Yes,,,-2,-2,-2,,,,,,,,A
144527,0:Baseline,1,11.3,1:Yes,2,Father,Brother,,,,1:Yes,1:Yes,,,,Aortic root/ascending aorta,Aortic root/ascending aorta,,,,1:Yes,2:No,,,,1,Aortic root/ascending aorta,-2,,,,1:Yes,2:No,,,,1,Both,-2,,,,25,,,,,2:No,2:No,,,,2:No,2:No,,,,1:Yes,1:Yes,,,,-2,-2,,,,,,,,,A
144529,0:Baseline,1,3.6,1:Yes,1,Mother,,,,,-8:Unknown,,,,,-2,,,,,2:No,,,,,2,-2,,,,,2:No,,,,,2,-2,,,,,,,,,,2:No,,,,,-8:Unknown,,,,,1:Yes,,,,,-2,,,,,,,,,,A
144530,0:Baseline,1,6.6,1:Yes,2,Father,Paternal Grandmother,,,,1:Yes,1:Yes,,,,Both,-8,,,,1:Yes,-8:Unknown,,,,1,Both,-2,,,,1:Yes,1:Yes,,,,1,Both,-8,,,,21,,,,,2:No,2:No,,,,2:No,-8:Unknown,,,,2:No,2:No,,,,Non-cardiac,"Sudden, cause unknown",,,,38,40,,,,A
144531,0:Baseline,2,6.8,2:No,-2,,,,,,,,,,,,,,,,,,,,,2,,,,,,,,,,,2,,,,,,,,,,,,,,,,,,,,,,,,,,,,,,,,,,,,A
144533,0:Baseline,1,7.1,1:Yes,1,Sister,,,,,1:Yes,,,,,Aortic root/ascending aorta,,,,,2:No,,,,,2,-2,,,,,2:No,,,,,2,-2,,,,,,,,,,2:No,,,,,1:Yes,,,,,1:Yes,,,,,-2,,,,,,,,,,A
144534,0:Baseline,1,12.5,2:No,-2,,,,,,,,,,,,,,,,,,,,,2,,,,,,,,,,,2,,,,,,,,,,,,,,,,,,,,,,,,,,,,,,,,,,,,A
144535,0:Baseline,1,16.8,2:No,-2,,,,,,,,,,,,,,,,,,,,,2,,,,,,,,,,,2,,,,,,,,,,,,,,,,,,,,,,,,,,,,,,,,,,,,A
144537,0:Baseline,1,19.6,1:Yes,2,Father,Paternal Grandfather,,,,2:No,2:No,,,,-2,-2,,,,2:No,2:No,,,,2,-2,-2,,,,2:No,2:No,,,,2,-2,-2,,,,,,,,,2:No,-8:Unknown,,,,1:Yes,2:No,,,,1:Yes,1:Yes,,,,-2,-2,,,,,,,,,A
144538,0:Baseline,1,13.9,1:Yes,2,Mother,Maternal Grandmother,,,,2:No,1:Yes,,,,-2,Both,,,,2:No,-8:Unknown,,,,2,-2,-2,,,,1:Yes,1:Yes,,,,1,Aortic root/ascending aorta,Aortic root/ascending aorta,,,,29,36,,,,1:Yes,1:Yes,,,,1:Yes,-8:Unknown,,,,1:Yes,2:No,,,,-2,Aortic dissection,,,,,48,,,,A
144544,0:Baseline,1,17.9,2:No,-2,,,,,,,,,,,,,,,,,,,,,2,,,,,,,,,,,2,,,,,,,,,,,,,,,,,,,,,,,,,,,,,,,,,,,,A
144548,0:Baseline,1,14.2,1:Yes,2,Mother,Brother,,,,1:Yes,1:Yes,,,,Aortic root/ascending aorta,Aortic root/ascending aorta,,,,2:No,2:No,,,,2,-2,-2,,,,2:No,1:Yes,,,,1,-2,Aortic root/ascending aorta,,,,,20,,,,2:No,2:No,,,,1:Yes,1:Yes,,,,1:Yes,1:Yes,,,,-2,-2,,,,,,,,,A
144549,0:Baseline,1,5.3,2:No,-2,,,,,,,,,,,,,,,,,,,,,2,,,,,,,,,,,2,,,,,,,,,,,,,,,,,,,,,,,,,,,,,,,,,,,,A
144552,0:Baseline,1,19,1:Yes,1,Mother,,,,,2:No,,,,,-2,,,,,2:No,,,,,2,-2,,,,,2:No,,,,,2,-2,,,,,,,,,,2:No,,,,,2:No,,,,,2:No,,,,,Other cardiac,,,,,46,,,,,A
144553,0:Baseline,1,4.5,1:Yes,3,Father,Brother,Paternal Grandfather,,,1:Yes,2:No,1:Yes,,,Aortic root/ascending aorta,-2,Aortic root/ascending aorta,,,2:No,2:No,1:Yes,,,1,-2,-2,Aortic root/ascending aorta,,,1:Yes,2:No,1:Yes,,,1,Aortic root/ascending aorta,-2,Aortic root/ascending aorta,,,30,,50,,,1:Yes,2:No,2:No,,,1:Yes,2:No,1:Yes,,,1:Yes,1:Yes,1:Yes,,,-2,-2,-2,,,,,,,,A
144554,0:Baseline,1,14.9,2:No,-2,,,,,,,,,,,,,,,,,,,,,2,,,,,,,,,,,2,,,,,,,,,,,,,,,,,,,,,,,,,,,,,,,,,,,,A
144555,0:Baseline,1,3.9,1:Yes,1,Father,,,,,2:No,,,,,-2,,,,,2:No,,,,,2,-2,,,,,1:Yes,,,,,1,Aortic root/ascending aorta,,,,,,,,,,1:Yes,,,,,1:Yes,,,,,1:Yes,,,,,-2,,,,,,,,,,A
144556,0:Baseline,1,9.3,2:No,-2,,,,,,,,,,,,,,,,,,,,,2,,,,,,,,,,,2,,,,,,,,,,,,,,,,,,,,,,,,,,,,,,,,,,,,A
144558,0:Baseline,1,2.3,1:Yes,1,Mother,,,,,2:No,,,,,-2,,,,,2:No,,,,,2,-2,,,,,2:No,,,,,2,-2,,,,,,,,,,1:Yes,,,,,2:No,,,,,1:Yes,,,,,-2,,,,,,,,,,A
144568,0:Baseline,1,13.7,2:No,-2,,,,,,,,,,,,,,,,,,,,,2,,,,,,,,,,,2,,,,,,,,,,,,,,,,,,,,,,,,,,,,,,,,,,,,A
144572,0:Baseline,1,11.3,2:No,-2,,,,,,,,,,,,,,,,,,,,,2,,,,,,,,,,,2,,,,,,,,,,,,,,,,,,,,,,,,,,,,,,,,,,,,A
144573,0:Baseline,1,6.9,2:No,-2,,,,,,,,,,,,,,,,,,,,,2,,,,,,,,,,,2,,,,,,,,,,,,,,,,,,,,,,,,,,,,,,,,,,,,A
144574,0:Baseline,1,17.7,1:Yes,2,Father,Brother,,,,1:Yes,1:Yes,,,,Aortic root/ascending aorta,Aortic root/ascending aorta,,,,2:No,2:No,,,,2,-2,-2,,,,1:Yes,2:No,,,,1,Aortic root/ascending aorta,-2,,,,23,,,,,1:Yes,2:No,,,,1:Yes,1:Yes,,,,1:Yes,1:Yes,,,,-2,-2,,,,,,,,,A
144576,0:Baseline,1,4,1:Yes,3,Father,Paternal Grandmother,Brother,,,1:Yes,1:Yes,2:No,,,Aortic root/ascending aorta,Both,-2,,,2:No,1:Yes,2:No,,,1,-2,Aortic root/ascending aorta,-2,,,1:Yes,1:Yes,2:No,,,1,Aortic root/ascending aorta,Both,-2,,,20,32,,,,1:Yes,-8:Unknown,2:No,,,2:No,2:No,2:No,,,1:Yes,2:No,1:Yes,,,-2,Other cardiac,-2,,,,47,,,,A
144579,0:Baseline,1,11.8,2:No,-2,,,,,,,,,,,,,,,,,,,,,2,,,,,,,,,,,2,,,,,,,,,,,,,,,,,,,,,,,,,,,,,,,,,,,,A
144581,0:Baseline,1,13.3,2:No,-2,,,,,,,,,,,,,,,,,,,,,2,,,,,,,,,,,2,,,,,,,,,,,,,,,,,,,,,,,,,,,,,,,,,,,,A
144582,0:Baseline,1,10.8,1:Yes,2,Mother,Maternal Grandmother,,,,2:No,1:Yes,,,,-2,Aortic root/ascending aorta,,,,2:No,1:Yes,,,,1,-2,Aortic root/ascending aorta,,,,2:No,2:No,,,,2,-2,-2,,,,,,,,,2:No,2:No,,,,1:Yes,-8:Unknown,,,,1:Yes,2:No,,,,-2,Aortic dissection,,,,,47,,,,A
144584,0:Baseline,1,15.3,1:Yes,2,Maternal Grandfather,Mother,,,,2:No,2:No,,,,-2,-2,,,,1:Yes,2:No,,,,1,Aortic root/ascending aorta,-2,,,,1:Yes,2:No,,,,1,Aortic root/ascending aorta,-2,,,,60,,,,,2:No,2:No,,,,2:No,2:No,,,,1:Yes,1:Yes,,,,-2,-2,,,,,,,,,A
144587,0:Baseline,2,22.3,2:No,-2,,,,,,,,,,,,,,,,,,,,,2,,,,,,,,,,,2,,,,,,,,,,,,,,,,,,,,,,,,,,,,,,,,,,,,A
144588,0:Baseline,1,12.2,2:No,-2,,,,,,,,,,,,,,,,,,,,,2,,,,,,,,,,,2,,,,,,,,,,,,,,,,,,,,,,,,,,,,,,,,,,,,A
144589,0:Baseline,1,5.7,2:No,-2,,,,,,,,,,,,,,,,,,,,,2,,,,,,,,,,,2,,,,,,,,,,,,,,,,,,,,,,,,,,,,,,,,,,,,A
144591,0:Baseline,1,15.6,2:No,-2,,,,,,,,,,,,,,,,,,,,,2,,,,,,,,,,,2,,,,,,,,,,,,,,,,,,,,,,,,,,,,,,,,,,,,A
144593,0:Baseline,1,14.3,1:Yes,2,Father,Paternal Grandfather,,,,1:Yes,-8:Unknown,,,,-8,-2,,,,-8:Unknown,-8:Unknown,,,,2,-2,-2,,,,1:Yes,-8:Unknown,,,,1,Aortic root/ascending aorta,-2,,,,,,,,,2:No,-8:Unknown,,,,1:Yes,-8:Unknown,,,,2:No,1:Yes,,,,Other cardiac,-2,,,,43,,,,,A
144594,0:Baseline,1,11.5,1:Yes,2,Father,Maternal Grandmother,,,,1:Yes,1:Yes,,,,Aortic root/ascending aorta,Descending aorta/abnomianl,,,,2:No,2:No,,,,2,-2,-2,,,,1:Yes,1:Yes,,,,1,Aortic root/ascending aorta,Descending aorta/abnomianl,,,,25,,,,,2:No,1:Yes,,,,2:No,-8:Unknown,,,,1:Yes,1:Yes,,,,-2,-2,,,,,,,,,A
144595,0:Baseline,1,18,-8:Unknown,-2,,,,,,,,,,,,,,,,,,,,,2,,,,,,,,,,,2,,,,,,,,,,,,,,,,,,,,,,,,,,,,,,,,,,,,A
144597,0:Baseline,1,1.2,1:Yes,2,Mother,Brother,,,,1:Yes,2:No,,,,-8,-2,,,,2:No,2:No,,,,2,-2,-2,,,,2:No,2:No,,,,2,-2,-2,,,,,,,,,2:No,2:No,,,,2:No,2:No,,,,1:Yes,1:Yes,,,,-2,-2,,,,,,,,,A
144600,0:Baseline,1,6.4,1:Yes,3,Father,Brother,Brother,,,1:Yes,1:Yes,1:Yes,,,Descending aorta/abnomianl,Aortic root/ascending aorta,Aortic root/ascending aorta,,,2:No,2:No,2:No,,,2,-2,-2,-2,,,1:Yes,2:No,2:No,,,1,Descending aorta/abnomianl,-2,-2,,,37,,,,,-8:Unknown,2:No,2:No,,,1:Yes,1:Yes,1:Yes,,,2:No,1:Yes,1:Yes,,,Non-cardiac,-2,-2,,,42,,,,,A
144605,0:Baseline,1,0.6,1:Yes,2,Father,Brother,,,,1:Yes,2:No,,,,Aortic root/ascending aorta,-2,,,,2:No,2:No,,,,2,-2,-2,,,,1:Yes,2:No,,,,1,Aortic root/ascending aorta,-2,,,,38,,,,,2:No,2:No,,,,1:Yes,2:No,,,,1:Yes,1:Yes,,,,-2,-2,,,,,,,,,A
144606,0:Baseline,1,9.9,2:No,-2,,,,,,,,,,,,,,,,,,,,,2,,,,,,,,,,,2,,,,,,,,,,,,,,,,,,,,,,,,,,,,,,,,,,,,A
144607,0:Baseline,1,22.8,1:Yes,4,Mother,Sister,Brother,Maternal Grandfather,,2:No,2:No,2:No,-8:Unknown,,-2,-2,-2,-2,,2:No,2:No,2:No,-8:Unknown,,2,-2,-2,-2,-2,,1:Yes,2:No,2:No,-8:Unknown,,1,Aortic root/ascending aorta,-2,-2,-2,,,,,,,1:Yes,2:No,2:No,-8:Unknown,,-8:Unknown,1:Yes,1:Yes,-8:Unknown,,1:Yes,1:Yes,1:Yes,2:No,,-2,-2,-2,"Sudden, cause unknown",,,,,,,A
144609,0:Baseline,1,22,1:Yes,3,Mother,Sister,Maternal Grandmother,,,1:Yes,2:No,-8:Unknown,,,-8,-2,-2,,,2:No,2:No,1:Yes,,,1,-2,-2,-8,,,1:Yes,2:No,2:No,,,1,-8,-2,-2,,,40,,,,,1:Yes,2:No,-8:Unknown,,,2:No,2:No,-8:Unknown,,,1:Yes,1:Yes,2:No,,,-2,-2,Other cardiac,,,,,,,,A
144612,0:Baseline,1,5.8,1:Yes,1,Father,,,,,1:Yes,,,,,Aortic root/ascending aorta,,,,,1:Yes,,,,,1,Aortic root/ascending aorta,,,,,1:Yes,,,,,1,Aortic root/ascending aorta,,,,,32,,,,,2:No,,,,,2:No,,,,,1:Yes,,,,,-2,,,,,,,,,,A
144613,0:Baseline,1,9.8,-8:Unknown,-2,,,,,,,,,,,,,,,,,,,,,2,,,,,,,,,,,2,,,,,,,,,,,,,,,,,,,,,,,,,,,,,,,,,,,,A
144614,0:Baseline,2,21.4,1:Yes,2,Brother,Father,,,,2:No,1:Yes,,,,-2,-8,,,,2:No,2:No,,,,2,-2,-2,,,,2:No,-8:Unknown,,,,2,-2,-2,,,,,,,,,2:No,2:No,,,,2:No,2:No,,,,1:Yes,2:No,,,,-2,"Sudden, cause unknown",,,,,40,,,,A
144615,0:Baseline,1,7.6,2:No,-2,,,,,,,,,,,,,,,,,,,,,2,,,,,,,,,,,2,,,,,,,,,,,,,,,,,,,,,,,,,,,,,,,,,,,,A
144620,0:Baseline,1,12,2:No,-2,,,,,,,,,,,,,,,,,,,,,2,,,,,,,,,,,2,,,,,,,,,,,,,,,,,,,,,,,,,,,,,,,,,,,,A
144622,0:Baseline,1,1.3,1:Yes,2,Father,Brother,,,,-8:Unknown,2:No,,,,-2,-2,,,,2:No,2:No,,,,2,-2,-2,,,,2:No,2:No,,,,2,-2,-2,,,,,,,,,2:No,2:No,,,,-8:Unknown,2:No,,,,1:Yes,1:Yes,,,,-2,-2,,,,,,,,,A
144625,0:Baseline,1,4.8,1:Yes,1,Father,,,,,1:Yes,,,,,Aortic root/ascending aorta,,,,,2:No,,,,,2,-2,,,,,1:Yes,,,,,1,Aortic root/ascending aorta,,,,,25,,,,,1:Yes,,,,,1:Yes,,,,,1:Yes,,,,,-2,,,,,,,,,,A
144626,0:Baseline,1,0.5,1:Yes,2,Father,Paternal Grandmother,,,,2:No,2:No,,,,-2,-2,,,,2:No,2:No,,,,2,-2,-2,,,,2:No,1:Yes,,,,1,-2,-8,,,,,44,,,,2:No,1:Yes,,,,2:No,2:No,,,,1:Yes,1:Yes,,,,-2,-2,,,,,,,,,A
144627,0:Baseline,2,21.9,1:Yes,4,Mother,Sister,Brother,Daughter,,1:Yes,2:No,1:Yes,2:No,,Descending aorta/abnomianl,-2,Aortic root/ascending aorta,-2,,2:No,2:No,2:No,2:No,,2,-2,-2,-2,-2,,2:No,2:No,1:Yes,2:No,,1,-2,-2,Aortic root/ascending aorta,-2,,,,,,,2:No,2:No,2:No,2:No,,1:Yes,2:No,2:No,2:No,,1:Yes,1:Yes,1:Yes,1:Yes,,-2,-2,-2,-2,,,,,,,A
144628,0:Baseline,1,12.1,1:Yes,1,Mother,,,,,1:Yes,,,,,Aortic root/ascending aorta,,,,,2:No,,,,,2,-2,,,,,1:Yes,,,,,1,Aortic root/ascending aorta,,,,,1,,,,,1:Yes,,,,,1:Yes,,,,,1:Yes,,,,,-2,,,,,,,,,,A
144630,0:Baseline,1,15,1:Yes,2,Father,Paternal Grandmother,,,,2:No,2:No,,,,-2,-2,,,,2:No,2:No,,,,2,-2,-2,,,,2:No,2:No,,,,2,-2,-2,,,,,,,,,2:No,2:No,,,,2:No,2:No,,,,1:Yes,1:Yes,,,,-2,-2,,,,,,,,,A
144632,0:Baseline,1,4.5,1:Yes,1,Mother,,,,,-8:Unknown,,,,,-2,,,,,-8:Unknown,,,,,2,-2,,,,,-8:Unknown,,,,,2,-2,,,,,,,,,,-8:Unknown,,,,,-8:Unknown,,,,,1:Yes,,,,,-2,,,,,,,,,,A
144633,0:Baseline,1,9.1,-8:Unknown,-2,,,,,,,,,,,,,,,,,,,,,2,,,,,,,,,,,2,,,,,,,,,,,,,,,,,,,,,,,,,,,,,,,,,,,,A
144637,0:Baseline,2,24.3,1:Yes,2,Mother,Maternal Grandmother,,,,1:Yes,1:Yes,,,,Aortic root/ascending aorta,-8,,,,2:No,1:Yes,,,,1,-2,Aortic root/ascending aorta,,,,1:Yes,1:Yes,,,,1,Aortic root/ascending aorta,Aortic root/ascending aorta,,,,43,60,,,,1:Yes,-8:Unknown,,,,2:No,-8:Unknown,,,,1:Yes,1:Yes,,,,-2,-2,,,,,,,,,A
144638,0:Baseline,3,14.9,1:Yes,1,Mother,,,,,1:Yes,,,,,Aortic root/ascending aorta,,,,,2:No,,,,,2,-2,,,,,2:No,,,,,2,-2,,,,,,,,,,2:No,,,,,2:No,,,,,1:Yes,,,,,-2,,,,,,,,,,A
144640,0:Baseline,1,2.3,1:Yes,1,Brother,,,,,2:No,,,,,-2,,,,,2:No,,,,,2,-2,,,,,2:No,,,,,2,-2,,,,,,,,,,2:No,,,,,2:No,,,,,1:Yes,,,,,-2,,,,,,,,,,A
144653,0:Baseline,1,2.5,2:No,-2,,,,,,,,,,,,,,,,,,,,,2,,,,,,,,,,,2,,,,,,,,,,,,,,,,,,,,,,,,,,,,,,,,,,,,A
144654,0:Baseline,1,6.3,2:No,-2,,,,,,,,,,,,,,,,,,,,,2,,,,,,,,,,,2,,,,,,,,,,,,,,,,,,,,,,,,,,,,,,,,,,,,A
144655,0:Baseline,1,2.3,1:Yes,1,Father,,,,,2:No,,,,,-2,,,,,2:No,,,,,2,-2,,,,,1:Yes,,,,,1,Aortic root/ascending aorta,,,,,32,,,,,1:Yes,,,,,2:No,,,,,1:Yes,,,,,-2,,,,,,,,,,A
144656,0:Baseline,1,14.8,1:Yes,2,Father,Paternal Grandmother,,,,1:Yes,-8:Unknown,,,,Aortic root/ascending aorta,-2,,,,2:No,-8:Unknown,,,,2,-2,-2,,,,1:Yes,-8:Unknown,,,,1,Aortic root/ascending aorta,-2,,,,40,,,,,2:No,-8:Unknown,,,,2:No,-8:Unknown,,,,1:Yes,-8:Unknown,,,,-2,-2,,,,,,,,,A
144658,0:Baseline,1,19.4,1:Yes,2,Father,Paternal Grandmother,,,,1:Yes,-8:Unknown,,,,Aortic root/ascending aorta,-2,,,,2:No,1:Yes,,,,1,-2,-8,,,,1:Yes,2:No,,,,1,Aortic root/ascending aorta,-2,,,,44,,,,,2:No,2:No,,,,2:No,-8:Unknown,,,,1:Yes,2:No,,,,-2,Aortic dissection,,,,,33,,,,A
144660,0:Baseline,1,1.8,2:No,-2,,,,,,,,,,,,,,,,,,,,,2,,,,,,,,,,,2,,,,,,,,,,,,,,,,,,,,,,,,,,,,,,,,,,,,A
144663,0:Baseline,1,9.6,1:Yes,2,Mother,Maternal Grandmother,,,,1:Yes,1:Yes,,,,Aortic root/ascending aorta,Aortic root/ascending aorta,,,,1:Yes,1:Yes,,,,1,Aortic root/ascending aorta,Aortic root/ascending aorta,,,,1:Yes,1:Yes,,,,1,Aortic root/ascending aorta,Aortic root/ascending aorta,,,,34,65,,,,2:No,2:No,,,,2:No,-8:Unknown,,,,1:Yes,1:Yes,,,,-2,-2,,,,,,,,,A
144665,0:Baseline,1,24.7,1:Yes,3,Father,Sister,Sister,,,1:Yes,1:Yes,2:No,,,Aortic root/ascending aorta,Both,-2,,,2:No,1:Yes,2:No,,,1,-2,Descending aorta/abnomianl,-2,,,2:No,1:Yes,2:No,,,1,-2,Descending aorta/abnomianl,-2,,,,37,,,,2:No,2:No,2:No,,,-8:Unknown,1:Yes,1:Yes,,,1:Yes,1:Yes,1:Yes,,,-2,-2,-2,,,,,,,,A
144669,0:Baseline,1,13.6,1:Yes,1,Mother,,,,,2:No,,,,,-2,,,,,2:No,,,,,2,-2,,,,,2:No,,,,,2,-2,,,,,,,,,,2:No,,,,,2:No,,,,,1:Yes,,,,,-2,,,,,,,,,,A
144670,0:Baseline,1,6.7,1:Yes,1,Father,,,,,1:Yes,,,,,Aortic root/ascending aorta,,,,,1:Yes,,,,,1,Aortic root/ascending aorta,,,,,1:Yes,,,,,1,Aortic root/ascending aorta,,,,,32,,,,,2:No,,,,,1:Yes,,,,,2:No,,,,,Other cardiac,,,,,34,,,,,A
144672,0:Baseline,1,17.5,1:Yes,3,Father,Sister,Brother,,,1:Yes,2:No,1:Yes,,,Both,-2,Aortic root/ascending aorta,,,1:Yes,2:No,2:No,,,1,Both,-2,-2,,,1:Yes,2:No,1:Yes,,,1,Aortic root/ascending aorta,-2,Aortic root/ascending aorta,,,24,,18,,,1:Yes,1:Yes,1:Yes,,,2:No,2:No,2:No,,,1:Yes,1:Yes,1:Yes,,,-2,-2,-2,,,,,,,,A
144673,0:Baseline,2,17.5,2:No,-2,,,,,,,,,,,,,,,,,,,,,2,,,,,,,,,,,2,,,,,,,,,,,,,,,,,,,,,,,,,,,,,,,,,,,,A
144674,0:Baseline,1,16.7,2:No,-2,,,,,,,,,,,,,,,,,,,,,2,,,,,,,,,,,2,,,,,,,,,,,,,,,,,,,,,,,,,,,,,,,,,,,,A
144677,0:Baseline,1,14.1,2:No,-2,,,,,,,,,,,,,,,,,,,,,2,,,,,,,,,,,2,,,,,,,,,,,,,,,,,,,,,,,,,,,,,,,,,,,,A
144678,0:Baseline,1,22.5,2:No,-2,,,,,,,,,,,,,,,,,,,,,2,,,,,,,,,,,2,,,,,,,,,,,,,,,,,,,,,,,,,,,,,,,,,,,,A
144687,0:Baseline,1,17.3,2:No,-2,,,,,,,,,,,,,,,,,,,,,2,,,,,,,,,,,2,,,,,,,,,,,,,,,,,,,,,,,,,,,,,,,,,,,,A
144689,0:Baseline,1,2.8,1:Yes,2,Mother,Brother,,,,1:Yes,2:No,,,,Aortic root/ascending aorta,-2,,,,2:No,2:No,,,,2,-2,-2,,,,2:No,2:No,,,,2,-2,-2,,,,,,,,,2:No,2:No,,,,1:Yes,1:Yes,,,,1:Yes,1:Yes,,,,-2,-2,,,,,,,,,A
144690,0:Baseline,1,6,2:No,-2,,,,,,,,,,,,,,,,,,,,,2,,,,,,,,,,,2,,,,,,,,,,,,,,,,,,,,,,,,,,,,,,,,,,,,A
144691,0:Baseline,1,12.7,1:Yes,2,Mother,Brother,,,,1:Yes,1:Yes,,,,Descending aorta/abnomianl,Descending aorta/abnomianl,,,,2:No,2:No,,,,2,-2,-2,,,,2:No,2:No,,,,2,-2,-2,,,,,,,,,2:No,2:No,,,,2:No,2:No,,,,1:Yes,1:Yes,,,,-2,-2,,,,,,,,,A
144697,0:Baseline,1,16.6,2:No,-2,,,,,,,,,,,,,,,,,,,,,2,,,,,,,,,,,2,,,,,,,,,,,,,,,,,,,,,,,,,,,,,,,,,,,,A
144699,0:Baseline,1,13.9,1:Yes,1,Brother,,,,,1:Yes,,,,,Aortic root/ascending aorta,,,,,2:No,,,,,2,-2,,,,,2:No,,,,,2,-2,,,,,,,,,,2:No,,,,,2:No,,,,,1:Yes,,,,,-2,,,,,,,,,,A
144700,0:Baseline,1,14.4,1:Yes,1,Mother,,,,,-8:Unknown,,,,,-2,,,,,2:No,,,,,2,-2,,,,,2:No,,,,,2,-2,,,,,,,,,,2:No,,,,,-8:Unknown,,,,,1:Yes,,,,,-2,,,,,,,,,,A
144704,0:Baseline,1,17.4,1:Yes,2,Mother,Brother,,,,1:Yes,2:No,,,,Descending aorta/abnomianl,-2,,,,2:No,2:No,,,,2,-2,-2,,,,2:No,2:No,,,,2,-2,-2,,,,,,,,,2:No,2:No,,,,2:No,2:No,,,,1:Yes,1:Yes,,,,-2,-2,,,,,,,,,A
144705,0:Baseline,1,15.1,2:No,-2,,,,,,,,,,,,,,,,,,,,,2,,,,,,,,,,,2,,,,,,,,,,,,,,,,,,,,,,,,,,,,,,,,,,,,A
144708,0:Baseline,1,12.2,-8:Unknown,-2,,,,,,,,,,,,,,,,,,,,,2,,,,,,,,,,,2,,,,,,,,,,,,,,,,,,,,,,,,,,,,,,,,,,,,A
144709,0:Baseline,1,5.6,1:Yes,2,Mother,Brother,,,,1:Yes,2:No,,,,Aortic root/ascending aorta,-2,,,,1:Yes,2:No,,,,1,Aortic root/ascending aorta,-2,,,,1:Yes,2:No,,,,1,Aortic root/ascending aorta,-2,,,,,,,,,2:No,2:No,,,,-8:Unknown,2:No,,,,2:No,1:Yes,,,,Aortic dissection,-2,,,,,,,,,A
144711,0:Baseline,1,12.4,2:No,-2,,,,,,,,,,,,,,,,,,,,,2,,,,,,,,,,,2,,,,,,,,,,,,,,,,,,,,,,,,,,,,,,,,,,,,A
144714,0:Baseline,1,9.5,1:Yes,2,Father,Brother,,,,1:Yes,2:No,,,,Aortic root/ascending aorta,-2,,,,2:No,2:No,,,,2,-2,-2,,,,1:Yes,2:No,,,,1,Aortic root/ascending aorta,-2,,,,25,,,,,1:Yes,2:No,,,,1:Yes,2:No,,,,1:Yes,1:Yes,,,,-2,-2,,,,,,,,,A
144716,0:Baseline,1,18.8,1:Yes,3,Maternal Grandmother,Sister,Mother,,,-8:Unknown,-8:Unknown,2:No,,,-2,-2,-2,,,2:No,2:No,2:No,,,2,-2,-2,-2,,,2:No,2:No,2:No,,,2,-2,-2,-2,,,,,,,,2:No,2:No,2:No,,,-8:Unknown,2:No,-8:Unknown,,,2:No,1:Yes,1:Yes,,,Non-cardiac,-2,-2,,,50,,,,,A
144717,0:Baseline,1,24,1:Yes,3,Mother,Maternal Grandfather,Sister,,,2:No,-8:Unknown,2:No,,,-2,-2,-2,,,2:No,1:Yes,2:No,,,1,-2,-8,-2,,,2:No,1:Yes,-8:Unknown,,,1,-2,-8,-2,,,,,,,,2:No,-8:Unknown,1:Yes,,,1:Yes,2:No,1:Yes,,,1:Yes,1:Yes,1:Yes,,,-2,-2,-2,,,,,,,,A
144720,0:Baseline,1,16.2,2:No,-2,,,,,,,,,,,,,,,,,,,,,2,,,,,,,,,,,2,,,,,,,,,,,,,,,,,,,,,,,,,,,,,,,,,,,,A
144724,0:Baseline,1,2.3,1:Yes,2,Mother,Maternal Grandmother,,,,2:No,1:Yes,,,,-2,-8,,,,2:No,-8:Unknown,,,,2,-2,-2,,,,2:No,1:Yes,,,,1,-2,-8,,,,,56,,,,2:No,2:No,,,,-8:Unknown,1:Yes,,,,1:Yes,2:No,,,,-2,Aortic dissection,,,,,56,,,,A
144727,0:Baseline,1,22.5,2:No,-2,,,,,,,,,,,,,,,,,,,,,2,,,,,,,,,,,2,,,,,,,,,,,,,,,,,,,,,,,,,,,,,,,,,,,,A
144728,0:Baseline,1,5.8,1:Yes,2,Mother,Maternal Grandmother,,,,-8:Unknown,-8:Unknown,,,,-2,-2,,,,2:No,2:No,,,,2,-2,-2,,,,2:No,2:No,,,,2,-2,-2,,,,,,,,,2:No,2:No,,,,1:Yes,-8:Unknown,,,,1:Yes,1:Yes,,,,-2,-2,,,,,,,,,A
144731,0:Baseline,1,3.1,1:Yes,3,Father,Sister,Brother,,,1:Yes,1:Yes,1:Yes,,,Aortic root/ascending aorta,Aortic root/ascending aorta,Aortic root/ascending aorta,,,2:No,2:No,2:No,,,2,-2,-2,-2,,,1:Yes,2:No,2:No,,,1,Aortic root/ascending aorta,-2,-2,,,29,,,,,2:No,2:No,2:No,,,1:Yes,2:No,2:No,,,1:Yes,1:Yes,1:Yes,,,-2,-2,-2,,,,,,,,A
144734,0:Baseline,1,6.3,2:No,-2,,,,,,,,,,,,,,,,,,,,,2,,,,,,,,,,,2,,,,,,,,,,,,,,,,,,,,,,,,,,,,,,,,,,,,A
144736,0:Baseline,1,14.1,1:Yes,2,Father,Brother,,,,2:No,2:No,,,,-2,-2,,,,2:No,2:No,,,,2,-2,-2,,,,2:No,2:No,,,,2,-2,-2,,,,,,,,,2:No,2:No,,,,2:No,-8:Unknown,,,,1:Yes,1:Yes,,,,-2,-2,,,,,,,,,A
144738,0:Baseline,1,0.5,1:Yes,2,Father,Paternal Grandmother,,,,1:Yes,2:No,,,,Aortic root/ascending aorta,-2,,,,2:No,2:No,,,,2,-2,-2,,,,1:Yes,2:No,,,,1,Aortic root/ascending aorta,-2,,,,26,,,,,2:No,2:No,,,,2:No,2:No,,,,1:Yes,1:Yes,,,,-2,-2,,,,,,,,,A
144739,0:Baseline,1,9.5,2:No,-2,,,,,,,,,,,,,,,,,,,,,2,,,,,,,,,,,2,,,,,,,,,,,,,,,,,,,,,,,,,,,,,,,,,,,,A
144740,0:Baseline,1,16.6,2:No,-2,,,,,,,,,,,,,,,,,,,,,2,,,,,,,,,,,2,,,,,,,,,,,,,,,,,,,,,,,,,,,,,,,,,,,,A
144741,0:Baseline,1,9.3,1:Yes,2,Brother,Mother,,,,2:No,2:No,,,,-2,-2,,,,2:No,1:Yes,,,,1,-2,Aortic root/ascending aorta,,,,2:No,1:Yes,,,,1,-2,Aortic root/ascending aorta,,,,,37,,,,2:No,2:No,,,,2:No,-8:Unknown,,,,1:Yes,1:Yes,,,,-2,-2,,,,,,,,,A
144742,0:Baseline,1,14.2,2:No,-2,,,,,,,,,,,,,,,,,,,,,2,,,,,,,,,,,2,,,,,,,,,,,,,,,,,,,,,,,,,,,,,,,,,,,,A
144743,0:Baseline,1,17.2,2:No,-2,,,,,,,,,,,,,,,,,,,,,2,,,,,,,,,,,2,,,,,,,,,,,,,,,,,,,,,,,,,,,,,,,,,,,,A
144744,0:Baseline,1,6.4,1:Yes,1,Father,,,,,1:Yes,,,,,Aortic root/ascending aorta,,,,,2:No,,,,,2,-2,,,,,1:Yes,,,,,1,Aortic root/ascending aorta,,,,,41,,,,,2:No,,,,,1:Yes,,,,,1:Yes,,,,,-2,,,,,,,,,,A
144746,0:Baseline,1,4.1,2:No,-2,,,,,,,,,,,,,,,,,,,,,2,,,,,,,,,,,2,,,,,,,,,,,,,,,,,,,,,,,,,,,,,,,,,,,,A
144747,0:Baseline,1,0.7,2:No,-2,,,,,,,,,,,,,,,,,,,,,2,,,,,,,,,,,2,,,,,,,,,,,,,,,,,,,,,,,,,,,,,,,,,,,,A
144750,0:Baseline,1,10.9,2:No,-2,,,,,,,,,,,,,,,,,,,,,2,,,,,,,,,,,2,,,,,,,,,,,,,,,,,,,,,,,,,,,,,,,,,,,,A
144755,0:Baseline,1,5.1,1:Yes,2,Mother,Maternal Grandmother,,,,2:No,-8:Unknown,,,,-2,-2,,,,2:No,1:Yes,,,,1,-2,-8,,,,2:No,1:Yes,,,,1,-2,-8,,,,,48,,,,2:No,-8:Unknown,,,,2:No,2:No,,,,1:Yes,1:Yes,,,,-2,-2,,,,,,,,,A
144758,0:Baseline,1,2.5,1:Yes,2,Maternal Grandmother,Father,,,,2:No,1:Yes,,,,-2,Descending aorta/abnomianl,,,,-8:Unknown,2:No,,,,2,-2,-2,,,,2:No,2:No,,,,2,-2,-2,,,,,,,,,-8:Unknown,2:No,,,,1:Yes,1:Yes,,,,2:No,1:Yes,,,,Other cardiac,-2,,,,77,,,,,A
144760,0:Baseline,1,14.3,2:No,-2,,,,,,,,,,,,,,,,,,,,,2,,,,,,,,,,,2,,,,,,,,,,,,,,,,,,,,,,,,,,,,,,,,,,,,A
144764,0:Baseline,1,8.6,1:Yes,5,Father,Paternal Grandfather,Sister,Sister,Brother,2:No,1:Yes,1:Yes,1:Yes,1:Yes,-2,Aortic root/ascending aorta,-8,-8,-8,2:No,2:No,2:No,2:No,2:No,2,-2,-2,-2,-2,-2,2:No,2:No,2:No,2:No,2:No,2,-2,-2,-2,-2,-2,,,,,,1:Yes,-8:Unknown,1:Yes,2:No,2:No,-8:Unknown,-8:Unknown,1:Yes,-8:Unknown,1:Yes,1:Yes,2:No,1:Yes,1:Yes,1:Yes,-2,Aortic dissection,-2,-2,-2,,67,,,,A
144766,0:Baseline,1,12.3,1:Yes,2,Mother,Maternal Grandfather,,,,2:No,-8:Unknown,,,,-2,-2,,,,2:No,-8:Unknown,,,,2,-2,-2,,,,2:No,1:Yes,,,,1,-2,-8,,,,,47,,,,2:No,2:No,,,,2:No,2:No,,,,1:Yes,1:Yes,,,,-2,-2,,,,,,,,,A
144768,0:Baseline,1,3.4,2:No,-2,,,,,,,,,,,,,,,,,,,,,2,,,,,,,,,,,2,,,,,,,,,,,,,,,,,,,,,,,,,,,,,,,,,,,,A
144769,0:Baseline,1,11.9,1:Yes,2,Mother,Brother,,,,1:Yes,2:No,,,,Aortic root/ascending aorta,-2,,,,1:Yes,2:No,,,,1,Aortic root/ascending aorta,-2,,,,1:Yes,2:No,,,,1,Aortic root/ascending aorta,-2,,,,37,,,,,2:No,2:No,,,,2:No,2:No,,,,1:Yes,1:Yes,,,,-2,-2,,,,,,,,,A
144771,0:Baseline,1,4.9,2:No,-2,,,,,,,,,,,,,,,,,,,,,2,,,,,,,,,,,2,,,,,,,,,,,,,,,,,,,,,,,,,,,,,,,,,,,,A
144772,0:Baseline,1,15,2:No,-2,,,,,,,,,,,,,,,,,,,,,2,,,,,,,,,,,2,,,,,,,,,,,,,,,,,,,,,,,,,,,,,,,,,,,,A
144775,0:Baseline,1,3.2,1:Yes,1,Mother,,,,,-8:Unknown,,,,,-2,,,,,-8:Unknown,,,,,2,-2,,,,,2:No,,,,,2,-2,,,,,,,,,,2:No,,,,,2:No,,,,,1:Yes,,,,,-2,,,,,,,,,,A
144776,0:Baseline,1,24.9,1:Yes,2,Brother,Father,,,,1:Yes,1:Yes,,,,Aortic root/ascending aorta,Both,,,,2:No,2:No,,,,2,-2,-2,,,,2:No,1:Yes,,,,1,-2,Descending aorta/abnomianl,,,,,2,,,,2:No,2:No,,,,2:No,2:No,,,,1:Yes,1:Yes,,,,-2,-2,,,,,,,,,A
144785,0:Baseline,1,18.8,2:No,-2,,,,,,,,,,,,,,,,,,,,,2,,,,,,,,,,,2,,,,,,,,,,,,,,,,,,,,,,,,,,,,,,,,,,,,A
144786,0:Baseline,1,4.8,1:Yes,2,Mother,Maternal Grandfather,,,,2:No,1:Yes,,,,-2,Descending aorta/abnomianl,,,,2:No,2:No,,,,2,-2,-2,,,,2:No,1:Yes,,,,1,-2,Descending aorta/abnomianl,,,,,55,,,,2:No,2:No,,,,2:No,-8:Unknown,,,,1:Yes,2:No,,,,-2,Non-cardiac,,,,,64,,,,A
144787,0:Baseline,2,5.4,1:Yes,2,Father,Sister,,,,1:Yes,1:Yes,,,,Aortic root/ascending aorta,Aortic root/ascending aorta,,,,1:Yes,2:No,,,,1,Aortic root/ascending aorta,-2,,,,1:Yes,2:No,,,,1,Aortic root/ascending aorta,-2,,,,38,,,,,2:No,2:No,,,,2:No,2:No,,,,1:Yes,1:Yes,,,,-2,-2,,,,,,,,,A
144788,0:Baseline,2,9,1:Yes,1,Mother,,,,,2:No,,,,,-2,,,,,2:No,,,,,2,-2,,,,,2:No,,,,,2,-2,,,,,,,,,,2:No,,,,,2:No,,,,,1:Yes,,,,,-2,,,,,,,,,,A
144791,0:Baseline,1,3.7,1:Yes,1,Father,,,,,2:No,,,,,-2,,,,,2:No,,,,,2,-2,,,,,1:Yes,,,,,1,-8,,,,,24,,,,,2:No,,,,,2:No,,,,,1:Yes,,,,,-2,,,,,,,,,,A