random_ID,VISIT,age_vis,WT1_114,WT2_114,WT3_114,meanwt_114,HT1_114,HT2_114,HT3_114,meanht_114,bsa_vis,agemos,BMI,WAZ,WTPCT,BMIZ,BMIPCT,HAZ,HTPCT,WHZ,WHPCT,HTMEAS_114,ARMSPAN_114,LOWSEG_114,arm_ht_114,up_low_114,PECTUS_C114,PECTUS_E114,SCOLIOSIS114,PROTRUSIO114,OTHSKEL114,E_LENTIS114,CORNEA114,GLOBE114,HYPO_IRIS114,OTHOCUL114,THORAX114,BLEBS114,OTHPULM114,STRIAE114,HERNIA114,OTHSKIN114,DURAL114,MUTATION114,ADD_NEW,HYPER_NEW,DELAY_NEW,LDIFF_NEW,OTHNEURO_NEW,DEPRESS_NEW,OTHPSYCH_NEW,CARDIAC_SURG,AVVALVE_SURG,OTHCARD_SURG,MEDS_STOP,DAILY_MCODE1_0,DAILY_MCODE1_1,DAILY_MCODE1_2,DAILY_MCODE1_3,DAILY_MCODE1_4,DAILY_MCODE1_5,DAILY_MCODE1_6,DAILY_MCODE1_7,DAILY_MCODE1_8,DAILY_MCODE1_9,DAILY_MCODE1_10,DAILY_MCODE1_11,DAILY_MCODE1_12,DAILY_MCODE1_13,DAILY_MCODE2_0,DAILY_MCODE2_1,DAILY_MCODE2_2,DAILY_MCODE2_3,DAILY_MCODE2_4,DAILY_MCODE2_5,DAILY_MCODE2_6,DAILY_MCODE2_7,DAILY_MCODE2_8,DAILY_MCODE2_9,DAILY_MCODE2_10,DAILY_MCODE2_11,DAILY_MCODE2_12,DAILY_MCODE2_13,dailymedsage_0,dailymedsage_1,dailymedsage_2,dailymedsage_3,dailymedsage_4,dailymedsage_5,dailymedsage_6,dailymedsage_7,dailymedsage_8,dailymedsage_9,dailymedsage_10,dailymedsage_11,dailymedsage_12,dailymedsage_13,MEDS_START,NEW_MCODE1_0,NEW_MCODE1_1,NEW_MCODE1_2,NEW_MCODE1_3,NEW_MCODE1_4,NEW_MCODE1_5,NEW_MCODE1_6,NEW_MCODE1_7,NEW_MCODE1_8,NEW_MCODE1_9,NEW_MCODE1_10,NEW_MCODE1_11,NEW_MCODE1_12,NEW_MCODE1_13,NEW_MCODE2_0,NEW_MCODE2_1,NEW_MCODE2_2,NEW_MCODE2_3,NEW_MCODE2_4,NEW_MCODE2_5,NEW_MCODE2_6,NEW_MCODE2_7,NEW_MCODE2_8,NEW_MCODE2_9,NEW_MCODE2_10,NEW_MCODE2_11,NEW_MCODE2_12,NEW_MCODE2_13,newmedsage_0,newmedsage_1,newmedsage_2,newmedsage_3,newmedsage_4,newmedsage_5,newmedsage_6,newmedsage_7,newmedsage_8,newmedsage_9,newmedsage_10,newmedsage_11,newmedsage_12,newmedsage_13,NEWMEDS_DOSE_0,NEWMEDS_DOSE_1,NEWMEDS_DOSE_2,NEWMEDS_DOSE_3,NEWMEDS_DOSE_4,NEWMEDS_DOSE_5,NEWMEDS_DOSE_6,NEWMEDS_DOSE_7,NEWMEDS_DOSE_8,NEWMEDS_DOSE_9,NEWMEDS_DOSE_10,NEWMEDS_DOSE_11,NEWMEDS_DOSE_12,NEWMEDS_DOSE_13,DOSECHANGES,CHANGE_CODE1_0,CHANGE_CODE1_1,CHANGE_CODE1_2,CHANGE_CODE1_3,CHANGE_CODE1_4,CHANGE_CODE1_5,CHANGE_CODE2_0,CHANGE_CODE2_1,CHANGE_CODE2_2,CHANGE_CODE2_3,CHANGE_CODE2_4,CHANGE_CODE2_5,DOSECHANGE_AGE_0,DOSECHANGE_AGE_1,DOSECHANGE_AGE_2,DOSECHANGE_AGE_3,DOSECHANGE_AGE_4,DOSECHANGE_AGE_5,CURRENT_DOSE_0,CURRENT_DOSE_1,CURRENT_DOSE_2,CURRENT_DOSE_3,CURRENT_DOSE_4,CURRENT_DOSE_5,VER_ID
144508,1:Study Visit 1 (Month 6),16.48,94.0,94.0,,94,193.5,193.5,,193.5,2.25,197.8,25.11,2.01,97.77,1.16,87.65,2.71,99.66,,,Standing,204.5,105.0,1.057,0.84,2:No,2:No,2:No,2:No,2:No,2:No,2:No,2:No,2:No,2:No,2:No,2:No,2:No,2:No,2:No,2:No,2:No,2:No,2:No,2:No,2:No,2:No,2:No,2:No,2:No,2:No,-2,-2,0,M,M,M,M,M,M,M,M,M,M,M,M,M,M,M,M,M,M,M,M,M,M,M,M,M,M,M,M,,,,,,,,,,,,,,,0,M,M,M,M,M,M,M,M,M,M,M,M,M,M,M,M,M,M,M,M,M,M,M,M,M,M,M,M,,,,,,,,,,,,,,,,,,,,,,,,,,,,,2,99,99,M,M,M,M,99,99,M,M,M,M,16.1,16.1,,,,,100,0.2,,,,,A
144508,2:Study Visit 2 (Month 12),16.96,92.8,92.8,,92.8,196.0,196.0,,196,2.25,203.5,24.16,1.85,96.8,0.87,80.75,2.98,99.86,,,Standing,204.5,105.5,1.043,0.86,2:No,2:No,2:No,2:No,2:No,2:No,2:No,2:No,2:No,2:No,2:No,2:No,2:No,2:No,2:No,2:No,2:No,2:No,2:No,2:No,2:No,2:No,2:No,2:No,2:No,2:No,-2,-2,0,M,M,M,M,M,M,M,M,M,M,M,M,M,M,M,M,M,M,M,M,M,M,M,M,M,M,M,M,,,,,,,,,,,,,,,0,M,M,M,M,M,M,M,M,M,M,M,M,M,M,M,M,M,M,M,M,M,M,M,M,M,M,M,M,,,,,,,,,,,,,,,,,,,,,,,,,,,,,0,M,M,M,M,M,M,M,M,M,M,M,M,,,,,,,,,,,,,A
144511,1:Study Visit 1 (Month 6),9.01,40.4,40.4,,40.4,149.4,149.4,,149.4,1.29,108.1,18.1,1.66,95.2,0.87,80.68,2.48,99.35,,,Standing,154.5,81.1,1.034,0.84,2:No,2:No,2:No,2:No,2:No,2:No,2:No,2:No,2:No,2:No,2:No,2:No,2:No,2:No,2:No,2:No,-8:Unknown,-8:Unknown,2:No,2:No,2:No,2:No,2:No,2:No,2:No,2:No,-2,-2,0,M,M,M,M,M,M,M,M,M,M,M,M,M,M,M,M,M,M,M,M,M,M,M,M,M,M,M,M,,,,,,,,,,,,,,,0,M,M,M,M,M,M,M,M,M,M,M,M,M,M,M,M,M,M,M,M,M,M,M,M,M,M,M,M,,,,,,,,,,,,,,,,,,,,,,,,,,,,,0,M,M,M,M,M,M,M,M,M,M,M,M,,,,,,,,,,,,,A
144511,2:Study Visit 2 (Month 12),9.54,47.4,47.4,,47.4,154.9,155.0,,154.95,1.43,114.5,19.74,1.97,97.55,1.24,89.26,2.81,99.75,,,Standing,154.4,81.1,0.996,0.91,2:No,2:No,2:No,2:No,2:No,2:No,2:No,2:No,2:No,2:No,2:No,2:No,2:No,2:No,2:No,2:No,2:No,2:No,2:No,2:No,2:No,2:No,2:No,2:No,2:No,2:No,-2,-2,0,M,M,M,M,M,M,M,M,M,M,M,M,M,M,M,M,M,M,M,M,M,M,M,M,M,M,M,M,,,,,,,,,,,,,,,0,M,M,M,M,M,M,M,M,M,M,M,M,M,M,M,M,M,M,M,M,M,M,M,M,M,M,M,M,,,,,,,,,,,,,,,,,,,,,,,,,,,,,0,M,M,M,M,M,M,M,M,M,M,M,M,,,,,,,,,,,,,A
144511,3:Study Visit 3 (Month 24),10.54,55.7,55.7,,55.7,163.5,163.3,,163.4,1.59,126.5,20.86,2.05,98,1.3,90.29,3.13,99.91,,,Standing,168.0,80.0,1.028,1.04,1:Yes,2:No,2:No,2:No,2:No,2:No,2:No,2:No,2:No,2:No,2:No,2:No,2:No,1:Yes,2:No,2:No,2:No,2:No,2:No,2:No,2:No,2:No,2:No,2:No,2:No,2:No,-2,-2,0,M,M,M,M,M,M,M,M,M,M,M,M,M,M,M,M,M,M,M,M,M,M,M,M,M,M,M,M,,,,,,,,,,,,,,,0,M,M,M,M,M,M,M,M,M,M,M,M,M,M,M,M,M,M,M,M,M,M,M,M,M,M,M,M,,,,,,,,,,,,,,,,,,,,,,,,,,,,,0,M,M,M,M,M,M,M,M,M,M,M,M,,,,,,,,,,,,,A
144511,4:Study Visit 4 (Month 36),11.56,63.3,63.3,,63.3,173.2,173.1,,173.15,1.74,138.7,21.11,2.06,98.05,1.15,87.56,3.51,99.98,,,Standing,175.0,89.0,1.011,0.95,2:No,2:No,2:No,2:No,2:No,2:No,2:No,2:No,2:No,2:No,2:No,2:No,2:No,2:No,2:No,2:No,2:No,2:No,2:No,2:No,2:No,2:No,2:No,2:No,2:No,2:No,-2,-2,0,M,M,M,M,M,M,M,M,M,M,M,M,M,M,M,M,M,M,M,M,M,M,M,M,M,M,M,M,,,,,,,,,,,,,,,0,M,M,M,M,M,M,M,M,M,M,M,M,M,M,M,M,M,M,M,M,M,M,M,M,M,M,M,M,,,,,,,,,,,,,,,,,,,,,,,,,,,,,0,M,M,M,M,M,M,M,M,M,M,M,M,,,,,,,,,,,,,A
144515,1:Study Visit 1 (Month 6),12.18,48.6,48.6,,48.6,172.5,173.0,,172.75,1.51,146.2,16.29,0.77,77.86,-0.81,20.97,2.88,99.8,,,Standing,187.0,97.0,1.082,0.78,2:No,2:No,2:No,-8:Unknown,2:No,2:No,-8:Unknown,-8:Unknown,-8:Unknown,1:Yes,2:No,-8:Unknown,2:No,2:No,2:No,2:No,-8:Unknown,2:No,2:No,2:No,2:No,2:No,2:No,2:No,2:No,2:No,-2,-2,0,M,M,M,M,M,M,M,M,M,M,M,M,M,M,M,M,M,M,M,M,M,M,M,M,M,M,M,M,,,,,,,,,,,,,,,0,M,M,M,M,M,M,M,M,M,M,M,M,M,M,M,M,M,M,M,M,M,M,M,M,M,M,M,M,,,,,,,,,,,,,,,,,,,,,,,,,,,,,0,M,M,M,M,M,M,M,M,M,M,M,M,,,,,,,,,,,,,A
144515,2:Study Visit 2 (Month 12),12.6,49.8,49.8,,49.8,177.5,178.0,,177.75,1.55,151.2,15.76,0.65,74.29,-1.27,10.12,3.1,99.9,,,Standing,199.5,98.5,1.122,0.8,2:No,2:No,2:No,-8:Unknown,2:No,2:No,2:No,2:No,2:No,1:Yes,2:No,-8:Unknown,2:No,2:No,2:No,2:No,-8:Unknown,-8:Unknown,2:No,2:No,2:No,2:No,2:No,2:No,2:No,2:No,-2,-2,0,M,M,M,M,M,M,M,M,M,M,M,M,M,M,M,M,M,M,M,M,M,M,M,M,M,M,M,M,,,,,,,,,,,,,,,1,99,M,M,M,M,M,M,M,M,M,M,M,M,M,99,M,M,M,M,M,M,M,M,M,M,M,M,M,12.6,,,,,,,,,,,,,,,,,,,,,,,,,,,,0,M,M,M,M,M,M,M,M,M,M,M,M,,,,,,,,,,,,,A
144515,3:Study Visit 3 (Month 24),13.63,57.5,57.6,,57.55,187.0,187.0,,187,1.71,163.6,16.46,0.79,78.49,-1.19,11.71,3.32,99.95,,,Standing,202.0,103.0,1.08,0.82,2:No,2:No,2:No,-8:Unknown,2:No,2:No,2:No,2:No,2:No,2:No,2:No,-8:Unknown,2:No,2:No,2:No,2:No,-8:Unknown,2:No,2:No,2:No,2:No,2:No,2:No,2:No,2:No,2:No,-2,-2,2,99,99,M,M,M,M,M,M,M,M,M,M,M,M,99,99,M,M,M,M,M,M,M,M,M,M,M,M,12.9,12.9,,,,,,,,,,,,,0,M,M,M,M,M,M,M,M,M,M,M,M,M,M,M,M,M,M,M,M,M,M,M,M,M,M,M,M,,,,,,,,,,,,,,,,,,,,,,,,,,,,,0,M,M,M,M,M,M,M,M,M,M,M,M,,,,,,,,,,,,,A
144517,1:Study Visit 1 (Month 6),19.93,46.3,46.3,,46.3,178.4,178.2,,178.3,1.49,239.2,14.56,-3.19,0.07,-5.32,0,0.21,58.13,,,Standing,196.0,113.0,1.099,0.58,2:No,2:No,2:No,2:No,2:No,2:No,2:No,2:No,2:No,2:No,2:No,2:No,2:No,2:No,2:No,2:No,-8:Unknown,2:No,2:No,2:No,2:No,2:No,2:No,2:No,2:No,2:No,-2,-2,0,M,M,M,M,M,M,M,M,M,M,M,M,M,M,M,M,M,M,M,M,M,M,M,M,M,M,M,M,,,,,,,,,,,,,,,0,M,M,M,M,M,M,M,M,M,M,M,M,M,M,M,M,M,M,M,M,M,M,M,M,M,M,M,M,,,,,,,,,,,,,,,,,,,,,,,,,,,,,0,M,M,M,M,M,M,M,M,M,M,M,M,,,,,,,,,,,,,A
144517,2:Study Visit 2 (Month 12),20.43,45.9,45.8,,45.85,179.2,178.9,,179.05,1.48,245.2,14.3,,,,,,,,,Standing,195.6,115.5,1.092,0.55,2:No,2:No,2:No,2:No,2:No,2:No,2:No,2:No,2:No,2:No,2:No,2:No,2:No,2:No,2:No,2:No,2:No,2:No,2:No,2:No,2:No,2:No,2:No,2:No,2:No,2:No,-2,-2,0,M,M,M,M,M,M,M,M,M,M,M,M,M,M,M,M,M,M,M,M,M,M,M,M,M,M,M,M,,,,,,,,,,,,,,,0,M,M,M,M,M,M,M,M,M,M,M,M,M,M,M,M,M,M,M,M,M,M,M,M,M,M,M,M,,,,,,,,,,,,,,,,,,,,,,,,,,,,,0,M,M,M,M,M,M,M,M,M,M,M,M,,,,,,,,,,,,,A
144517,3:Study Visit 3 (Month 24),21.42,49.5,49.5,,49.5,178.8,178.7,,178.75,1.55,257,15.49,,,,,,,,,Standing,195.1,115.6,1.091,0.55,2:No,2:No,2:No,2:No,2:No,2:No,2:No,2:No,2:No,2:No,2:No,2:No,2:No,2:No,2:No,2:No,2:No,2:No,2:No,2:No,2:No,2:No,2:No,2:No,2:No,2:No,-2,-2,1,18,M,M,M,M,M,M,M,M,M,M,M,M,M,08,M,M,M,M,M,M,M,M,M,M,M,M,M,,,,,,,,,,,,,,,0,M,M,M,M,M,M,M,M,M,M,M,M,M,M,M,M,M,M,M,M,M,M,M,M,M,M,M,M,,,,,,,,,,,,,,,,,,,,,,,,,,,,,0,M,M,M,M,M,M,M,M,M,M,M,M,,,,,,,,,,,,,A
144517,4:Study Visit 4 (Month 36),22.46,46.8,46.8,,46.8,179.1,179.0,,179.05,1.5,269.5,14.6,,,,,,,,,Standing,195.8,116.0,1.094,0.54,2:No,2:No,2:No,2:No,2:No,2:No,2:No,2:No,2:No,2:No,2:No,2:No,2:No,2:No,2:No,2:No,2:No,2:No,2:No,2:No,2:No,2:No,2:No,2:No,2:No,2:No,-2,-2,0,M,M,M,M,M,M,M,M,M,M,M,M,M,M,M,M,M,M,M,M,M,M,M,M,M,M,M,M,,,,,,,,,,,,,,,0,M,M,M,M,M,M,M,M,M,M,M,M,M,M,M,M,M,M,M,M,M,M,M,M,M,M,M,M,,,,,,,,,,,,,,,,,,,,,,,,,,,,,0,M,M,M,M,M,M,M,M,M,M,M,M,,,,,,,,,,,,,A
144519,1:Study Visit 1 (Month 6),24.35,124.6,124.5,,124.55,208.5,208.5,,208.5,2.7,292.2,28.65,,,,,,,,,Standing,207.5,108.5,0.995,0.92,2:No,2:No,2:No,-8:Unknown,2:No,2:No,2:No,2:No,2:No,1:Yes,2:No,2:No,2:No,2:No,2:No,2:No,2:No,2:No,2:No,2:No,2:No,2:No,2:No,2:No,2:No,2:No,-2,-2,0,M,M,M,M,M,M,M,M,M,M,M,M,M,M,M,M,M,M,M,M,M,M,M,M,M,M,M,M,,,,,,,,,,,,,,,0,M,M,M,M,M,M,M,M,M,M,M,M,M,M,M,M,M,M,M,M,M,M,M,M,M,M,M,M,,,,,,,,,,,,,,,,,,,,,,,,,,,,,0,M,M,M,M,M,M,M,M,M,M,M,M,,,,,,,,,,,,,A
144519,2:Study Visit 2 (Month 12),24.89,128.3,128.3,,128.3,208.4,208.4,,208.4,2.74,298.7,29.54,,,,,,,,,Standing,207.5,108.5,0.996,0.92,2:No,2:No,2:No,2:No,2:No,2:No,2:No,2:No,2:No,2:No,2:No,2:No,2:No,2:No,2:No,2:No,-8:Unknown,2:No,2:No,2:No,2:No,2:No,2:No,2:No,2:No,2:No,-2,-2,0,M,M,M,M,M,M,M,M,M,M,M,M,M,M,M,M,M,M,M,M,M,M,M,M,M,M,M,M,,,,,,,,,,,,,,,0,M,M,M,M,M,M,M,M,M,M,M,M,M,M,M,M,M,M,M,M,M,M,M,M,M,M,M,M,,,,,,,,,,,,,,,,,,,,,,,,,,,,,0,M,M,M,M,M,M,M,M,M,M,M,M,,,,,,,,,,,,,A
144519,3:Study Visit 3 (Month 24),25.91,123.7,123.7,,123.7,206.4,206.4,,206.4,2.68,310.9,29.04,,,,,,,,,Standing,207.5,107.0,1.005,0.93,2:No,2:No,2:No,2:No,2:No,2:No,2:No,2:No,2:No,2:No,2:No,2:No,2:No,2:No,2:No,2:No,2:No,2:No,2:No,2:No,2:No,2:No,2:No,2:No,2:No,2:No,-2,-2,0,M,M,M,M,M,M,M,M,M,M,M,M,M,M,M,M,M,M,M,M,M,M,M,M,M,M,M,M,,,,,,,,,,,,,,,0,M,M,M,M,M,M,M,M,M,M,M,M,M,M,M,M,M,M,M,M,M,M,M,M,M,M,M,M,,,,,,,,,,,,,,,,,,,,,,,,,,,,,0,M,M,M,M,M,M,M,M,M,M,M,M,,,,,,,,,,,,,A
144519,4:Study Visit 4 (Month 36),26,121.2,121.2,,121.2,206.4,206.4,,206.4,2.65,312,28.45,,,,,,,,,Standing,207.5,107.0,1.005,0.93,2:No,2:No,2:No,2:No,2:No,2:No,2:No,2:No,2:No,2:No,2:No,2:No,2:No,2:No,2:No,2:No,2:No,2:No,2:No,2:No,2:No,2:No,2:No,2:No,2:No,2:No,-2,-2,0,M,M,M,M,M,M,M,M,M,M,M,M,M,M,M,M,M,M,M,M,M,M,M,M,M,M,M,M,,,,,,,,,,,,,,,0,M,M,M,M,M,M,M,M,M,M,M,M,M,M,M,M,M,M,M,M,M,M,M,M,M,M,M,M,,,,,,,,,,,,,,,,,,,,,,,,,,,,,0,M,M,M,M,M,M,M,M,M,M,M,M,,,,,,,,,,,,,A
144520,1:Study Visit 1 (Month 6),5.61,21.6,21.6,,21.6,121.9,122.4,,122.15,0.85,67.3,14.48,0.62,73.31,-0.83,20.3,1.92,97.25,,,Standing,124.0,67.0,1.015,0.82,2:No,2:No,2:No,2:No,2:No,2:No,2:No,2:No,2:No,2:No,2:No,2:No,2:No,2:No,2:No,2:No,2:No,2:No,2:No,2:No,2:No,2:No,2:No,2:No,2:No,2:No,-2,-2,0,M,M,M,M,M,M,M,M,M,M,M,M,M,M,M,M,M,M,M,M,M,M,M,M,M,M,M,M,,,,,,,,,,,,,,,0,M,M,M,M,M,M,M,M,M,M,M,M,M,M,M,M,M,M,M,M,M,M,M,M,M,M,M,M,,,,,,,,,,,,,,,,,,,,,,,,,,,,,0,M,M,M,M,M,M,M,M,M,M,M,M,,,,,,,,,,,,,A
144520,2:Study Visit 2 (Month 12),6.13,23.1,23.1,,23.1,128.0,127.6,,127.8,0.9,73.6,14.14,0.65,74.27,-1.16,12.34,2.29,98.89,,,Standing,125.0,68.0,0.978,0.88,2:No,2:No,2:No,2:No,2:No,2:No,2:No,2:No,2:No,2:No,2:No,2:No,2:No,2:No,2:No,2:No,2:No,2:No,2:No,2:No,2:No,2:No,2:No,2:No,2:No,2:No,-2,-2,0,M,M,M,M,M,M,M,M,M,M,M,M,M,M,M,M,M,M,M,M,M,M,M,M,M,M,M,M,,,,,,,,,,,,,,,0,M,M,M,M,M,M,M,M,M,M,M,M,M,M,M,M,M,M,M,M,M,M,M,M,M,M,M,M,,,,,,,,,,,,,,,,,,,,,,,,,,,,,0,M,M,M,M,M,M,M,M,M,M,M,M,,,,,,,,,,,,,A
144520,3:Study Visit 3 (Month 24),7.09,25.3,25.3,,25.3,134.0,134.0,,134,0.96,85.1,14.09,0.53,70.31,-1.23,10.87,2.12,98.3,,,Standing,135.0,69.5,1.007,0.93,2:No,2:No,2:No,-8:Unknown,2:No,2:No,2:No,2:No,2:No,2:No,2:No,-8:Unknown,2:No,2:No,2:No,2:No,2:No,2:No,2:No,2:No,2:No,2:No,2:No,2:No,2:No,2:No,-2,-2,0,M,M,M,M,M,M,M,M,M,M,M,M,M,M,M,M,M,M,M,M,M,M,M,M,M,M,M,M,,,,,,,,,,,,,,,0,M,M,M,M,M,M,M,M,M,M,M,M,M,M,M,M,M,M,M,M,M,M,M,M,M,M,M,M,,,,,,,,,,,,,,,,,,,,,,,,,,,,,0,M,M,M,M,M,M,M,M,M,M,M,M,,,,,,,,,,,,,A
144520,4:Study Visit 4 (Month 36),8.16,27.8,27.9,,27.85,141.4,141.7,,141.55,1.03,97.9,13.9,0.4,65.55,-1.55,6.05,2.13,98.33,,,Standing,142.0,81.0,1.003,0.75,2:No,2:No,2:No,2:No,2:No,2:No,2:No,2:No,2:No,2:No,2:No,2:No,2:No,2:No,2:No,2:No,2:No,2:No,2:No,2:No,2:No,2:No,2:No,2:No,2:No,2:No,-2,-2,0,M,M,M,M,M,M,M,M,M,M,M,M,M,M,M,M,M,M,M,M,M,M,M,M,M,M,M,M,,,,,,,,,,,,,,,0,M,M,M,M,M,M,M,M,M,M,M,M,M,M,M,M,M,M,M,M,M,M,M,M,M,M,M,M,,,,,,,,,,,,,,,,,,,,,,,,,,,,,0,M,M,M,M,M,M,M,M,M,M,M,M,,,,,,,,,,,,,A
144525,1:Study Visit 1 (Month 6),1.99,13.4,13.4,,13.4,91.0,91.0,,91,0.59,23.9,16.18,0.96,83.21,,,1.77,96.2,0.18,57.04,Standing,94.0,45.0,1.033,1.02,2:No,2:No,2:No,2:No,2:No,2:No,2:No,2:No,2:No,2:No,2:No,-8:Unknown,2:No,2:No,2:No,2:No,-8:Unknown,2:No,2:No,2:No,2:No,2:No,2:No,2:No,2:No,2:No,-2,-2,0,M,M,M,M,M,M,M,M,M,M,M,M,M,M,M,M,M,M,M,M,M,M,M,M,M,M,M,M,,,,,,,,,,,,,,,0,M,M,M,M,M,M,M,M,M,M,M,M,M,M,M,M,M,M,M,M,M,M,M,M,M,M,M,M,,,,,,,,,,,,,,,,,,,,,,,,,,,,,0,M,M,M,M,M,M,M,M,M,M,M,M,,,,,,,,,,,,,A
144525,2:Study Visit 2 (Month 12),2.55,15.0,14.9,,14.95,98.5,99.2,,98.85,0.64,30.6,15.3,1.12,86.96,-0.57,28.33,2.22,98.67,-0.15,44.18,Standing,103.5,52.0,1.047,0.9,2:No,2:No,2:No,2:No,2:No,2:No,2:No,2:No,2:No,2:No,2:No,2:No,2:No,2:No,2:No,2:No,2:No,2:No,2:No,2:No,2:No,2:No,2:No,2:No,2:No,2:No,-2,-2,0,M,M,M,M,M,M,M,M,M,M,M,M,M,M,M,M,M,M,M,M,M,M,M,M,M,M,M,M,,,,,,,,,,,,,,,0,M,M,M,M,M,M,M,M,M,M,M,M,M,M,M,M,M,M,M,M,M,M,M,M,M,M,M,M,,,,,,,,,,,,,,,,,,,,,,,,,,,,,0,M,M,M,M,M,M,M,M,M,M,M,M,,,,,,,,,,,,,A
144525,3:Study Visit 3 (Month 24),3.56,18.0,18.0,,18,110.2,110.0,,110.1,0.74,42.7,14.85,1.34,91.05,-0.54,29.33,2.85,99.78,-0.32,37.57,Standing,114.0,56.0,1.035,0.97,2:No,2:No,2:No,2:No,2:No,2:No,2:No,2:No,2:No,2:No,2:No,2:No,2:No,2:No,2:No,2:No,2:No,2:No,2:No,2:No,2:No,2:No,2:No,2:No,2:No,2:No,-2,-2,0,M,M,M,M,M,M,M,M,M,M,M,M,M,M,M,M,M,M,M,M,M,M,M,M,M,M,M,M,,,,,,,,,,,,,,,0,M,M,M,M,M,M,M,M,M,M,M,M,M,M,M,M,M,M,M,M,M,M,M,M,M,M,M,M,,,,,,,,,,,,,,,,,,,,,,,,,,,,,0,M,M,M,M,M,M,M,M,M,M,M,M,,,,,,,,,,,,,A
144525,4:Study Visit 4 (Month 36),4.48,21.4,21.3,,21.35,118.5,118.5,,118.5,0.84,53.8,15.2,1.52,93.63,0,49.95,2.99,99.86,-0.16,43.54,Standing,123.0,59.5,1.038,0.99,2:No,2:No,2:No,2:No,2:No,2:No,2:No,2:No,2:No,2:No,2:No,2:No,2:No,2:No,2:No,2:No,2:No,2:No,2:No,2:No,2:No,2:No,2:No,2:No,2:No,2:No,-2,-2,0,M,M,M,M,M,M,M,M,M,M,M,M,M,M,M,M,M,M,M,M,M,M,M,M,M,M,M,M,,,,,,,,,,,,,,,0,M,M,M,M,M,M,M,M,M,M,M,M,M,M,M,M,M,M,M,M,M,M,M,M,M,M,M,M,,,,,,,,,,,,,,,,,,,,,,,,,,,,,0,M,M,M,M,M,M,M,M,M,M,M,M,,,,,,,,,,,,,A
144527,1:Study Visit 1 (Month 6),11.84,48.0,48.0,,48,159.8,159.5,,159.65,1.45,142.1,18.83,0.89,81.43,0.45,67.18,1.54,93.77,,,Standing,169.7,88.5,1.063,0.8,2:No,2:No,2:No,-8:Unknown,2:No,2:No,-8:Unknown,-8:Unknown,-8:Unknown,-8:Unknown,2:No,2:No,2:No,2:No,2:No,2:No,-8:Unknown,2:No,2:No,2:No,2:No,2:No,2:No,2:No,2:No,2:No,-2,-2,0,M,M,M,M,M,M,M,M,M,M,M,M,M,M,M,M,M,M,M,M,M,M,M,M,M,M,M,M,,,,,,,,,,,,,,,0,M,M,M,M,M,M,M,M,M,M,M,M,M,M,M,M,M,M,M,M,M,M,M,M,M,M,M,M,,,,,,,,,,,,,,,,,,,,,,,,,,,,,0,M,M,M,M,M,M,M,M,M,M,M,M,,,,,,,,,,,,,A
144527,2:Study Visit 2 (Month 12),12.36,50.8,50.8,,50.8,164.0,164.0,,164,1.51,148.3,18.89,0.87,80.74,0.34,63.14,1.62,94.79,,,Standing,173.0,92.0,1.055,0.78,2:No,2:No,2:No,-8:Unknown,2:No,2:No,2:No,2:No,2:No,2:No,2:No,2:No,2:No,1:Yes,2:No,2:No,-8:Unknown,-8:Unknown,2:No,2:No,2:No,2:No,2:No,2:No,2:No,2:No,-2,-2,0,M,M,M,M,M,M,M,M,M,M,M,M,M,M,M,M,M,M,M,M,M,M,M,M,M,M,M,M,,,,,,,,,,,,,,,0,M,M,M,M,M,M,M,M,M,M,M,M,M,M,M,M,M,M,M,M,M,M,M,M,M,M,M,M,,,,,,,,,,,,,,,,,,,,,,,,,,,,,0,M,M,M,M,M,M,M,M,M,M,M,M,,,,,,,,,,,,,A
144527,3:Study Visit 3 (Month 24),13.37,53.5,54.0,54.0,53.833333333,175.0,175.0,,175,1.6,160.4,17.58,0.61,72.81,-0.49,31.17,2.02,97.81,,,Standing,184.7,95.0,1.055,0.84,2:No,2:No,2:No,2:No,2:No,2:No,-8:Unknown,-8:Unknown,-8:Unknown,-8:Unknown,2:No,-8:Unknown,-8:Unknown,2:No,2:No,-8:Unknown,2:No,2:No,2:No,2:No,2:No,2:No,2:No,2:No,2:No,2:No,-2,-2,0,M,M,M,M,M,M,M,M,M,M,M,M,M,M,M,M,M,M,M,M,M,M,M,M,M,M,M,M,,,,,,,,,,,,,,,0,M,M,M,M,M,M,M,M,M,M,M,M,M,M,M,M,M,M,M,M,M,M,M,M,M,M,M,M,,,,,,,,,,,,,,,,,,,,,,,,,,,,,0,M,M,M,M,M,M,M,M,M,M,M,M,,,,,,,,,,,,,A
144527,4:Study Visit 4 (Month 36),14.4,58.2,58.2,,58.2,181.2,180.9,,181.05,1.69,172.8,17.76,0.47,68.04,-0.73,23.39,1.88,97.03,,,Standing,187.7,100.7,1.037,0.8,2:No,2:No,2:No,2:No,2:No,2:No,2:No,2:No,2:No,2:No,2:No,2:No,2:No,1:Yes,2:No,2:No,2:No,2:No,2:No,2:No,2:No,2:No,2:No,2:No,2:No,2:No,-2,-2,0,M,M,M,M,M,M,M,M,M,M,M,M,M,M,M,M,M,M,M,M,M,M,M,M,M,M,M,M,,,,,,,,,,,,,,,0,M,M,M,M,M,M,M,M,M,M,M,M,M,M,M,M,M,M,M,M,M,M,M,M,M,M,M,M,,,,,,,,,,,,,,,,,,,,,,,,,,,,,0,M,M,M,M,M,M,M,M,M,M,M,M,,,,,,,,,,,,,A
144529,1:Study Visit 1 (Month 6),4.22,21.0,21.0,,21,114.0,114.0,,114,0.82,50.6,16.16,1.65,95.08,0.66,74.66,2.53,99.42,0.5,69,Standing,113.0,57.5,0.991,0.98,1:Yes,2:No,2:No,2:No,2:No,2:No,2:No,2:No,2:No,1:Yes,2:No,-8:Unknown,2:No,2:No,2:No,2:No,-8:Unknown,2:No,2:No,2:No,2:No,2:No,2:No,2:No,2:No,2:No,-2,-2,1,99,M,M,M,M,M,M,M,M,M,M,M,M,M,99,M,M,M,M,M,M,M,M,M,M,M,M,M,,,,,,,,,,,,,,,0,M,M,M,M,M,M,M,M,M,M,M,M,M,M,M,M,M,M,M,M,M,M,M,M,M,M,M,M,,,,,,,,,,,,,,,,,,,,,,,,,,,,,0,M,M,M,M,M,M,M,M,M,M,M,M,,,,,,,,,,,,,A
144529,2:Study Visit 2 (Month 12),4.68,22.3,22.3,,22.3,118.0,118.0,,118,0.85,56.2,16.02,1.6,94.49,0.6,72.64,2.57,99.49,0.36,63.97,Standing,118.0,58.0,1,1.03,1:Yes,2:No,2:No,-8:Unknown,2:No,2:No,2:No,2:No,2:No,1:Yes,2:No,-8:Unknown,2:No,2:No,2:No,2:No,-8:Unknown,2:No,2:No,2:No,2:No,2:No,2:No,2:No,2:No,2:No,-2,-2,0,M,M,M,M,M,M,M,M,M,M,M,M,M,M,M,M,M,M,M,M,M,M,M,M,M,M,M,M,,,,,,,,,,,,,,,0,M,M,M,M,M,M,M,M,M,M,M,M,M,M,M,M,M,M,M,M,M,M,M,M,M,M,M,M,,,,,,,,,,,,,,,,,,,,,,,,,,,,,0,M,M,M,M,M,M,M,M,M,M,M,M,,,,,,,,,,,,,A
144529,3:Study Visit 3 (Month 24),5.6,25.4,25.3,,25.35,125.0,125.0,,125,0.94,67.2,16.22,1.57,94.2,0.68,75.1,2.45,99.29,,,Standing,129.0,64.5,1.032,0.94,2:No,2:No,2:No,-8:Unknown,2:No,2:No,2:No,2:No,2:No,2:No,2:No,-8:Unknown,2:No,2:No,2:No,2:No,-8:Unknown,1:Yes,2:No,2:No,2:No,2:No,2:No,2:No,2:No,2:No,-2,-2,0,M,M,M,M,M,M,M,M,M,M,M,M,M,M,M,M,M,M,M,M,M,M,M,M,M,M,M,M,,,,,,,,,,,,,,,1,99,M,M,M,M,M,M,M,M,M,M,M,M,M,99,M,M,M,M,M,M,M,M,M,M,M,M,M,5.2,,,,,,,,,,,,,,,,,,,,,,,,,,,,0,M,M,M,M,M,M,M,M,M,M,M,M,,,,,,,,,,,,,A
144529,4:Study Visit 4 (Month 36),6.57,28.0,27.9,,27.95,132.5,133.0,,132.75,1.01,78.8,15.86,1.41,92.03,0.33,62.85,2.45,99.29,,,Standing,135.5,68.5,1.021,0.94,1:Yes,2:No,2:No,-8:Unknown,2:No,2:No,2:No,2:No,2:No,1:Yes,2:No,-8:Unknown,2:No,2:No,2:No,2:No,-8:Unknown,2:No,2:No,2:No,2:No,2:No,2:No,2:No,2:No,2:No,-2,-2,2,09,99,M,M,M,M,M,M,M,M,M,M,M,M,08,99,M,M,M,M,M,M,M,M,M,M,M,M,5.9,5.9,,,,,,,,,,,,,0,M,M,M,M,M,M,M,M,M,M,M,M,M,M,M,M,M,M,M,M,M,M,M,M,M,M,M,M,,,,,,,,,,,,,,,,,,,,,,,,,,,,,0,M,M,M,M,M,M,M,M,M,M,M,M,,,,,,,,,,,,,A
144530,1:Study Visit 1 (Month 6),7.06,24.3,24.3,,24.3,133.0,133.0,,133,0.94,84.7,13.74,0.3,61.86,-1.63,5.19,1.98,97.61,,,Standing,133.4,68.0,1.003,0.96,2:No,2:No,2:No,2:No,2:No,2:No,2:No,2:No,2:No,2:No,2:No,2:No,2:No,2:No,2:No,2:No,2:No,2:No,2:No,2:No,2:No,2:No,2:No,2:No,2:No,2:No,-2,-2,0,M,M,M,M,M,M,M,M,M,M,M,M,M,M,M,M,M,M,M,M,M,M,M,M,M,M,M,M,,,,,,,,,,,,,,,0,M,M,M,M,M,M,M,M,M,M,M,M,M,M,M,M,M,M,M,M,M,M,M,M,M,M,M,M,,,,,,,,,,,,,,,,,,,,,,,,,,,,,0,M,M,M,M,M,M,M,M,M,M,M,M,,,,,,,,,,,,,A
144530,2:Study Visit 2 (Month 12),7.6,25.9,25.9,,25.9,137.0,137.0,,137,0.98,91.2,13.8,0.33,63.05,-1.59,5.58,2.01,97.78,,,Standing,137.0,71.0,1,0.93,2:No,2:No,2:No,2:No,2:No,2:No,2:No,2:No,2:No,2:No,2:No,2:No,2:No,2:No,2:No,2:No,2:No,2:No,2:No,2:No,2:No,2:No,2:No,2:No,2:No,2:No,-2,-2,0,M,M,M,M,M,M,M,M,M,M,M,M,M,M,M,M,M,M,M,M,M,M,M,M,M,M,M,M,,,,,,,,,,,,,,,1,10,M,M,M,M,M,M,M,M,M,M,M,M,M,99,M,M,M,M,M,M,M,M,M,M,M,M,M,7.1,,,,,,,,,,,,,,,,,,,,,,,,,,,,0,M,M,M,M,M,M,M,M,M,M,M,M,,,,,,,,,,,,,A
144530,3:Study Visit 3 (Month 24),8.65,26.6,26.7,,26.65,144.0,144.0,,144,1.02,103.8,12.85,-0.19,42.3,-2.89,0.19,2,97.75,,,Standing,141.9,72.5,0.985,0.99,2:No,2:No,2:No,2:No,1:Yes,2:No,2:No,2:No,2:No,2:No,2:No,2:No,2:No,2:No,2:No,2:No,2:No,2:No,2:No,2:No,2:No,2:No,2:No,2:No,2:No,2:No,-2,-2,1,25,M,M,M,M,M,M,M,M,M,M,M,M,M,04,M,M,M,M,M,M,M,M,M,M,M,M,M,8.4,,,,,,,,,,,,,,1,10,M,M,M,M,M,M,M,M,M,M,M,M,M,99,M,M,M,M,M,M,M,M,M,M,M,M,M,8.4,,,,,,,,,,,,,,,,,,,,,,,,,,,,0,M,M,M,M,M,M,M,M,M,M,M,M,,,,,,,,,,,,,A
144530,4:Study Visit 4 (Month 36),9.6,29.7,29.7,,29.7,148.0,148.0,,148,1.09,115.2,13.56,-0.16,43.67,-2.19,1.43,1.73,95.85,,,Standing,145.5,76.5,0.983,0.93,2:No,2:No,2:No,2:No,1:Yes,2:No,2:No,2:No,2:No,2:No,2:No,2:No,2:No,2:No,2:No,2:No,2:No,2:No,2:No,2:No,2:No,2:No,2:No,2:No,2:No,2:No,-2,-2,0,M,M,M,M,M,M,M,M,M,M,M,M,M,M,M,M,M,M,M,M,M,M,M,M,M,M,M,M,,,,,,,,,,,,,,,0,M,M,M,M,M,M,M,M,M,M,M,M,M,M,M,M,M,M,M,M,M,M,M,M,M,M,M,M,,,,,,,,,,,,,,,,,,,,,,,,,,,,,0,M,M,M,M,M,M,M,M,M,M,M,M,,,,,,,,,,,,,A
144531,1:Study Visit 1 (Month 6),7.33,25.6,25.6,,25.6,133.2,133.0,,133.1,0.96,88,14.45,0.44,67.11,-0.9,18.48,1.66,95.14,,,Standing,139.6,69.0,1.049,0.93,2:No,2:No,2:No,2:No,2:No,2:No,2:No,2:No,2:No,2:No,2:No,2:No,2:No,2:No,2:No,2:No,2:No,2:No,2:No,2:No,2:No,2:No,2:No,2:No,2:No,2:No,-2,-2,0,M,M,M,M,M,M,M,M,M,M,M,M,M,M,M,M,M,M,M,M,M,M,M,M,M,M,M,M,,,,,,,,,,,,,,,3,99,99,10,M,M,M,M,M,M,M,M,M,M,M,99,99,01,M,M,M,M,M,M,M,M,M,M,M,7.3,7.3,7.3,,,,,,,,,,,,,,,,,,,,,,,,,,0,M,M,M,M,M,M,M,M,M,M,M,M,,,,,,,,,,,,,A
144531,2:Study Visit 2 (Month 12),7.87,27.4,27.4,,27.4,136.8,136.5,,136.65,1.01,94.4,14.67,0.49,68.88,-0.77,21.94,1.64,94.93,,,Standing,146.5,70.0,1.072,0.95,2:No,2:No,2:No,2:No,1:Yes,2:No,-8:Unknown,-8:Unknown,-8:Unknown,1:Yes,2:No,2:No,2:No,2:No,2:No,1:Yes,2:No,2:No,2:No,2:No,2:No,2:No,2:No,2:No,2:No,2:No,-2,-2,1,99,M,M,M,M,M,M,M,M,M,M,M,M,M,99,M,M,M,M,M,M,M,M,M,M,M,M,M,7.4,,,,,,,,,,,,,,1,99,M,M,M,M,M,M,M,M,M,M,M,M,M,99,M,M,M,M,M,M,M,M,M,M,M,M,M,7.4,,,,,,,,,,,,,,,,,,,,,,,,,,,,0,M,M,M,M,M,M,M,M,M,M,M,M,,,,,,,,,,,,,A
144531,3:Study Visit 3 (Month 24),8.78,28.9,28.9,,28.9,142.0,141.9,,141.95,1.06,105.4,14.34,0.22,58.53,-1.23,10.91,1.55,93.98,,,Standing,152.5,75.0,1.074,0.89,2:No,1:Yes,2:No,2:No,2:No,2:No,2:No,2:No,2:No,1:Yes,2:No,2:No,2:No,1:Yes,2:No,2:No,2:No,2:No,2:No,2:No,2:No,2:No,2:No,2:No,2:No,2:No,-2,-2,1,99,M,M,M,M,M,M,M,M,M,M,M,M,M,99,M,M,M,M,M,M,M,M,M,M,M,M,M,7.9,,,,,,,,,,,,,,1,10,M,M,M,M,M,M,M,M,M,M,M,M,M,05,M,M,M,M,M,M,M,M,M,M,M,M,M,8.6,,,,,,,,,,,,,,,,,,,,,,,,,,,,0,M,M,M,M,M,M,M,M,M,M,M,M,,,,,,,,,,,,,A
144531,4:Study Visit 4 (Month 36),9.89,33.9,33.9,,33.9,149.0,148.9,,148.95,1.17,118.7,15.28,0.39,65.19,-0.76,22.25,1.63,94.84,,,Standing,161.2,80.5,1.082,0.85,2:No,2:No,2:No,2:No,2:No,2:No,2:No,2:No,2:No,2:No,2:No,2:No,2:No,1:Yes,2:No,2:No,2:No,2:No,2:No,2:No,2:No,2:No,2:No,2:No,2:No,2:No,-2,-2,0,M,M,M,M,M,M,M,M,M,M,M,M,M,M,M,M,M,M,M,M,M,M,M,M,M,M,M,M,,,,,,,,,,,,,,,0,M,M,M,M,M,M,M,M,M,M,M,M,M,M,M,M,M,M,M,M,M,M,M,M,M,M,M,M,,,,,,,,,,,,,,,,,,,,,,,,,,,,,0,M,M,M,M,M,M,M,M,M,M,M,M,,,,,,,,,,,,,A
144533,1:Study Visit 1 (Month 6),7.66,33.4,33.4,,33.4,133.0,133.0,,133,1.11,91.9,18.88,1.63,94.8,1.42,92.29,1.25,89.48,,,Standing,143.0,70.0,1.075,0.9,2:No,2:No,2:No,2:No,2:No,2:No,2:No,2:No,2:No,2:No,2:No,2:No,2:No,2:No,2:No,2:No,2:No,1:Yes,2:No,2:No,2:No,2:No,2:No,2:No,2:No,2:No,-2,-2,1,18,M,M,M,M,M,M,M,M,M,M,M,M,M,99,M,M,M,M,M,M,M,M,M,M,M,M,M,7.2,,,,,,,,,,,,,,2,25,03,M,M,M,M,M,M,M,M,M,M,M,M,03,04,M,M,M,M,M,M,M,M,M,M,M,M,7.2,7.3,,,,,,,,,,,,,10,800,,,,,,,,,,,,,1,16,M,M,M,M,M,01,M,M,M,M,M,7.2,,,,,,45,,,,,,A
144533,2:Study Visit 2 (Month 12),8.12,35.5,35.5,,35.5,136.0,136.0,,136,1.16,97.4,19.19,1.63,94.8,1.41,92.06,1.26,89.55,,,Standing,147.5,74.0,1.085,0.84,2:No,2:No,2:No,-8:Unknown,2:No,-8:Unknown,-8:Unknown,-8:Unknown,-8:Unknown,-8:Unknown,2:No,-8:Unknown,2:No,2:No,2:No,2:No,2:No,2:No,2:No,2:No,2:No,2:No,2:No,2:No,2:No,2:No,-2,-2,1,03,M,M,M,M,M,M,M,M,M,M,M,M,M,04,M,M,M,M,M,M,M,M,M,M,M,M,M,7.3,,,,,,,,,,,,,,1,03,M,M,M,M,M,M,M,M,M,M,M,M,M,04,M,M,M,M,M,M,M,M,M,M,M,M,M,7.9,,,,,,,,,,,,,,800,,,,,,,,,,,,,,0,M,M,M,M,M,M,M,M,M,M,M,M,,,,,,,,,,,,,A