random_ID,VISIT,VISIT_AGE,RELATIVE,REL_NUM,RELCODE_0,RELCODE_1,RELCODE_2,RELCODE_3,RELCODE_4,DECEASED_0,DECEASED_1,DECEASED_2,DECEASED_3,DECEASED_4,AORANEUR_0,AORANEUR_1,AORANEUR_2,AORANEUR_3,AORANEUR_4,ANEURLOC_0,ANEURLOC_1,ANEURLOC_2,ANEURLOC_3,ANEURLOC_4,AORDISS_0,AORDISS_1,AORDISS_2,AORDISS_3,AORDISS_4,DISSLOC_0,DISSLOC_1,DISSLOC_2,DISSLOC_3,DISSLOC_4,AORSURG_0,AORSURG_1,AORSURG_2,AORSURG_3,AORSURG_4,SURGLOC_0,SURGLOC_1,SURGLOC_2,SURGLOC_3,SURGLOC_4,SURGAGE_0,SURGAGE_1,SURGAGE_2,SURGAGE_3,SURGAGE_4,MVSURG_0,MVSURG_1,MVSURG_2,MVSURG_3,MVSURG_4,ECTLENTIS_0,ECTLENTIS_1,ECTLENTIS_2,ECTLENTIS_3,ECTLENTIS_4,VITALSTAT_0,VITALSTAT_1,VITALSTAT_2,VITALSTAT_3,VITALSTAT_4,DEATHCAUSE_0,DEATHCAUSE_1,DEATHCAUSE_2,DEATHCAUSE_3,DEATHCAUSE_4,DEATHAGE_0,DEATHAGE_1,DEATHAGE_2,DEATHAGE_3,DEATHAGE_4,REL_NUM_NEW,RELCODE_NEW_0,RELCODE_NEW_1,AORANEUR_NEW_0,AORANEUR_NEW_1,ANEURLOC_NEW_0,ANEURLOC_NEW_1,AORDISS_NEW_0,AORDISS_NEW_1,DISSLOC_NEW_0,DISSLOC_NEW_1,AORSURG_NEW_0,AORSURG_NEW_1,SURGLOC_NEW_0,SURGLOC_NEW_1,SURGAGE_NEW_0,SURGAGE_NEW_1,MVSURG_NEW_0,MVSURG_NEW_1,ECTLENT_NEW_0,ECTLENT_NEW_1,VITALSTAT_NE_0,VITALSTAT_NE_1,DEATHCAUSE_N_0,DEATHCAUSE_N_1,DEATHAGE_NEW_0,DEATHAGE_NEW_1,RELATIVE_NEW,SCREENED_REL,SCREENED_NUM,RANDOMSCREENID_0,RANDOMSCREENID_1,RANDOMSCREENID_2,RANDOMSCREENID_3,SCREENED_COD_0,SCREENED_COD_1,SCREENED_COD_2,SCREENED_COD_3,VER_ID
144511,STUDY VISIT 4 (MONTH 36),11.6,YES,1,Father,,,,,NO,,,,,No,,,,,-2,,,,,No,,,,,-2,,,,,No,,,,,-2,,,,,,,,,,No,,,,,No,,,,,Yes,,,,,-2,,,,,,,,,,,,,,,,,,,,,,,,,,,,,,,,,,,,,NO,NO,,,,,,,,,,B
144517,STUDY VISIT 4 (MONTH 36),22.5,YES,2,Father,Brother,,,,NO,NO,,,,Yes,No,,,,Descending aorta/Abnominal,-2,,,,Yes,No,,,,Unknown,-2,,,,No,Unknown,,,,-2,-2,,,,,,,,,No,Unknown,,,,No,No,,,,Yes,Yes,,,,-2,-2,,,,,,,,,,,,,,,,,,,,,,,,,,,,,,,,,,,,NO,NO,,,,,,,,,,B
144519,STUDY VISIT 4 (MONTH 36),27,NO,,,,,,,,,,,,,,,,,,,,,,,,,,,,,,,,,,,,,,,,,,,,,,,,,,,,,,,,,,,,,,,,,,,,,,,,,,,,,,,,,,,,,,,,,,,,,,,,,,,NO,NO,,,,,,,,,,B
144520,STUDY VISIT 4 (MONTH 36),8.2,NO,,,,,,,,,,,,,,,,,,,,,,,,,,,,,,,,,,,,,,,,,,,,,,,,,,,,,,,,,,,,,,,,,,,,,,,,,,,,,,,,,,,,,,,,,,,,,,,,,,,NO,NO,,,,,,,,,,B
144525,STUDY VISIT 4 (MONTH 36),4.5,YES,3,Mother,Paternal Grandfather,Brother,,,NO,NO,NO,,,No,No,No,,,-2,-2,-2,,,No,No,No,,,-2,-2,-2,,,No,No,No,,,-2,-2,-2,,,,,,,,No,No,No,,,No,Yes,No,,,Yes,Yes,Yes,,,-2,-2,-2,,,,,,,,,,,,,,,,,,,,,,,,,,,,,,,,,,,NO,YES,1,144878,,,,Brother,,,,B
144527,STUDY VISIT 4 (MONTH 36),14.4,YES,2,Father,Brother,,,,NO,NO,,,,No,No,,,,-2,-2,,,,No,No,,,,-2,-2,,,,No,No,,,,-2,-2,,,,,,,,,No,No,,,,No,No,,,,Yes,Yes,,,,-2,-2,,,,,,,,,,,,,,,,,,,,,,,,,,,,,,,,,,,,NO,NO,,,,,,,,,,B
144529,STUDY VISIT 4 (MONTH 36),6.6,YES,1,Mother,,,,,NO,,,,,No,,,,,-2,,,,,No,,,,,-2,,,,,No,,,,,-2,,,,,,,,,,No,,,,,No,,,,,Yes,,,,,-2,,,,,,,,,,,,,,,,,,,,,,,,,,,,,,,,,,,,,NO,NO,,,,,,,,,,B
144530,STUDY VISIT 4 (MONTH 36),9.6,YES,2,Father,Paternal Grandmother,,,,YES,YES,,,,-2,-2,,,,-2,-2,,,,-2,-2,,,,-2,-2,,,,-2,-2,,,,-2,-2,,,,,,,,,-2,-2,,,,-2,-2,,,,-2,-2,,,,-2,-2,,,,,,,,,,,,,,,,,,,,,,,,,,,,,,,,,,,,NO,NO,,,,,,,,,,B
144531,STUDY VISIT 4 (MONTH 36),9.9,NO,,,,,,,,,,,,,,,,,,,,,,,,,,,,,,,,,,,,,,,,,,,,,,,,,,,,,,,,,,,,,,,,,,,,,,,,,,,,,,,,,,,,,,,,,,,,,,,,,,,NO,NO,,,,,,,,,,B
144533,STUDY VISIT 4 (MONTH 36),10.2,YES,1,Sister,,,,,NO,,,,,No,,,,,-2,,,,,No,,,,,-2,,,,,No,,,,,-2,,,,,,,,,,No,,,,,No,,,,,Yes,,,,,-2,,,,,,,,,,,,,,,,,,,,,,,,,,,,,,,,,,,,,NO,YES,1,145752,,,,Sister,,,,B
144534,STUDY VISIT 4 (MONTH 36),15.4,NO,,,,,,,,,,,,,,,,,,,,,,,,,,,,,,,,,,,,,,,,,,,,,,,,,,,,,,,,,,,,,,,,,,,,,,,,,,,,,,,,,,,,,,,,,,,,,,,,,,,NO,NO,,,,,,,,,,B
144537,STUDY VISIT 4 (MONTH 36),22.6,YES,2,Father,Paternal Grandfather,,,,NO,NO,,,,No,No,,,,-2,-2,,,,No,No,,,,-2,-2,,,,No,No,,,,-2,-2,,,,,,,,,No,No,,,,No,No,,,,Yes,Yes,,,,-2,-2,,,,,,,,,,,,,,,,,,,,,,,,,,,,,,,,,,,,NO,NO,,,,,,,,,,B
144538,STUDY VISIT 4 (MONTH 36),17,YES,2,Mother,Maternal Grandmother,,,,NO,YES,,,,No,-2,,,,-2,-2,,,,No,-2,,,,-2,-2,,,,No,-2,,,,-2,-2,,,,,,,,,No,-2,,,,No,-2,,,,Yes,-2,,,,-2,-2,,,,,,,,,,,,,,,,,,,,,,,,,,,,,,,,,,,,NO,NO,,,,,,,,,,B
144544,STUDY VISIT 4 (MONTH 36),20.9,NO,,,,,,,,,,,,,,,,,,,,,,,,,,,,,,,,,,,,,,,,,,,,,,,,,,,,,,,,,,,,,,,,,,,,,,,,,,,,,,,,,,,,,,,,,,,,,,,,,,,NO,NO,,,,,,,,,,B
144548,STUDY VISIT 4 (MONTH 36),17.5,YES,2,Mother,Brother,,,,NO,NO,,,,No,No,,,,-2,-2,,,,No,No,,,,-2,-2,,,,No,No,,,,-2,-2,,,,,,,,,No,No,,,,No,No,,,,Yes,Yes,,,,-2,-2,,,,,,,,,,,,,,,,,,,,,,,,,,,,,,,,,,,,NO,NO,,,,,,,,,,B
144549,STUDY VISIT 4 (MONTH 36),8.3,NO,,,,,,,,,,,,,,,,,,,,,,,,,,,,,,,,,,,,,,,,,,,,,,,,,,,,,,,,,,,,,,,,,,,,,,,,,,,,,,,,,,,,,,,,,,,,,,,,,,,NO,NO,,,,,,,,,,B
144553,STUDY VISIT 4 (MONTH 36),7.6,YES,3,Father,Brother,Paternal Grandfather,,,NO,NO,NO,,,No,No,No,,,-2,-2,-2,,,No,No,No,,,-2,-2,-2,,,No,No,No,,,-2,-2,-2,,,,,,,,No,No,No,,,No,No,No,,,Yes,Yes,Yes,,,-2,-2,-2,,,,,,,,,,,,,,,,,,,,,,,,,,,,,,,,,,,NO,NO,,,,,,,,,,B
144554,STUDY VISIT 4 (MONTH 36),18,NO,,,,,,,,,,,,,,,,,,,,,,,,,,,,,,,,,,,,,,,,,,,,,,,,,,,,,,,,,,,,,,,,,,,,,,,,,,,,,,,,,,,,,,,,,,,,,,,,,,,NO,NO,,,,,,,,,,B
144556,STUDY VISIT 4 (MONTH 36),12.3,NO,,,,,,,V,V,V,V,V,,,,,,,,,,,,,,,,,,,,,,,,,,,,,,,,,,,,,,,,,,,,,,,,,,,,,,,,,,,,,,,,,,,,,,,,,,,,,,,,,,,,,,,,NO,NO,,,,,,,,,,A
144558,STUDY VISIT 4 (MONTH 36),5.4,YES,1,Mother,,,,,NO,,,,,No,,,,,-2,,,,,No,,,,,-2,,,,,No,,,,,-2,,,,,,,,,,No,,,,,No,,,,,Yes,,,,,-2,,,,,,,,,,,,,,,,,,,,,,,,,,,,,,,,,,,,,NO,NO,,,,,,,,,,B
144568,STUDY VISIT 4 (MONTH 36),16.7,NO,,,,,,,,,,,,,,,,,,,,,,,,,,,,,,,,,,,,,,,,,,,,,,,,,,,,,,,,,,,,,,,,,,,,,,,,,,,,,,,,,,,,,,,,,,,,,,,,,,,NO,NO,,,,,,,,,,B
144572,STUDY VISIT 4 (MONTH 36),14.5,NO,,,,,,,V,V,V,V,V,,,,,,,,,,,,,,,,,,,,,,,,,,,,,,,,,,,,,,,,,,,,,,,,,,,,,,,,,,,,,,,,,,,,,,,,,,,,,,,,,,,,,,,,NO,NO,,,,,,,,,,A
144573,STUDY VISIT 4 (MONTH 36),10,NO,,,,,,,,,,,,,,,,,,,,,,,,,,,,,,,,,,,,,,,,,,,,,,,,,,,,,,,,,,,,,,,,,,,,,,,,,,,,,,,,,,,,,,,,,,,,,,,,,,,NO,NO,,,,,,,,,,B
144574,STUDY VISIT 4 (MONTH 36),21.8,YES,2,Father,Brother,,,,NO,NO,,,,No,No,,,,-2,-2,,,,No,Yes,,,,-2,Aortic Root/Ascending aorta,,,,No,Yes,,,,-2,Descending aorta/Abnominal,,,,,20,,,,No,No,,,,No,No,,,,Yes,Yes,,,,-2,-2,,,,,,,,,,,,,,,,,,,,,,,,,,,,,,,,,,,,NO,NO,,,,,,,,,,B
144576,STUDY VISIT 4 (MONTH 36),7.1,YES,3,Father,Paternal Grandmother,Brother,,,NO,YES,NO,,,No,-2,No,,,-2,-2,-2,,,No,-2,No,,,-2,-2,-2,,,No,-2,No,,,-2,-2,-2,,,,,,,,No,-2,No,,,No,-2,No,,,Yes,-2,Yes,,,-2,-2,-2,,,,,,,,,,,,,,,,,,,,,,,,,,,,,,,,,,,NO,YES,1,145500,,,,Brother,,,,B
144579,STUDY VISIT 4 (MONTH 36),14.9,NO,,,,,,,,,,,,,,,,,,,,,,,,,,,,,,,,,,,,,,,,,,,,,,,,,,,,,,,,,,,,,,,,,,,,,,,,,,,,,,,,,,,,,,,,,,,,,,,,,,,NO,NO,,,,,,,,,,B
144581,STUDY VISIT 4 (MONTH 36),16.4,NO,,,,,,,,,,,,,,,,,,,,,,,,,,,,,,,,,,,,,,,,,,,,,,,,,,,,,,,,,,,,,,,,,,,,,,,,,,,,,,,,,,,,,,,,,,,,,,,,,,,NO,NO,,,,,,,,,,B
144582,STUDY VISIT 4 (MONTH 36),13.8,YES,2,Mother,Maternal Grandmother,,,,,,,,,No,No,,,,-2,-2,,,,No,No,,,,-2,-2,,,,No,No,,,,-2,-2,,,,,,,,,No,No,,,,No,No,,,,Yes,No,,,,-2,Aortic Dissection,,,,,47,,,,,,,,,,,,,,,,,,,,,,,,,,,,,,,NO,NO,,,,,,,,,,A
144584,STUDY VISIT 4 (MONTH 36),18.3,YES,2,Paternal Grandfather,Mother,,,,,,,,,No,No,,,,-2,-2,,,,No,No,,,,-2,-2,,,,No,No,,,,-2,-2,,,,,,,,,No,No,,,,No,No,,,,Yes,Yes,,,,-2,-2,,,,,,,,,,,,,,,,,,,,,,,,,,,,,,,,,,,,NO,NO,,,,,,,,,,A
144587,STUDY VISIT 4 (MONTH 36),25.4,NO,,,,,,,,,,,,,,,,,,,,,,,,,,,,,,,,,,,,,,,,,,,,,,,,,,,,,,,,,,,,,,,,,,,,,,,,,,,,,,,,,,,,,,,,,,,,,,,,,,,NO,NO,,,,,,,,,,B
144588,STUDY VISIT 4 (MONTH 36),15.2,NO,,,,,,,,,,,,,,,,,,,,,,,,,,,,,,,,,,,,,,,,,,,,,,,,,,,,,,,,,,,,,,,,,,,,,,,,,,,,,,,,,,,,,,,,,,,,,,,,,,,NO,NO,,,,,,,,,,B
144589,STUDY VISIT 4 (MONTH 36),8.7,NO,,,,,,,V,V,V,V,V,,,,,,,,,,,,,,,,,,,,,,,,,,,,,,,,,,,,,,,,,,,,,,,,,,,,,,,,,,,,,,,,,,,,,,,,,,,,,,,,,,,,,,,,NO,NO,,,,,,,,,,A
144591,STUDY VISIT 4 (MONTH 36),18.6,NO,,,,,,,V,V,V,V,V,,,,,,,,,,,,,,,,,,,,,,,,,,,,,,,,,,,,,,,,,,,,,,,,,,,,,,,,,,,,,,,,,,,,,,,,,,,,,,,,,,,,,,,,NO,NO,,,,,,,,,,A
144593,STUDY VISIT 4 (MONTH 36),17.5,YES,2,Father,Paternal Grandfather,,,,,,,,,No,Unknown,,,,-2,-2,,,,No,Unknown,,,,-2,-2,,,,No,Unknown,,,,-2,-2,,,,,,,,,No,Unknown,,,,No,Unknown,,,,No,Yes,,,,Other Cardiac,-2,,,,42,,,,,,,,,,,,,,,,,,,,,,,,,,,,,,,,NO,NO,,,,,,,,,,A
144594,STUDY VISIT 4 (MONTH 36),14.5,YES,2,Father,Maternal Grandmother,,,,NO,NO,,,,No,No,,,,-2,-2,,,,No,No,,,,-2,-2,,,,No,No,,,,-2,-2,,,,,,,,,No,No,,,,No,No,,,,Yes,Yes,,,,-2,-2,,,,,,,,,,,,,,,,,,,,,,,,,,,,,,,,,,,,NO,NO,,,,,,,,,,B
144595,STUDY VISIT 4 (MONTH 36),21.2,NO,,,,,,,,,,,,,,,,,,,,,,,,,,,,,,,,,,,,,,,,,,,,,,,,,,,,,,,,,,,,,,,,,,,,,,,,,,,,,,,,,,,,,,,,,,,,,,,,,,,NO,NO,,,,,,,,,,B
144597,STUDY VISIT 4 (MONTH 36),4.3,YES,2,Mother,Brother,,,,NO,NO,,,,No,No,,,,-2,-2,,,,No,No,,,,-2,-2,,,,No,No,,,,-2,-2,,,,,,,,,No,No,,,,No,No,,,,Yes,Yes,,,,-2,-2,,,,,,,,,,,,,,,,,,,,,,,,,,,,,,,,,,,,NO,YES,1,145827,,,,Brother,,,,B
144600,STUDY VISIT 4 (MONTH 36),9.5,YES,3,Father,Brother,Brother,,,YES,NO,NO,,,-2,No,No,,,-2,-2,-2,,,-2,No,No,,,-2,-2,-2,,,-2,No,No,,,-2,-2,-2,,,,,,,,-2,No,No,,,-2,No,No,,,-2,Yes,Yes,,,-2,-2,-2,,,,,,,,,,,,,,,,,,,,,,,,,,,,,,,,,,,NO,YES,2,145252,145649,,,Brother,Brother,,,B
144605,STUDY VISIT 4 (MONTH 36),3.5,YES,2,Father,Brother,,,,NO,NO,,,,No,No,,,,-2,-2,,,,No,No,,,,-2,-2,,,,No,No,,,,-2,-2,,,,,,,,,No,No,,,,No,No,,,,Yes,Yes,,,,-2,-2,,,,,,,,,,,,,,,,,,,,,,,,,,,,,,,,,,,,NO,YES,1,145568,,,,Brother,,,,B
144606,STUDY VISIT 4 (MONTH 36),12.9,NO,,,,,,,,,,,,,,,,,,,,,,,,,,,,,,,,,,,,,,,,,,,,,,,,,,,,,,,,,,,,,,,,,,,,,,,,,,,,,,,,,,,,,,,,,,,,,,,,,,,NO,NO,,,,,,,,,,B
144612,STUDY VISIT 4 (MONTH 36),8.8,YES,1,Father,,,,,NO,,,,,No,,,,,-2,,,,,No,,,,,-2,,,,,No,,,,,-2,,,,,,,,,,No,,,,,No,,,,,Yes,,,,,-2,,,,,,,,,,,,,,,,,,,,,,,,,,,,,,,,,,,,,NO,NO,,,,,,,,,,B
144613,STUDY VISIT 4 (MONTH 36),12.8,NO,,,,,,,,,,,,,,,,,,,,,,,,,,,,,,,,,,,,,,,,,,,,,,,,,,,,,,,,,,,,,,,,,,,,,,,,,,,,,,,,,,,,,,,,,,,,,,,,,,,NO,NO,,,,,,,,,,B
144614,STUDY VISIT 4 (MONTH 36),24.5,YES,2,Brother,Father,,,,NO,YES,,,,No,-2,,,,-2,-2,,,,No,-2,,,,-2,-2,,,,Unknown,-2,,,,-2,-2,,,,,,,,,Unknown,-2,,,,No,-2,,,,Yes,-2,,,,-2,-2,,,,,,,,,,,,,,,,,,,,,,,,,,,,,,,,,,,,NO,NO,,,,,,,,,,B
144615,STUDY VISIT 4 (MONTH 36),10.6,NO,,,,,,,,,,,,,,,,,,,,,,,,,,,,,,,,,,,,,,,,,,,,,,,,,,,,,,,,,,,,,,,,,,,,,,,,,,,,,,,,,,,,,,,,,,,,,,,,,,,NO,NO,,,,,,,,,,B
144620,STUDY VISIT 4 (MONTH 36),15.2,NO,,,,,,,,,,,,,,,,,,,,,,,,,,,,,,,,,,,,,,,,,,,,,,,,,,,,,,,,,,,,,,,,,,,,,,,,,,,,,,,,,,,,,,,,,,,,,,,,,,,NO,NO,,,,,,,,,,B
144622,STUDY VISIT 4 (MONTH 36),4.3,YES,2,Father,Brother,,,,NO,NO,,,,No,No,,,,-2,-2,,,,No,No,,,,-2,-2,,,,No,No,,,,-2,-2,,,,,,,,,No,No,,,,No,No,,,,Yes,Yes,,,,-2,-2,,,,,,,,,,,,,,,,,,,,,,,,,,,,,,,,,,,,NO,YES,1,145506,,,,Brother,,,,B
144625,STUDY VISIT 4 (MONTH 36),7.8,YES,1,Father,,,,,NO,,,,,No,,,,,-2,,,,,No,,,,,-2,,,,,No,,,,,-2,,,,,,,,,,No,,,,,No,,,,,Yes,,,,,-2,,,,,,,,,,1,Maternal Grandmother,,Yes,,Aortic Root/Ascending aorta,,No,,-2,,Yes,,Aortic Root/Ascending aorta,,52,,Unknown,,No,,Yes,,-2,,,,YES,NO,,,,,,,,,,B
144626,STUDY VISIT 4 (MONTH 36),3.6,YES,2,Father,Paternal Grandmother,,,,NO,NO,,,,No,No,,,,-2,-2,,,,No,No,,,,-2,-2,,,,Yes,No,,,,Unknown,-2,,,,,,,,,No,No,,,,No,No,,,,Yes,Yes,,,,-2,-2,,,,,,,,,,,,,,,,,,,,,,,,,,,,,,,,,,,,NO,YES,2,145505,145151,,,Sister,Sister,,,B
144627,STUDY VISIT 4 (MONTH 36),24.9,YES,4,Mother,Sister,Brother,Daughter,,NO,NO,NO,NO,,No,No,No,No,,-2,-2,-2,-2,,No,No,No,No,,-2,-2,-2,-2,,No,No,No,No,,-2,-2,-2,-2,,,,,,,No,No,No,No,,No,No,No,No,,Yes,Yes,Yes,Yes,,-2,-2,-2,-2,,,,,,,,,,,,,,,,,,,,,,,,,,,,,,,,,,NO,YES,1,145359,,,,Daughter,,,,B
144630,STUDY VISIT 4 (MONTH 36),18,YES,2,Father,Paternal Grandmother,,,,NO,NO,,,,No,No,,,,-2,-2,,,,No,No,,,,-2,-2,,,,Yes,No,,,,Aortic Root/Ascending aorta,-2,,,,43,,,,,No,Yes,,,,No,No,,,,Yes,Yes,,,,-2,-2,,,,,,,,,,,,,,,,,,,,,,,,,,,,,,,,,,,,NO,NO,,,,,,,,,,B
144632,STUDY VISIT 4 (MONTH 36),7.5,YES,1,Mother,,,,,NO,,,,,No,,,,,-2,,,,,No,,,,,-2,,,,,No,,,,,-2,,,,,,,,,,No,,,,,No,,,,,Yes,,,,,-2,,,,,,,,,,,,,,,,,,,,,,,,,,,,,,,,,,,,,NO,NO,,,,,,,,,,B
144633,STUDY VISIT 4 (MONTH 36),12,NO,,,,,,,,,,,,,,,,,,,,,,,,,,,,,,,,,,,,,,,,,,,,,,,,,,,,,,,,,,,,,,,,,,,,,,,,,,,,,,,,,,,,,,,,,,,,,,,,,,,NO,NO,,,,,,,,,,B
144638,STUDY VISIT 4 (MONTH 36),18,YES,1,Mother,,,,,NO,,,,,No,,,,,-2,,,,,No,,,,,-2,,,,,No,,,,,-2,,,,,,,,,,No,,,,,No,,,,,Yes,,,,,-2,,,,,,,,,,,,,,,,,,,,,,,,,,,,,,,,,,,,,NO,YES,1,145751,,,,Brother,,,,B
144653,STUDY VISIT 4 (MONTH 36),5.7,NO,,,,,,,,,,,,,,,,,,,,,,,,,,,,,,,,,,,,,,,,,,,,,,,,,,,,,,,,,,,,,,,,,,,,,,,,,,,,,,,,,,,,,,,,,,,,,,,,,,,NO,NO,,,,,,,,,,B
144654,STUDY VISIT 4 (MONTH 36),9.3,NO,,,,,,,,,,,,,,,,,,,,,,,,,,,,,,,,,,,,,,,,,,,,,,,,,,,,,,,,,,,,,,,,,,,,,,,,,,,,,,,,,,,,,,,,,,,,,,,,,,,NO,NO,,,,,,,,,,B
144655,STUDY VISIT 4 (MONTH 36),5.4,YES,1,Father,,,,,NO,,,,,No,,,,,-2,,,,,No,,,,,-2,,,,,No,,,,,-2,,,,,,,,,,No,,,,,Yes,,,,,Yes,,,,,-2,,,,,,,,,,,,,,,,,,,,,,,,,,,,,,,,,,,,,NO,NO,,,,,,,,,,B
144656,STUDY VISIT 4 (MONTH 36),17.8,YES,2,Father,Paternal Grandmother,,,,NO,NO,,,,No,Unknown,,,,-2,-2,,,,No,Unknown,,,,-2,-2,,,,No,Unknown,,,,-2,-2,,,,,,,,,No,Unknown,,,,No,Unknown,,,,Yes,Unknown,,,,-2,-2,,,,,,,,,,,,,,,,,,,,,,,,,,,,,,,,,,,,NO,NO,,,,,,,,,,B
144658,STUDY VISIT 4 (MONTH 36),22.4,YES,2,Father,Paternal Grandmother,,,,NO,YES,,,,No,-2,,,,-2,-2,,,,No,-2,,,,-2,-2,,,,No,-2,,,,-2,-2,,,,,,,,,Unknown,-2,,,,Unknown,-2,,,,Yes,-2,,,,-2,-2,,,,,,,,,1,Sister,,No,,-2,,No,,-2,,No,,-2,,,,No,,No,,Yes,,-2,,,,YES,NO,,,,,,,,,,B
144660,STUDY VISIT 4 (MONTH 36),4.9,NO,,,,,,,,,,,,,,,,,,,,,,,,,,,,,,,,,,,,,,,,,,,,,,,,,,,,,,,,,,,,,,,,,,,,,,,,,,,,,,,,,,,,,,,,,,,,,,,,,,,NO,NO,,,,,,,,,,B
144663,STUDY VISIT 4 (MONTH 36),12.6,YES,2,Mother,Maternal Grandmother,,,,,,,,,No,No,,,,-2,-2,,,,No,No,,,,-2,-2,,,,No,No,,,,-2,-2,,,,,,,,,No,No,,,,No,Unknown,,,,Yes,Yes,,,,-2,-2,,,,,,,,,,,,,,,,,,,,,,,,,,,,,,,,,,,,NO,NO,,,,,,,,,,A
144670,STUDY VISIT 4 (MONTH 36),9.8,YES,1,Father,,,,,,,,,,No,,,,,-2,,,,,Yes,,,,,Aortic Root/Ascending aorta,,,,,Yes,,,,,Aortic Root/Ascending aorta,,,,,35,,,,,No,,,,,No,,,,,No,,,,,Aortic Dissection,,,,,35,,,,,,,,,,,,,,,,,,,,,,,,,,,,,,,,NO,NO,,,,,,,,,,A
144674,STUDY VISIT 4 (MONTH 36),19.6,NO,,,,,,,,,,,,,,,,,,,,,,,,,,,,,,,,,,,,,,,,,,,,,,,,,,,,,,,,,,,,,,,,,,,,,,,,2,Mother,Brother,No,No,-2,-2,No,No,-2,-2,No,No,-2,-2,,,No,No,No,No,Yes,Yes,-2,-2,,,YES,NO,,,,,,,,,,B
144677,STUDY VISIT 4 (MONTH 36),17.2,NO,,,,,,,,,,,,,,,,,,,,,,,,,,,,,,,,,,,,,,,,,,,,,,,,,,,,,,,,,,,,,,,,,,,,,,,,,,,,,,,,,,,,,,,,,,,,,,,,,,,NO,NO,,,,,,,,,,B
144687,STUDY VISIT 4 (MONTH 36),20.3,NO,,,,,,,,,,,,,,,,,,,,,,,,,,,,,,,,,,,,,,,,,,,,,,,,,,,,,,,,,,,,,,,,,,,,,,,,,,,,,,,,,,,,,,,,,,,,,,,,,,,NO,NO,,,,,,,,,,B
144689,STUDY VISIT 4 (MONTH 36),5.8,YES,2,Mother,Brother,,,,NO,NO,,,,No,No,,,,-2,-2,,,,No,No,,,,-2,-2,,,,No,No,,,,-2,-2,,,,,,,,,No,No,,,,No,No,,,,Yes,Yes,,,,-2,-2,,,,,,,,,,,,,,,,,,,,,,,,,,,,,,,,,,,,NO,NO,,,,,,,,,,B
144690,STUDY VISIT 4 (MONTH 36),9.1,NO,,,,,,,,,,,,,,,,,,,,,,,,,,,,,,,,,,,,,,,,,,,,,,,,,,,,,,,,,,,,,,,,,,,,,,,,,,,,,,,,,,,,,,,,,,,,,,,,,,,NO,NO,,,,,,,,,,B
144691,STUDY VISIT 4 (MONTH 36),15.7,YES,2,Mother,Brother,,,,NO,NO,,,,No,No,,,,-2,-2,,,,No,No,,,,-2,-2,,,,Yes,No,,,,Unknown,-2,,,,47,,,,,No,No,,,,No,No,,,,Yes,Yes,,,,-2,-2,,,,,,,,,,,,,,,,,,,,,,,,,,,,,,,,,,,,NO,YES,1,144704,,,,Brother,,,,B
144697,STUDY VISIT 4 (MONTH 36),19.6,NO,,,,,,,,,,,,,,,,,,,,,,,,,,,,,,,,,,,,,,,,,,,,,,,,,,,,,,,,,,,,,,,,,,,,,,,,,,,,,,,,,,,,,,,,,,,,,,,,,,,NO,NO,,,,,,,,,,B
144699,STUDY VISIT 4 (MONTH 36),17,YES,1,Brother,,,,,NO,,,,,No,,,,,-2,,,,,No,,,,,-2,,,,,No,,,,,-2,,,,,,,,,,No,,,,,No,,,,,Yes,,,,,-2,,,,,,,,,,,,,,,,,,,,,,,,,,,,,,,,,,,,,NO,YES,1,145157,,,,Brother,,,,B
144700,STUDY VISIT 4 (MONTH 36),17.3,YES,1,Mother,,,,,NO,,,,,No,,,,,-2,,,,,No,,,,,-2,,,,,No,,,,,-2,,,,,,,,,,No,,,,,No,,,,,Yes,,,,,-2,,,,,,,,,,,,,,,,,,,,,,,,,,,,,,,,,,,,,NO,NO,,,,,,,,,,B
144704,STUDY VISIT 4 (MONTH 36),20.4,YES,2,Mother,Brother,,,,NO,NO,,,,No,No,,,,-2,-2,,,,No,No,,,,-2,-2,,,,Yes,No,,,,Unknown,-2,,,,47,,,,,No,No,,,,No,No,,,,Yes,Yes,,,,-2,-2,,,,,,,,,,,,,,,,,,,,,,,,,,,,,,,,,,,,NO,YES,1,144691,,,,Brother,,,,B
144705,STUDY VISIT 4 (MONTH 36),18,NO,,,,,,,,,,,,,,,,,,,,,,,,,,,,,,,,,,,,,,,,,,,,,,,,,,,,,,,,,,,,,,,,,,,,,,,,,,,,,,,,,,,,,,,,,,,,,,,,,,,NO,NO,,,,,,,,,,B
144708,STUDY VISIT 4 (MONTH 36),15.1,NO,,,,,,,,,,,,,,,,,,,,,,,,,,,,,,,,,,,,,,,,,,,,,,,,,,,,,,,,,,,,,,,,,,,,,,,,,,,,,,,,,,,,,,,,,,,,,,,,,,,NO,NO,,,,,,,,,,B
144709,STUDY VISIT 4 (MONTH 36),8.9,YES,2,Mother,Brother,,,,YES,NO,,,,-2,No,,,,-2,-2,,,,-2,No,,,,-2,-2,,,,-2,No,,,,-2,-2,,,,,,,,,-2,No,,,,-2,No,,,,-2,Yes,,,,-2,-2,,,,,,,,,,,,,,,,,,,,,,,,,,,,,,,,,,,,NO,YES,1,145115,,,,Brother,,,,B
144711,STUDY VISIT 4 (MONTH 36),15.4,NO,,,,,,,,,,,,,,,,,,,,,,,,,,,,,,,,,,,,,,,,,,,,,,,,,,,,,,,,,,,,,,,,,,,,,,,,,,,,,,,,,,,,,,,,,,,,,,,,,,,NO,NO,,,,,,,,,,B
144714,STUDY VISIT 4 (MONTH 36),12.5,YES,2,Father,Brother,,,,NO,NO,,,,No,No,,,,-2,-2,,,,No,No,,,,-2,-2,,,,No,No,,,,-2,-2,,,,,,,,,No,No,,,,No,No,,,,Yes,Yes,,,,-2,-2,,,,,,,,,,,,,,,,,,,,,,,,,,,,,,,,,,,,NO,NO,,,,,,,,,,B
144716,STUDY VISIT 4 (MONTH 36),21.8,YES,3,Maternal Grandmother,Sister,Mother,,,YES,NO,NO,,,-2,No,No,,,-2,-2,-2,,,-2,No,No,,,-2,-2,-2,,,-2,No,No,,,-2,-2,-2,,,,,,,,-2,No,No,,,-2,No,No,,,-2,Yes,Yes,,,-2,-2,-2,,,,,,,,,,,,,,,,,,,,,,,,,,,,,,,,,,,NO,NO,,,,,,,,,,B
144717,STUDY VISIT 4 (MONTH 36),27.1,YES,3,Mother,Paternal Grandfather,Sister,,,NO,NO,NO,,,No,Yes,No,,,-2,Descending aorta/Abnominal,-2,,,No,No,No,,,-2,-2,-2,,,No,No,No,,,-2,-2,-2,,,,,,,,No,No,No,,,Unknown,No,No,,,Yes,No,Yes,,,-2,Other Cardiac,-2,,,,66,,,,,,,,,,,,,,,,,,,,,,,,,,,,,,,NO,NO,,,,,,,,,,B
144720,STUDY VISIT 4 (MONTH 36),19.2,NO,,,,,,,,,,,,,,,,,,,,,,,,,,,,,,,,,,,,,,,,,,,,,,,,,,,,,,,,,,,,,,,,,,,,,,,,,,,,,,,,,,,,,,,,,,,,,,,,,,,NO,NO,,,,,,,,,,B
144724,STUDY VISIT 4 (MONTH 36),5.4,YES,2,Mother,Maternal Grandmother,,,,NO,YES,,,,No,-2,,,,-2,-2,,,,No,-2,,,,-2,-2,,,,No,-2,,,,-2,-2,,,,,,,,,No,-2,,,,No,-2,,,,Yes,-2,,,,-2,-2,,,,,,,,,,,,,,,,,,,,,,,,,,,,,,,,,,,,NO,NO,,,,,,,,,,B
144727,STUDY VISIT 4 (MONTH 36),25.6,NO,,,,,,,,,,,,,,,,,,,,,,,,,,,,,,,,,,,,,,,,,,,,,,,,,,,,,,,,,,,,,,,,,,,,,,,,,,,,,,,,,,,,,,,,,,,,,,,,,,,NO,NO,,,,,,,,,,B
144728,STUDY VISIT 4 (MONTH 36),8.8,YES,2,Mother,Maternal Grandmother,,,,NO,NO,,,,No,No,,,,-2,-2,,,,No,No,,,,-2,-2,,,,No,No,,,,-2,-2,,,,,,,,,No,No,,,,No,No,,,,Yes,Yes,,,,-2,-2,,,,,,,,,,,,,,,,,,,,,,,,,,,,,,,,,,,,NO,NO,,,,,,,,,,B
144731,STUDY VISIT 4 (MONTH 36),6.4,YES,3,Father,Sister,Brother,,,NO,NO,NO,,,No,No,No,,,-2,-2,-2,,,No,No,No,,,-2,-2,-2,,,No,No,No,,,-2,-2,-2,,,,,,,,No,No,No,,,No,No,No,,,Yes,Yes,Yes,,,-2,-2,-2,,,,,,,,,,,,,,,,,,,,,,,,,,,,,,,,,,,NO,YES,2,145324,145330,,,Brother,Sister,,,B
144734,STUDY VISIT 4 (MONTH 36),9.3,NO,,,,,,,V,V,V,V,V,,,,,,,,,,,,,,,,,,,,,,,,,,,,,,,,,,,,,,,,,,,,,,,,,,,,,,,,,,,,,,,,,,,,,,,,,,,,,,,,,,,,,,,,NO,NO,,,,,,,,,,A
144736,STUDY VISIT 4 (MONTH 36),17.2,YES,2,Father,Brother,,,,NO,NO,,,,No,No,,,,-2,-2,,,,No,No,,,,-2,-2,,,,No,No,,,,-2,-2,,,,,,,,,No,No,,,,No,No,,,,Yes,Yes,,,,-2,-2,,,,,,,,,,,,,,,,,,,,,,,,,,,,,,,,,,,,NO,NO,,,,,,,,,,B
144738,STUDY VISIT 4 (MONTH 36),3.6,YES,2,Father,Paternal Grandmother,,,,NO,NO,,,,No,No,,,,-2,-2,,,,No,No,,,,-2,-2,,,,No,No,,,,-2,-2,,,,,,,,,No,No,,,,No,No,,,,Yes,Yes,,,,-2,-2,,,,,,,,,,,,,,,,,,,,,,,,,,,,,,,,,,,,NO,NO,,,,,,,,,,B
144739,STUDY VISIT 4 (MONTH 36),12.5,NO,,,,,,,,,,,,,,,,,,,,,,,,,,,,,,,,,,,,,,,,,,,,,,,,,,,,,,,,,,,,,,,,,,,,,,,,,,,,,,,,,,,,,,,,,,,,,,,,,,,NO,NO,,,,,,,,,,B
144740,STUDY VISIT 4 (MONTH 36),19.6,NO,,,,,,,,,,,,,,,,,,,,,,,,,,,,,,,,,,,,,,,,,,,,,,,,,,,,,,,,,,,,,,,,,,,,,,,,,,,,,,,,,,,,,,,,,,,,,,,,,,,NO,NO,,,,,,,,,,B
144741,STUDY VISIT 4 (MONTH 36),12.4,YES,2,Brother,Mother,,,,NO,NO,,,,No,No,,,,-2,-2,,,,No,No,,,,-2,-2,,,,No,No,,,,-2,-2,,,,,,,,,No,No,,,,No,No,,,,Yes,Yes,,,,-2,-2,,,,,,,,,,,,,,,,,,,,,,,,,,,,,,,,,,,,NO,YES,1,144769,,,,Brother,,,,B
144743,STUDY VISIT 4 (MONTH 36),20.3,NO,,,,,,,,,,,,,,,,,,,,,,,,,,,,,,,,,,,,,,,,,,,,,,,,,,,,,,,,,,,,,,,,,,,,,,,,,,,,,,,,,,,,,,,,,,,,,,,,,,,NO,NO,,,,,,,,,,B
144744,STUDY VISIT 4 (MONTH 36),9.4,YES,1,Father,,,,,NO,,,,,No,,,,,-2,,,,,No,,,,,-2,,,,,No,,,,,-2,,,,,,,,,,No,,,,,No,,,,,Yes,,,,,-2,,,,,,,,,,,,,,,,,,,,,,,,,,,,,,,,,,,,,NO,NO,,,,,,,,,,B
144746,STUDY VISIT 4 (MONTH 36),7.1,NO,,,,,,,V,V,V,V,V,,,,,,,,,,,,,,,,,,,,,,,,,,,,,,,,,,,,,,,,,,,,,,,,,,,,,,,,,,,,,,,,,,,,,,,,,,,,,,,,,,,,,,,,NO,NO,,,,,,,,,,A
144750,STUDY VISIT 4 (MONTH 36),13.9,NO,,,,,,,,,,,,,,,,,,,,,,,,,,,,,,,,,,,,,,,,,,,,,,,,,,,,,,,,,,,,,,,,,,,,,,,,,,,,,,,,,,,,,,,,,,,,,,,,,,,NO,NO,,,,,,,,,,B
144758,STUDY VISIT 4 (MONTH 36),5.6,YES,2,Maternal Grandmother,Father,,,,YES,NO,,,,-2,No,,,,-2,-2,,,,-2,No,,,,-2,-2,,,,-2,No,,,,-2,-2,,,,,,,,,-2,No,,,,-2,Unknown,,,,-2,Yes,,,,-2,-2,,,,,,,,,,,,,,,,,,,,,,,,,,,,,,,,,,,,NO,NO,,,,,,,,,,B
144760,STUDY VISIT 4 (MONTH 36),17.3,NO,,,,,,,,,,,,,,,,,,,,,,,,,,,,,,,,,,,,,,,,,,,,,,,,,,,,,,,,,,,,,,,,,,,,,,,,,,,,,,,,,,,,,,,,,,,,,,,,,,,NO,NO,,,,,,,,,,B
144766,STUDY VISIT 4 (MONTH 36),15.4,YES,2,Mother,Paternal Grandfather,,,,NO,NO,,,,No,No,,,,-2,-2,,,,No,No,,,,-2,-2,,,,No,No,,,,-2,-2,,,,,,,,,No,No,,,,No,No,,,,Yes,Yes,,,,-2,-2,,,,,,,,,,,,,,,,,,,,,,,,,,,,,,,,,,,,NO,NO,,,,,,,,,,B
144768,STUDY VISIT 4 (MONTH 36),6.4,NO,,,,,,,,,,,,,,,,,,,,,,,,,,,,,,,,,,,,,,,,,,,,,,,,,,,,,,,,,,,,,,,,,,,,,,,,,,,,,,,,,,,,,,,,,,,,,,,,,,,NO,NO,,,,,,,,,,B
144769,STUDY VISIT 4 (MONTH 36),15,YES,2,Mother,Brother,,,,NO,NO,,,,No,No,,,,-2,-2,,,,No,No,,,,-2,-2,,,,No,No,,,,-2,-2,,,,,,,,,No,No,,,,No,No,,,,Yes,Yes,,,,-2,-2,,,,,,,,,,,,,,,,,,,,,,,,,,,,,,,,,,,,NO,YES,1,144741,,,,Brother,,,,B
144771,STUDY VISIT 4 (MONTH 36),7.9,NO,,,,,,,,,,,,,,,,,,,,,,,,,,,,,,,,,,,,,,,,,,,,,,,,,,,,,,,,,,,,,,,,,,,,,,,,,,,,,,,,,,,,,,,,,,,,,,,,,,,NO,NO,,,,,,,,,,B
144772,STUDY VISIT 4 (MONTH 36),18,NO,,,,,,,,,,,,,,,,,,,,,,,,,,,,,,,,,,,,,,,,,,,,,,,,,,,,,,,,,,,,,,,,,,,,,,,,,,,,,,,,,,,,,,,,,,,,,,,,,,,NO,NO,,,,,,,,,,B
144775,STUDY VISIT 4 (MONTH 36),6.3,YES,1,Mother,,,,,NO,,,,,Yes,,,,,Aortic Root/Ascending aorta,,,,,No,,,,,-2,,,,,No,,,,,-2,,,,,,,,,,No,,,,,No,,,,,Yes,,,,,-2,,,,,,,,,,,,,,,,,,,,,,,,,,,,,,,,,,,,,NO,NO,,,,,,,,,,B
144776,STUDY VISIT 4 (MONTH 36),27.9,YES,2,Brother,Father,,,,NO,NO,,,,No,No,,,,-2,-2,,,,No,No,,,,-2,-2,,,,No,No,,,,-2,-2,,,,,,,,,No,No,,,,No,No,,,,Yes,Yes,,,,-2,-2,,,,,,,,,,,,,,,,,,,,,,,,,,,,,,,,,,,,NO,YES,1,144765,,,,Brother,,,,B
144786,STUDY VISIT 4 (MONTH 36),7.8,YES,2,Mother,Paternal Grandfather,,,,,,,,,No,No,,,,-2,-2,,,,No,No,,,,-2,-2,,,,No,No,,,,-2,-2,,,,,,,,,No,No,,,,No,No,,,,Yes,No,,,,-2,Non-cardiac,,,,,64,,,,,,,,,,,,,,,,,,,,,,,,,,,,,,,NO,NO,,,,,,,,,,A
144787,STUDY VISIT 4 (MONTH 36),8.4,YES,2,Father,Sister,,,,NO,NO,,,,No,No,,,,-2,-2,,,,No,No,,,,-2,-2,,,,No,No,,,,-2,-2,,,,,,,,,No,No,,,,No,No,,,,Yes,Yes,,,,-2,-2,,,,,,,,,,,,,,,,,,,,,,,,,,,,,,,,,,,,NO,NO,,,,,,,,,,B
144788,STUDY VISIT 4 (MONTH 36),12,YES,1,Mother,,,,,NO,,,,,No,,,,,-2,,,,,No,,,,,-2,,,,,No,,,,,-2,,,,,,,,,,No,,,,,No,,,,,Yes,,,,,-2,,,,,,,,,,,,,,,,,,,,,,,,,,,,,,,,,,,,,NO,NO,,,,,,,,,,B
144791,STUDY VISIT 4 (MONTH 36),6.8,YES,1,Father,,,,,NO,,,,,No,,,,,-2,,,,,No,,,,,-2,,,,,No,,,,,-2,,,,,,,,,,No,,,,,No,,,,,Yes,,,,,-2,,,,,,,,,,,,,,,,,,,,,,,,,,,,,,,,,,,,,NO,NO,,,,,,,,,,B
144794,STUDY VISIT 4 (MONTH 36),11.6,YES,4,Father,Sister,Sister,Paternal Grandfather,,NO,NO,NO,NO,,No,No,No,No,,-2,-2,-2,-2,,No,No,No,No,,-2,-2,-2,-2,,No,Yes,No,No,,-2,Aortic Root/Ascending aorta,-2,-2,,,17,,,,No,Yes,No,No,,No,No,No,No,,Yes,Yes,Yes,Yes,,-2,-2,-2,-2,,,,,,,,,,,,,,,,,,,,,,,,,,,,,,,,,,NO,YES,2,145099,145647,,,Sister,Sister,,,B
144795,STUDY VISIT 4 (MONTH 36),5,NO,,,,,,,,,,,,,,,,,,,,,,,,,,,,,,,,,,,,,,,,,,,,,,,,,,,,,,,,,,,,,,,,,,,,,,,,,,,,,,,,,,,,,,,,,,,,,,,,,,,NO,NO,,,,,,,,,,B
144797,STUDY VISIT 4 (MONTH 36),15.3,NO,,,,,,,,,,,,,,,,,,,,,,,,,,,,,,,,,,,,,,,,,,,,,,,,,,,,,,,,,,,,,,,,,,,,,,,,,,,,,,,,,,,,,,,,,,,,,,,,,,,NO,NO,,,,,,,,,,B
144801,STUDY VISIT 4 (MONTH 36),23.8,YES,2,Mother,Maternal Grandmother,,,,NO,YES,,,,No,-2,,,,-2,-2,,,,No,-2,,,,-2,-2,,,,No,-2,,,,-2,-2,,,,,,,,,No,-2,,,,No,-2,,,,Yes,-2,,,,-2,-2,,,,,,,,,,,,,,,,,,,,,,,,,,,,,,,,,,,,NO,NO,,,,,,,,,,B
144806,STUDY VISIT 4 (MONTH 36),9.8,YES,2,Father,Paternal Grandmother,,,,NO,NO,,,,No,No,,,,-2,-2,,,,No,No,,,,-2,-2,,,,No,No,,,,-2,-2,,,,,,,,,No,No,,,,No,No,,,,Yes,Yes,,,,-2,-2,,,,,,,,,,,,,,,,,,,,,,,,,,,,,,,,,,,,NO,NO,,,,,,,,,,B
144809,STUDY VISIT 4 (MONTH 36),20.1,NO,,,,,,,,,,,,,,,,,,,,,,,,,,,,,,,,,,,,,,,,,,,,,,,,,,,,,,,,,,,,,,,,,,,,,,,,,,,,,,,,,,,,,,,,,,,,,,,,,,,NO,NO,,,,,,,,,,B
144813,STUDY VISIT 4 (MONTH 36),24.4,YES,2,Father,Paternal Grandmother,,,,NO,YES,,,,No,-2,,,,-2,-2,,,,No,-2,,,,-2,-2,,,,No,-2,,,,-2,-2,,,,,,,,,No,-2,,,,No,-2,,,,Yes,-2,,,,-2,-2,,,,,,,,,,,,,,,,,,,,,,,,,,,,,,,,,,,,NO,NO,,,,,,,,,,B