random_ID,STUDYDRUG122,CYCLEA122,CYCLEB122,REPEAT_CYC,RX_NUM122,CALL122_AGE,INTOL122,DIZZ122,FATIGUE122,SYNCOPE122,SOB122,OTHSX122,OTHS122,AGE18MO,SBP_122,DBP_122,SBP_PCT122,LABS_122,LABAGE_122,LABSNORM_122,ECG_DONE,ECG_AGE122,AVG_HR122,THRESHOLD122,CUR_HR122,OUTCOME122,UPDOSE122_AGE,UP_RX122,UP_FREQ122,UP_DAY122,ADJUST122_AGE,ACTION122,ADJ_RX122,ADJ_DAY122,MAINT_AGE,VER_ID
144508,Study Drug B,-2,End of cycle 1,NO,1,16.1,NO,SKIPPED,SKIPPED,SKIPPED,SKIPPED,SKIPPED,SKIPPED,NO,,,SKIPPED,NO,,-2,,16.1,78,YES,SKIPPED,Continue uptitration,16.1,0.8,Daily,75.0,,-2,,,,B
144508,Study Drug B,-2,End of cycle 2,NO,2,16.1,NO,SKIPPED,SKIPPED,SKIPPED,SKIPPED,SKIPPED,SKIPPED,NO,,,SKIPPED,NO,,-2,,16.1,76,YES,SKIPPED,Continue uptitration,16.2,1.1,Daily,100.0,,-2,,,,B
144508,Study Drug B,-2,End of cycle 3,NO,3,16.2,NO,SKIPPED,SKIPPED,SKIPPED,SKIPPED,SKIPPED,SKIPPED,NO,,,SKIPPED,NO,,-2,,16.2,81,YES,SKIPPED,End uptitration,,,-2,-2.0,,-2,,,16.2,B
144511,Study Drug A,End of cycle 1b,-2,NO,2,8.5,NO,SKIPPED,SKIPPED,SKIPPED,SKIPPED,SKIPPED,SKIPPED,NO,,,SKIPPED,NO,,-2,,8.5,92,YES,NO,Continue uptitration,8.5,2.2,Daily,75.0,,-2,,,,B
144511,Study Drug A,End of cycle 2,-2,NO,3,8.6,NO,SKIPPED,SKIPPED,SKIPPED,SKIPPED,SKIPPED,SKIPPED,NO,,,SKIPPED,NO,,-2,,8.6,83,YES,NO,Continue uptitration,8.6,2.9,Daily,100.0,,-2,,,,B
144511,Study Drug A,End of cycle 3,-2,NO,4,8.7,NO,SKIPPED,SKIPPED,SKIPPED,SKIPPED,SKIPPED,SKIPPED,NO,,,SKIPPED,NO,,-2,,8.7,80,YES,NO,Continue uptitration,8.7,3.4,Daily,125.0,,-2,,,,B
144511,Study Drug A,End of cycle 4,-2,NO,5,10.2,NO,SKIPPED,SKIPPED,SKIPPED,SKIPPED,SKIPPED,SKIPPED,NO,,,SKIPPED,SKIPPED,,-2,NO,,,SKIPPED,SKIPPED,End uptitration,,,-2,-2.0,,-2,,,8.7,D
144515,Study Drug A,End of cycle 1b,-2,NO,1,11.7,NO,SKIPPED,SKIPPED,SKIPPED,SKIPPED,SKIPPED,SKIPPED,NO,,,SKIPPED,SKIPPED,,-2,YES,11.7,79,YES,SKIPPED,Continue uptitration,11.7,2.0,Daily,87.5,,-2,,,,C
144515,Study Drug A,End of cycle 2,-2,NO,2,11.8,NO,SKIPPED,SKIPPED,SKIPPED,SKIPPED,SKIPPED,SKIPPED,NO,,,SKIPPED,SKIPPED,,-2,YES,11.8,70,YES,SKIPPED,Continue uptitration,11.8,2.9,Daily,125.0,,-2,,,,D
144515,Study Drug A,End of cycle 4,-2,NO,4,12,NO,SKIPPED,SKIPPED,SKIPPED,SKIPPED,SKIPPED,SKIPPED,NO,,,SKIPPED,SKIPPED,,-2,YES,12,68,YES,SKIPPED,Continue uptitration,12,3.5,Daily,150.0,,-2,,,,D
144515,Study Drug A,End of cycle 3,-2,NO,3,11.9,NO,SKIPPED,SKIPPED,SKIPPED,SKIPPED,SKIPPED,SKIPPED,NO,,,SKIPPED,SKIPPED,,-2,YES,11.9,73,YES,SKIPPED,Continue uptitration,11.9,3.1,Daily,137.5,,-2,,,,D
144515,Study Drug A,End of cycle 4,-2,YES,5,12,NO,SKIPPED,SKIPPED,SKIPPED,SKIPPED,SKIPPED,SKIPPED,NO,,,SKIPPED,SKIPPED,,-2,YES,12,77,YES,SKIPPED,Continue uptitration,12.1,3.8,Daily,162.5,,-2,,,,D
144515,Study Drug A,End of cycle 4,-2,YES,6,12.1,NO,SKIPPED,SKIPPED,SKIPPED,SKIPPED,SKIPPED,SKIPPED,NO,,,SKIPPED,SKIPPED,,-2,YES,12.1,77,YES,SKIPPED,End uptitration,,,-2,-2.0,,-2,,,12.1,D
144517,Study Drug B,-2,End of cycle 1,NO,1,19.5,NO,SKIPPED,SKIPPED,SKIPPED,SKIPPED,SKIPPED,SKIPPED,NO,,,SKIPPED,SKIPPED,,-2,YES,19.5,88,YES,SKIPPED,Continue uptitration,19.5,0.9,Daily,37.5,,-2,,,,D
144517,Study Drug B,-2,End of cycle 2,NO,2,19.5,NO,SKIPPED,SKIPPED,SKIPPED,SKIPPED,SKIPPED,SKIPPED,NO,,,SKIPPED,SKIPPED,,-2,YES,19.6,104,YES,SKIPPED,Continue uptitration,19.6,1.4,Daily,62.5,,-2,,,,D
144517,Study Drug B,-2,End of cycle 3,NO,4,19.6,NO,SKIPPED,SKIPPED,SKIPPED,SKIPPED,SKIPPED,SKIPPED,NO,,,SKIPPED,SKIPPED,,-2,YES,19.7,78,YES,SKIPPED,End uptitration,,,-2,-2.0,,-2,,,19.6,D
144519,Study Drug B,-2,End of cycle 1,NO,1,23.9,NO,SKIPPED,SKIPPED,SKIPPED,SKIPPED,SKIPPED,SKIPPED,NO,,,SKIPPED,NO,,-2,,23.9,74,YES,SKIPPED,Continue uptitration,23.9,0.8,Daily,100.0,,-2,,,,B
144519,Study Drug B,-2,End of cycle 2,NO,3,24,NO,SKIPPED,SKIPPED,SKIPPED,SKIPPED,SKIPPED,SKIPPED,NO,,,SKIPPED,NO,,-2,,24.1,71,YES,SKIPPED,End uptitration,,,-2,-2.0,,-2,,,23.9,B
144520,Study Drug A,End of cycle 1b,-2,NO,2,5.2,NO,SKIPPED,SKIPPED,SKIPPED,SKIPPED,SKIPPED,SKIPPED,NO,,,SKIPPED,NO,,-2,,5.2,73,YES,NO,Adjust dose,,,-2,-2.0,5.3,Maintained current dose,1.0,20.0,,B
144520,Study Drug A,End of cycle 1b,-2,YES,4,5.3,NO,SKIPPED,SKIPPED,SKIPPED,SKIPPED,SKIPPED,SKIPPED,NO,,,SKIPPED,NO,,-2,,5.3,82,YES,NO,Continue uptitration,5.4,2.0,Daily,40.0,,-2,,,,B
144520,Study Drug A,End of cycle 2,-2,YES,6,5.5,NO,SKIPPED,SKIPPED,SKIPPED,SKIPPED,SKIPPED,SKIPPED,NO,,,SKIPPED,NO,,-2,,5.5,79,YES,NO,End uptitration,,,-2,-2.0,,-2,,,5.4,B
144525,Study Drug A,End of cycle 1b,-2,NO,2,1.6,NO,SKIPPED,SKIPPED,SKIPPED,SKIPPED,SKIPPED,SKIPPED,NO,,,SKIPPED,SKIPPED,,-2,YES,1.6,111,YES,SKIPPED,Continue uptitration,1.6,2.0,Daily,22.0,,-2,,,,D
144525,Study Drug A,End of cycle 2,-2,NO,3,1.7,NO,SKIPPED,SKIPPED,SKIPPED,SKIPPED,SKIPPED,SKIPPED,NO,,,SKIPPED,SKIPPED,,-2,YES,1.7,101,YES,SKIPPED,Continue uptitration,1.7,3.0,Daily,33.0,,-2,,,,D
144525,Study Drug A,End of cycle 3,-2,NO,5,1.8,NO,SKIPPED,SKIPPED,SKIPPED,SKIPPED,SKIPPED,SKIPPED,NO,,,SKIPPED,SKIPPED,,-2,YES,1.8,111,YES,SKIPPED,Continue uptitration,1.8,4.0,Daily,44.0,,-2,,,,D
144525,Study Drug A,End of cycle 4,-2,NO,7,1.8,NO,SKIPPED,SKIPPED,SKIPPED,SKIPPED,SKIPPED,SKIPPED,NO,,,SKIPPED,SKIPPED,,-2,YES,1.8,100,YES,SKIPPED,End uptitration,,,-2,-2.0,,-2,,,1.8,D
144527,Study Drug A,End of cycle 1b,-2,NO,2,11.4,NO,SKIPPED,SKIPPED,SKIPPED,SKIPPED,SKIPPED,SKIPPED,NO,,,SKIPPED,NO,,-2,,11.4,65,YES,NO,Continue uptitration,11.4,1.2,Daily,50.0,,-2,,,,A
144527,Study Drug A,End of cycle 2,-2,NO,3,11.5,NO,SKIPPED,SKIPPED,SKIPPED,SKIPPED,SKIPPED,SKIPPED,NO,,,SKIPPED,NO,,-2,,11.5,61,YES,YES,End uptitration,,,-2,-2.0,,-2,,,11.4,A
144529,Study Drug B,-2,End of cycle 1,NO,1,3.7,NO,SKIPPED,SKIPPED,SKIPPED,SKIPPED,SKIPPED,SKIPPED,NO,,,SKIPPED,SKIPPED,,-2,YES,3.7,94,YES,SKIPPED,Continue uptitration,3.7,0.9,Daily,18.0,,-2,,,,D
144529,Study Drug B,-2,End of cycle 2,NO,2,3.8,NO,SKIPPED,SKIPPED,SKIPPED,SKIPPED,SKIPPED,SKIPPED,NO,,,SKIPPED,SKIPPED,,-2,YES,3.8,94,YES,SKIPPED,Continue uptitration,3.8,1.4,Daily,28.0,,-2,,,,D
144529,Study Drug B,-2,End of cycle 3,NO,3,3.9,NO,SKIPPED,SKIPPED,SKIPPED,SKIPPED,SKIPPED,SKIPPED,NO,,,SKIPPED,SKIPPED,,-2,YES,3.9,103,YES,SKIPPED,End uptitration,,,-2,-2.0,,-2,,,3.8,D
144530,Study Drug B,-2,End of cycle 2,NO,2,6.7,NO,SKIPPED,SKIPPED,SKIPPED,SKIPPED,SKIPPED,SKIPPED,NO,,,SKIPPED,SKIPPED,,-2,YES,6.8,93,YES,SKIPPED,Continue uptitration,6.8,1.0,Daily,25.0,,-2,,,,D
144530,Study Drug B,-2,End of cycle 3,NO,3,6.8,NO,SKIPPED,SKIPPED,SKIPPED,SKIPPED,SKIPPED,SKIPPED,NO,,,SKIPPED,SKIPPED,,-2,YES,6.8,122,YES,SKIPPED,End uptitration,,,-2,-2.0,,-2,,,6.8,D
144530,Study Drug B,-2,End of cycle 1,NO,1,6.7,NO,SKIPPED,SKIPPED,SKIPPED,SKIPPED,SKIPPED,SKIPPED,NO,,,SKIPPED,SKIPPED,,-2,YES,6.7,102,YES,SKIPPED,Continue uptitration,6.7,0.7,Daily,17.5,,-2,,,,D
144531,Study Drug B,-2,End of cycle 1,NO,1,7,NO,SKIPPED,SKIPPED,SKIPPED,SKIPPED,SKIPPED,SKIPPED,NO,,,SKIPPED,SKIPPED,,-2,YES,6.9,90,YES,SKIPPED,Continue uptitration,7,0.9,Daily,25.0,,-2,,,,D
144531,Study Drug B,-2,End of cycle 3,NO,3,7.1,NO,SKIPPED,SKIPPED,SKIPPED,SKIPPED,SKIPPED,SKIPPED,NO,,,SKIPPED,SKIPPED,,-2,YES,7.1,88,YES,SKIPPED,End uptitration,,,-2,-2.0,,-2,,,7,D
144531,Study Drug B,-2,End of cycle 2,NO,2,7,NO,SKIPPED,SKIPPED,SKIPPED,SKIPPED,SKIPPED,SKIPPED,NO,,,SKIPPED,SKIPPED,,-2,YES,7,91,YES,SKIPPED,Continue uptitration,7,1.4,Daily,37.5,,-2,,,,D
144533,Study Drug B,-2,End of cycle 1,NO,1,7.2,NO,SKIPPED,SKIPPED,SKIPPED,SKIPPED,SKIPPED,SKIPPED,NO,,,SKIPPED,NO,,-2,,7.2,102,YES,SKIPPED,Continue uptitration,7.2,0.9,Daily,25.0,,-2,,,,B
144533,Study Drug B,-2,End of cycle 2,NO,3,7.3,NO,SKIPPED,SKIPPED,SKIPPED,SKIPPED,SKIPPED,SKIPPED,NO,,,SKIPPED,NO,,-2,,7.3,96,YES,SKIPPED,Continue uptitration,7.3,1.3,Daily,37.5,,-2,,,,B
144533,Study Drug B,-2,End of cycle 3,NO,4,7.4,NO,SKIPPED,SKIPPED,SKIPPED,SKIPPED,SKIPPED,SKIPPED,NO,,,SKIPPED,NO,,-2,,7.4,96,YES,SKIPPED,End uptitration,,,-2,-2.0,,-2,,,7.3,B
144534,Study Drug B,-2,End of cycle 1,NO,1,12.6,NO,SKIPPED,SKIPPED,SKIPPED,SKIPPED,SKIPPED,SKIPPED,NO,,,SKIPPED,NO,,-2,,12.6,79,YES,SKIPPED,Continue uptitration,12.6,0.9,Daily,50.0,,-2,,,,B
144534,Study Drug B,-2,End of cycle 2,NO,2,12.6,NO,SKIPPED,SKIPPED,SKIPPED,SKIPPED,SKIPPED,SKIPPED,NO,,,SKIPPED,NO,,-2,,12.7,72,YES,SKIPPED,Continue uptitration,12.6,1.4,Daily,75.0,,-2,,,,B
144534,Study Drug B,-2,End of cycle 3,NO,3,12.7,NO,SKIPPED,SKIPPED,SKIPPED,SKIPPED,SKIPPED,SKIPPED,NO,,,SKIPPED,NO,,-2,,12.7,71,YES,SKIPPED,End uptitration,,,-2,-2.0,,-2,,,12.6,B
144535,Study Drug B,-2,End of cycle 1,NO,2,16.8,NO,SKIPPED,SKIPPED,SKIPPED,SKIPPED,SKIPPED,SKIPPED,NO,,,SKIPPED,NO,,-2,,16.9,76,YES,SKIPPED,Continue uptitration,16.9,0.9,Daily,62.5,,-2,,,,B
144535,Study Drug B,-2,End of cycle 2,NO,3,17,NO,SKIPPED,SKIPPED,SKIPPED,SKIPPED,SKIPPED,SKIPPED,NO,,,SKIPPED,NO,,-2,,17,68,YES,SKIPPED,End uptitration,,,-2,-2.0,,-2,,,17,B
144537,Study Drug B,-2,End of cycle 1,NO,1,19.7,NO,SKIPPED,SKIPPED,SKIPPED,SKIPPED,SKIPPED,SKIPPED,NO,,,SKIPPED,SKIPPED,,-2,YES,19.7,60,YES,SKIPPED,Continue uptitration,19.7,0.8,Daily,37.5,,-2,,,,C
144537,Study Drug B,-2,End of cycle 2,NO,2,19.7,NO,SKIPPED,SKIPPED,SKIPPED,SKIPPED,SKIPPED,SKIPPED,NO,,,SKIPPED,SKIPPED,,-2,YES,19.7,71,YES,SKIPPED,Continue uptitration,19.7,1.0,Daily,50.0,,-2,,,,D
144537,Study Drug B,-2,End of cycle 3,NO,3,19.8,NO,SKIPPED,SKIPPED,SKIPPED,SKIPPED,SKIPPED,SKIPPED,NO,,,SKIPPED,SKIPPED,,-2,YES,19.8,64,YES,SKIPPED,End uptitration,,,-2,-2.0,,-2,,,19.7,D
144538,Study Drug B,-2,End of cycle 1,NO,1,14,NO,SKIPPED,SKIPPED,SKIPPED,SKIPPED,SKIPPED,SKIPPED,NO,,,SKIPPED,SKIPPED,,-2,YES,14,61,YES,SKIPPED,Continue uptitration,14,0.8,Daily,62.5,,-2,,,,D
144538,Study Drug B,-2,End of cycle 2,NO,2,14.1,NO,SKIPPED,SKIPPED,SKIPPED,SKIPPED,SKIPPED,SKIPPED,NO,,,SKIPPED,SKIPPED,,-2,YES,14.1,65,YES,SKIPPED,Continue uptitration,14.1,1.3,Daily,100.0,,-2,,,,D
144538,Study Drug B,-2,End of cycle 3,NO,3,14.2,NO,SKIPPED,SKIPPED,SKIPPED,SKIPPED,SKIPPED,SKIPPED,NO,,,SKIPPED,SKIPPED,,-2,YES,14.2,80,YES,SKIPPED,End uptitration,,,-2,-2.0,,-2,,,14.1,D
144544,Study Drug B,-2,End of cycle 1,NO,1,18,NO,SKIPPED,SKIPPED,SKIPPED,SKIPPED,SKIPPED,SKIPPED,NO,,,SKIPPED,SKIPPED,,-2,YES,18,74,YES,SKIPPED,Continue uptitration,18,0.8,Daily,50.0,,-2,,,,D
144544,Study Drug B,-2,End of cycle 2,NO,2,18.1,NO,SKIPPED,SKIPPED,SKIPPED,SKIPPED,SKIPPED,SKIPPED,NO,,,SKIPPED,SKIPPED,,-2,YES,18.1,74,YES,SKIPPED,Continue uptitration,18.1,1.4,Daily,87.5,,-2,,,,D
144544,Study Drug B,-2,End of cycle 3,NO,3,18.2,NO,SKIPPED,SKIPPED,SKIPPED,SKIPPED,SKIPPED,SKIPPED,NO,,,SKIPPED,SKIPPED,,-2,YES,18.2,65,YES,SKIPPED,End uptitration,,,-2,-2.0,,-2,,,18.1,D
144549,Study Drug B,-2,End of cycle 2,NO,2,5.4,NO,SKIPPED,SKIPPED,SKIPPED,SKIPPED,SKIPPED,SKIPPED,NO,,,SKIPPED,SKIPPED,,-2,YES,5.5,101,YES,SKIPPED,Continue uptitration,5.5,1.1,Daily,24.0,,-2,,,,D
144549,Study Drug B,-2,End of cycle 1,NO,1,5.3,NO,SKIPPED,SKIPPED,SKIPPED,SKIPPED,SKIPPED,SKIPPED,NO,,,SKIPPED,SKIPPED,,-2,YES,5.4,98,YES,SKIPPED,Continue uptitration,5.4,0.9,Daily,18.0,,-2,,,,D
144549,Study Drug B,-2,End of cycle 3,NO,3,5.5,NO,SKIPPED,SKIPPED,SKIPPED,SKIPPED,SKIPPED,SKIPPED,NO,,,SKIPPED,SKIPPED,,-2,YES,5.5,97,YES,SKIPPED,End uptitration,,,-2,-2.0,,-2,,,5.5,D
144552,Study Drug A,End of cycle 3,-2,NO,4,20.6,NO,SKIPPED,SKIPPED,SKIPPED,SKIPPED,SKIPPED,SKIPPED,NO,,,SKIPPED,SKIPPED,,-2,NO,,,SKIPPED,SKIPPED,End uptitration,,,-2,-2.0,,-2,,,20.4,D
144552,Study Drug A,End of cycle 2,-2,NO,3,19.3,NO,SKIPPED,SKIPPED,SKIPPED,SKIPPED,SKIPPED,SKIPPED,NO,,,SKIPPED,SKIPPED,,-2,NO,,,SKIPPED,SKIPPED,Continue uptitration,19.4,3.0,Daily,200.0,,-2,,,,C
144552,Study Drug A,End of cycle 1b,-2,NO,2,19.2,NO,SKIPPED,SKIPPED,SKIPPED,SKIPPED,SKIPPED,SKIPPED,NO,,,SKIPPED,SKIPPED,,-2,NO,,,SKIPPED,SKIPPED,Continue uptitration,19.3,1.6,Daily,100.0,,-2,,,,C
144553,Study Drug B,-2,End of cycle 1,NO,1,4.6,NO,SKIPPED,SKIPPED,SKIPPED,SKIPPED,SKIPPED,SKIPPED,NO,,,SKIPPED,NO,,-2,,4.6,107,YES,SKIPPED,Continue uptitration,4.6,0.7,Daily,13.0,,-2,,,,B
144553,Study Drug B,-2,End of cycle 2,NO,3,4.7,NO,SKIPPED,SKIPPED,SKIPPED,SKIPPED,SKIPPED,SKIPPED,NO,,,SKIPPED,NO,,-2,,4.7,102,YES,SKIPPED,Continue uptitration,4.7,1.3,Daily,25.0,,-2,,,,B
144553,Study Drug B,-2,End of cycle 3,NO,5,4.7,NO,SKIPPED,SKIPPED,SKIPPED,SKIPPED,SKIPPED,SKIPPED,NO,,,SKIPPED,NO,,-2,,4.7,101,YES,SKIPPED,End uptitration,,,-2,-2.0,,-2,,,4.7,B
144554,Study Drug A,End of cycle 1b,-2,NO,3,15,NO,SKIPPED,SKIPPED,SKIPPED,SKIPPED,SKIPPED,SKIPPED,NO,,,SKIPPED,SKIPPED,,-2,YES,15,82,YES,SKIPPED,Continue uptitration,15.1,1.0,Daily,75.0,,-2,,,,D
144554,Study Drug A,End of cycle 2,-2,YES,2,15,NO,SKIPPED,SKIPPED,SKIPPED,SKIPPED,SKIPPED,SKIPPED,NO,,,SKIPPED,SKIPPED,,-2,YES,15,82,YES,SKIPPED,Adjust dose,,,-2,-2.0,15.1,Maintained current dose,1.0,75.0,,D
144554,Study Drug A,End of cycle 2,-2,YES,4,15.2,NO,SKIPPED,SKIPPED,SKIPPED,SKIPPED,SKIPPED,SKIPPED,NO,,,SKIPPED,SKIPPED,,-2,YES,15.2,60,YES,SKIPPED,End uptitration,,,-2,-2.0,,-2,,,15,D
144555,Study Drug A,End of cycle 1b,-2,YES,2,4.1,NO,SKIPPED,SKIPPED,SKIPPED,SKIPPED,SKIPPED,SKIPPED,NO,,,SKIPPED,SKIPPED,,-2,YES,4,83,YES,SKIPPED,Continue uptitration,4.1,2.0,Daily,37.5,,-2,,,,D
144555,Study Drug A,End of cycle 2,-2,NO,4,4.1,NO,SKIPPED,SKIPPED,SKIPPED,SKIPPED,SKIPPED,SKIPPED,NO,,,SKIPPED,SKIPPED,,-2,NO,,,SKIPPED,SKIPPED,Adjust dose,,,-2,-2.0,4.2,Maintained current dose,2.0,37.5,,D
144556,Study Drug B,-2,End of cycle 1,NO,1,9.4,NO,SKIPPED,SKIPPED,SKIPPED,SKIPPED,SKIPPED,SKIPPED,NO,,,SKIPPED,NO,,-2,,9.4,92,YES,SKIPPED,Continue uptitration,9.4,0.9,Daily,37.5,,-2,,,,A
144556,Study Drug B,-2,End of cycle 2,NO,2,9.5,NO,SKIPPED,SKIPPED,SKIPPED,SKIPPED,SKIPPED,SKIPPED,NO,,,SKIPPED,NO,,-2,,9.5,90,YES,SKIPPED,Continue uptitration,9.5,1.2,Daily,50.0,,-2,,,,A
144556,Study Drug B,-2,End of cycle 3,NO,3,9.6,NO,SKIPPED,SKIPPED,SKIPPED,SKIPPED,SKIPPED,SKIPPED,NO,,,SKIPPED,NO,,-2,,9.6,90,YES,SKIPPED,End uptitration,,,-2,-2.0,,-2,,,9.5,A
144558,Study Drug B,-2,End of cycle 1,NO,1,2.4,NO,SKIPPED,SKIPPED,SKIPPED,SKIPPED,SKIPPED,SKIPPED,NO,,,SKIPPED,SKIPPED,,-2,YES,2.4,112,YES,SKIPPED,Continue uptitration,2.4,0.9,Daily,13.0,,-2,,,,C
144558,Study Drug B,-2,End of cycle 2,NO,3,2.5,NO,SKIPPED,SKIPPED,SKIPPED,SKIPPED,SKIPPED,SKIPPED,NO,,,SKIPPED,SKIPPED,,-2,YES,2.5,109,YES,SKIPPED,Continue uptitration,2.5,1.4,Daily,19.4,,-2,,,,C
144558,Study Drug B,-2,End of cycle 3,NO,4,2.5,NO,SKIPPED,SKIPPED,SKIPPED,SKIPPED,SKIPPED,SKIPPED,NO,,,SKIPPED,SKIPPED,,-2,YES,2.5,110,YES,SKIPPED,End uptitration,,,-2,-2.0,,-2,,,2.5,C
144568,Study Drug B,-2,End of cycle 1,NO,1,13.8,NO,SKIPPED,SKIPPED,SKIPPED,SKIPPED,SKIPPED,SKIPPED,NO,,,SKIPPED,SKIPPED,,-2,YES,13.8,75,YES,SKIPPED,Continue uptitration,13.8,0.8,Daily,37.5,,-2,,,,D
144568,Study Drug B,-2,End of cycle 2,NO,2,13.8,NO,SKIPPED,SKIPPED,SKIPPED,SKIPPED,SKIPPED,SKIPPED,NO,,,SKIPPED,SKIPPED,,-2,YES,13.8,81,YES,SKIPPED,Continue uptitration,13.9,1.4,Daily,62.5,,-2,,,,D
144568,Study Drug B,-2,End of cycle 3,NO,3,13.9,NO,SKIPPED,SKIPPED,SKIPPED,SKIPPED,SKIPPED,SKIPPED,NO,,,SKIPPED,SKIPPED,,-2,YES,13.9,83,YES,SKIPPED,End uptitration,,,-2,-2.0,,-2,,,13.9,D
144572,Study Drug A,End of cycle 1b,-2,NO,2,11.5,NO,SKIPPED,SKIPPED,SKIPPED,SKIPPED,SKIPPED,SKIPPED,NO,,,SKIPPED,NO,,-2,,11.5,69,YES,NO,Continue uptitration,11.5,2.0,Daily,75.0,,-2,,,,A
144572,Study Drug A,End of cycle 2,-2,NO,3,11.6,NO,SKIPPED,SKIPPED,SKIPPED,SKIPPED,SKIPPED,SKIPPED,NO,,,SKIPPED,NO,,-2,,11.6,70,YES,NO,Continue uptitration,11.6,3.0,Daily,112.5,,-2,,,,A
144572,Study Drug A,End of cycle 3,-2,NO,4,11.7,NO,SKIPPED,SKIPPED,SKIPPED,SKIPPED,SKIPPED,SKIPPED,NO,,,SKIPPED,NO,,-2,,11.6,71,YES,NO,Continue uptitration,11.7,4.0,Daily,150.0,,-2,,,,B
144572,Study Drug A,End of cycle 4,-2,NO,5,11.7,NO,SKIPPED,SKIPPED,SKIPPED,SKIPPED,SKIPPED,SKIPPED,NO,,,SKIPPED,NO,,-2,,11.7,65,YES,YES,End uptitration,,,-2,-2.0,,-2,,,11.7,B
144573,Study Drug A,End of cycle 1b,-2,NO,2,7,NO,SKIPPED,SKIPPED,SKIPPED,SKIPPED,SKIPPED,SKIPPED,NO,,,SKIPPED,SKIPPED,,-2,YES,7,83,YES,SKIPPED,Continue uptitration,7,1.9,Daily,50.0,,-2,,,,D
144573,Study Drug A,End of cycle 2,-2,NO,3,7.1,NO,SKIPPED,SKIPPED,SKIPPED,SKIPPED,SKIPPED,SKIPPED,NO,,,SKIPPED,SKIPPED,,-2,YES,7.1,84,YES,SKIPPED,Continue uptitration,7.1,2.8,Daily,75.0,,-2,,,,D
144573,Study Drug A,End of cycle 3,-2,NO,4,7.2,NO,SKIPPED,SKIPPED,SKIPPED,SKIPPED,SKIPPED,SKIPPED,NO,,,SKIPPED,SKIPPED,,-2,YES,7.2,86,YES,SKIPPED,Continue uptitration,7.2,3.8,Daily,100.0,,-2,,,,D
144573,Study Drug A,End of cycle 4,-2,NO,5,7.2,NO,SKIPPED,SKIPPED,SKIPPED,SKIPPED,SKIPPED,SKIPPED,NO,,,SKIPPED,SKIPPED,,-2,YES,7.2,77,YES,SKIPPED,End uptitration,,,-2,-2.0,,-2,,,7.2,D
144574,Study Drug B,-2,End of cycle 1,NO,1,17.8,NO,SKIPPED,SKIPPED,SKIPPED,SKIPPED,SKIPPED,SKIPPED,NO,,,SKIPPED,SKIPPED,,-2,YES,17.9,70,YES,SKIPPED,Continue uptitration,17.9,0.8,Daily,50.0,,-2,,,,D
144574,Study Drug B,-2,End of cycle 2,NO,2,17.9,NO,SKIPPED,SKIPPED,SKIPPED,SKIPPED,SKIPPED,SKIPPED,NO,,,SKIPPED,SKIPPED,,-2,YES,17.9,66,YES,SKIPPED,Continue uptitration,17.9,1.2,Daily,75.0,,-2,,,,D
144574,Study Drug B,-2,End of cycle 3,NO,3,18,NO,SKIPPED,SKIPPED,SKIPPED,SKIPPED,SKIPPED,SKIPPED,NO,,,SKIPPED,SKIPPED,,-2,YES,18,73,YES,SKIPPED,End uptitration,,,-2,-2.0,,-2,,,17.9,D
144576,Study Drug A,End of cycle 1b,-2,NO,2,4.2,NO,SKIPPED,SKIPPED,SKIPPED,SKIPPED,SKIPPED,SKIPPED,NO,,,SKIPPED,SKIPPED,,-2,NO,,,SKIPPED,SKIPPED,Continue uptitration,4.2,1.9,Daily,37.5,,-2,,,,D
144576,Study Drug A,End of cycle 2,-2,NO,3,4.2,NO,SKIPPED,SKIPPED,SKIPPED,SKIPPED,SKIPPED,SKIPPED,NO,,,SKIPPED,SKIPPED,,-2,YES,4.3,87,YES,SKIPPED,Continue uptitration,4.3,2.6,Daily,50.0,,-2,,,,D
144576,Study Drug A,End of cycle 3,-2,NO,4,4.3,NO,SKIPPED,SKIPPED,SKIPPED,SKIPPED,SKIPPED,SKIPPED,NO,,,SKIPPED,SKIPPED,,-2,YES,4.3,90,YES,SKIPPED,End uptitration,,,-2,-2.0,,-2,,,4.3,D
144579,Study Drug A,End of cycle 1b,-2,NO,1,11.9,NO,SKIPPED,SKIPPED,SKIPPED,SKIPPED,SKIPPED,SKIPPED,NO,,,SKIPPED,NO,,-2,,11.9,71,YES,NO,Continue uptitration,11.9,2.0,Daily,87.5,,-2,,,,B
144579,Study Drug A,End of cycle 2,-2,NO,2,12,NO,SKIPPED,SKIPPED,SKIPPED,SKIPPED,SKIPPED,SKIPPED,NO,,,SKIPPED,NO,,-2,,12,67,YES,NO,Continue uptitration,12,2.9,Daily,125.0,,-2,,,,B
144579,Study Drug A,End of cycle 3,-2,NO,3,12.1,NO,SKIPPED,SKIPPED,SKIPPED,SKIPPED,SKIPPED,SKIPPED,NO,,,SKIPPED,NO,,-2,,12.1,69,YES,NO,Continue uptitration,12.1,3.8,Daily,162.5,,-2,,,,B
144579,Study Drug A,End of cycle 4,-2,NO,4,12.2,NO,SKIPPED,SKIPPED,SKIPPED,SKIPPED,SKIPPED,SKIPPED,NO,,,SKIPPED,NO,,-2,,12.1,69,YES,NO,End uptitration,,,-2,-2.0,,-2,,,12.1,B
144581,Study Drug B,-2,End of cycle 1,NO,1,13.4,NO,SKIPPED,SKIPPED,SKIPPED,SKIPPED,SKIPPED,SKIPPED,NO,,,SKIPPED,NO,,-2,,13.4,72,YES,SKIPPED,Continue uptitration,13.4,0.8,Daily,37.5,,-2,,,,B
144581,Study Drug B,-2,End of cycle 2,NO,2,13.5,NO,SKIPPED,SKIPPED,SKIPPED,SKIPPED,SKIPPED,SKIPPED,NO,,,SKIPPED,NO,,-2,,13.5,72,YES,SKIPPED,Continue uptitration,13.5,1.4,Daily,62.5,,-2,,,,B
144581,Study Drug B,-2,End of cycle 3,NO,3,13.5,NO,SKIPPED,SKIPPED,SKIPPED,SKIPPED,SKIPPED,SKIPPED,NO,,,SKIPPED,NO,,-2,,13.5,76,YES,SKIPPED,End uptitration,,,-2,-2.0,,-2,,,13.5,B
144582,Study Drug A,End of cycle 1b,-2,NO,2,10.9,NO,SKIPPED,SKIPPED,SKIPPED,SKIPPED,SKIPPED,SKIPPED,NO,,,SKIPPED,NO,,-2,,10.9,70,YES,YES,End uptitration,,,-2,-2.0,,-2,,,10.8,A
144584,Study Drug A,End of cycle 1b,-2,NO,2,15.4,YES,YES,NO,NO,NO,YES,YES,NO,,,SKIPPED,NO,,-2,,15.4,73,YES,NO,End uptitration,,,-2,-2.0,,-2,,,15.3,A
144587,Study Drug B,-2,End of cycle 1,NO,2,22.4,NO,SKIPPED,SKIPPED,SKIPPED,SKIPPED,SKIPPED,SKIPPED,NO,,,SKIPPED,NO,,-2,,22.4,68,YES,SKIPPED,Continue uptitration,22.4,0.8,Twice a day,62.5,,-2,,,,B
144587,Study Drug B,-2,End of cycle 2,NO,3,22.5,NO,SKIPPED,SKIPPED,SKIPPED,SKIPPED,SKIPPED,SKIPPED,NO,,,SKIPPED,NO,,-2,,22.5,82,YES,SKIPPED,Continue uptitration,22.5,1.3,Twice a day,100.0,,-2,,,,B
144587,Study Drug B,-2,End of cycle 3,NO,4,22.6,NO,SKIPPED,SKIPPED,SKIPPED,SKIPPED,SKIPPED,SKIPPED,NO,,,SKIPPED,NO,,-2,,22.5,68,YES,SKIPPED,End uptitration,,,-2,-2.0,,-2,,,22.5,B
144588,Study Drug A,End of cycle 1b,-2,NO,1,12.3,NO,SKIPPED,SKIPPED,SKIPPED,SKIPPED,SKIPPED,SKIPPED,NO,,,SKIPPED,SKIPPED,,-2,YES,12.3,76,YES,SKIPPED,Continue uptitration,12.3,1.9,Daily,62.5,,-2,,,,D
144588,Study Drug A,End of cycle 2,-2,NO,2,12.4,NO,SKIPPED,SKIPPED,SKIPPED,SKIPPED,SKIPPED,SKIPPED,NO,,,SKIPPED,SKIPPED,,-2,YES,12.4,80,YES,SKIPPED,Continue uptitration,12.4,3.0,Daily,100.0,,-2,,,,D
144588,Study Drug A,End of cycle 3,-2,NO,3,12.5,NO,SKIPPED,SKIPPED,SKIPPED,SKIPPED,SKIPPED,SKIPPED,NO,,,SKIPPED,SKIPPED,,-2,YES,12.5,75,YES,SKIPPED,Continue uptitration,12.5,3.7,Daily,125.0,,-2,,,,D
144588,Study Drug A,End of cycle 4,-2,NO,4,12.5,NO,SKIPPED,SKIPPED,SKIPPED,SKIPPED,SKIPPED,SKIPPED,NO,,,SKIPPED,SKIPPED,,-2,YES,12.5,79,YES,SKIPPED,End uptitration,,,-2,-2.0,,-2,,,12.5,D
144589,Study Drug A,End of cycle 1b,-2,NO,2,5.8,YES,NO,YES,NO,NO,YES,NO,NO,,,SKIPPED,NO,,-2,,5.8,88,YES,NO,End uptitration,,,-2,-2.0,,-2,,,5.8,A
144591,Study Drug B,-2,End of cycle 1,NO,1,15.6,NO,SKIPPED,SKIPPED,SKIPPED,SKIPPED,SKIPPED,SKIPPED,NO,,,SKIPPED,NO,,-2,,15.6,67,YES,SKIPPED,Continue uptitration,15.6,0.9,Daily,75.0,,-2,,,,A
144591,Study Drug B,-2,End of cycle 2,NO,2,15.7,NO,SKIPPED,SKIPPED,SKIPPED,SKIPPED,SKIPPED,SKIPPED,NO,,,SKIPPED,NO,,-2,,15.7,64,YES,SKIPPED,Continue uptitration,15.7,1.1,Daily,100.0,,-2,,,,A
144591,Study Drug B,-2,End of cycle 3,NO,3,15.8,NO,SKIPPED,SKIPPED,SKIPPED,SKIPPED,SKIPPED,SKIPPED,NO,,,SKIPPED,NO,,-2,,15.8,64,YES,SKIPPED,End uptitration,,,-2,-2.0,,-2,,,15.7,A
144593,Study Drug A,End of cycle 1b,-2,NO,2,14.5,NO,SKIPPED,SKIPPED,SKIPPED,SKIPPED,SKIPPED,SKIPPED,NO,,,SKIPPED,NO,,-2,,14.5,71,YES,YES,End uptitration,,,-2,-2.0,,-2,,,14.4,A
144594,Study Drug A,End of cycle 1b,-2,NO,1,11.6,NO,SKIPPED,SKIPPED,SKIPPED,SKIPPED,SKIPPED,SKIPPED,NO,,,SKIPPED,NO,,-2,,11.6,77,YES,NO,Continue uptitration,11.6,1.9,Daily,62.5,,-2,,,,B
144594,Study Drug A,End of cycle 2,-2,NO,2,11.7,NO,SKIPPED,SKIPPED,SKIPPED,SKIPPED,SKIPPED,SKIPPED,NO,,,SKIPPED,NO,,-2,,11.7,73,YES,NO,Continue uptitration,11.7,2.9,Daily,100.0,,-2,,,,B
144594,Study Drug A,End of cycle 3,-2,NO,3,11.9,NO,SKIPPED,SKIPPED,SKIPPED,SKIPPED,SKIPPED,SKIPPED,NO,,,SKIPPED,NO,,-2,,11.8,71,YES,YES,End uptitration,,,-2,-2.0,,-2,,,11.7,B
144595,Study Drug B,-2,End of cycle 1,NO,1,18.2,NO,SKIPPED,SKIPPED,SKIPPED,SKIPPED,SKIPPED,SKIPPED,NO,,,SKIPPED,SKIPPED,,-2,NO,,,SKIPPED,SKIPPED,Adjust dose,,,-2,-2.0,18.3,Maintained current dose,0.5,37.5,,D
144595,Study Drug B,-2,End of cycle 2,NO,3,18.4,NO,SKIPPED,SKIPPED,SKIPPED,SKIPPED,SKIPPED,SKIPPED,NO,,,SKIPPED,SKIPPED,,-2,YES,18.4,92,YES,SKIPPED,Continue uptitration,18.4,1.4,Daily,100.0,,-2,,,,D
144595,Study Drug B,-2,End of cycle 3,NO,4,18.5,NO,SKIPPED,SKIPPED,SKIPPED,SKIPPED,SKIPPED,SKIPPED,NO,,,SKIPPED,SKIPPED,,-2,YES,18.5,78,YES,SKIPPED,End uptitration,,,-2,-2.0,,-2,,,18.4,D
144595,Study Drug B,-2,End of cycle 1,NO,2,18.3,NO,SKIPPED,SKIPPED,SKIPPED,SKIPPED,SKIPPED,SKIPPED,NO,,,SKIPPED,SKIPPED,,-2,YES,18.3,89,YES,SKIPPED,Continue uptitration,18.3,0.9,Daily,62.5,,-2,,,,D
144597,Study Drug B,-2,End of cycle 1,NO,1,1.5,NO,SKIPPED,SKIPPED,SKIPPED,SKIPPED,SKIPPED,SKIPPED,YES,83,55,NO,YES,1.5,All values normal,YES,1.5,128,YES,SKIPPED,Continue uptitration,1.5,0.9,Daily,9.0,,-2,,,,D
144597,Study Drug B,-2,End of cycle 2,NO,2,1.6,NO,SKIPPED,SKIPPED,SKIPPED,SKIPPED,SKIPPED,SKIPPED,NO,,,SKIPPED,SKIPPED,,-2,YES,1.6,118,YES,SKIPPED,Continue uptitration,1.6,1.2,Daily,12.5,,-2,,,,D
144597,Study Drug B,-2,End of cycle 3,NO,3,1.7,NO,SKIPPED,SKIPPED,SKIPPED,SKIPPED,SKIPPED,SKIPPED,NO,,,SKIPPED,SKIPPED,,-2,YES,1.7,120,YES,SKIPPED,End uptitration,,,-2,-2.0,,-2,,,1.6,D
144600,Study Drug A,End of cycle 1b,-2,NO,1,6.4,NO,SKIPPED,SKIPPED,SKIPPED,SKIPPED,SKIPPED,SKIPPED,NO,,,SKIPPED,SKIPPED,,-2,YES,6.4,80,YES,SKIPPED,Continue uptitration,6.5,1.8,Daily,62.5,,-2,,,,D
144600,Study Drug A,End of cycle 2,-2,NO,2,6.5,NO,SKIPPED,SKIPPED,SKIPPED,SKIPPED,SKIPPED,SKIPPED,NO,,,SKIPPED,SKIPPED,,-2,YES,6.5,72,YES,SKIPPED,Adjust dose,,,-2,-2.0,6.5,Maintained current dose,1.8,62.5,,D
144600,Study Drug A,End of cycle 3,-2,NO,4,6.7,NO,SKIPPED,SKIPPED,SKIPPED,SKIPPED,SKIPPED,SKIPPED,NO,,,SKIPPED,SKIPPED,,-2,YES,6.7,75,YES,SKIPPED,Continue uptitration,6.7,3.7,Daily,125.0,,-2,,,,D