random_ID,STUDYDRUG123,RX_NUM123,CALL123_AGE,INTOL123,DIZZ123,FATIGUE123,SYNCOPE123,SOB123,OTHSX123,AGE18MO,SBP_123,DBP_123,SBP_PCT123,ECG_DONE,ECG_AGE123,AVG_HR123,THRESHOLD123,CUR_HR123,OUTCOME123,UPDOSE123_AGE,UP_RX123,UP_FREQ123,UP_DAY123,MAINT_AGE,VER_ID
144515,Study Drug A,8,12.2,2:No,-2,-2,-2,-2,-2,2:No,,,-2,1:Yes,12.2,77,1:Yes,2:No,Adjust dose,,,-2,,12.2,A
144515,Study Drug A,11,12.6,2:No,-2,-2,-2,-2,-2,2:No,,,-2,1:Yes,12.7,78,1:Yes,2:No,Adjust dose,,,-2,,12.6,A
144515,Study Drug A,16,13.7,2:No,-2,-2,-2,-2,-2,2:No,,,-2,1:Yes,13.7,70,1:Yes,2:No,Adjust dose,,,-2,,13.6,A
144527,Study Drug A,10,12.2,2:No,-2,-2,-2,-2,-2,2:No,,,-2,2:No,,,-2,-2,Adjust dose,,,-2,,12.1,A
144527,Study Drug A,7,12,2:No,-2,-2,-2,-2,-2,2:No,,,-2,1:Yes,11.9,75,1:Yes,2:No,Continue reuptitration,12,2.6,Daily,125.0,,A
144527,Study Drug A,8,12,2:No,-2,-2,-2,-2,-2,2:No,,,-2,1:Yes,12.1,75,1:Yes,2:No,Continue reuptitration,12.1,3.6,Daily,175.0,,A
144579,Study Drug A,6,12.3,2:No,-2,-2,-2,-2,-2,2:No,,,-2,1:Yes,12.3,77,1:Yes,2:No,Adjust dose,,,-2,,12.3,A
144579,Study Drug A,9,12.9,2:No,-2,-2,-2,-2,-2,2:No,,,-2,1:Yes,12.9,79,1:Yes,2:No,Adjust dose,,,-2,,12.9,A
144579,Study Drug A,14,13.9,2:No,-2,-2,-2,-2,-2,2:No,,,-2,1:Yes,13.9,65,1:Yes,2:No,Adjust dose,,,-2,,13.9,A
144588,Study Drug A,6,12.8,2:No,-2,-2,-2,-2,-2,2:No,,,-2,1:Yes,12.8,76,1:Yes,2:No,Adjust dose,,,-2,,12.8,A
144588,Study Drug A,13,14.3,2:No,-2,-2,-2,-2,-2,2:No,,,-2,1:Yes,14.3,77,1:Yes,2:No,Adjust dose,,,-2,,14.2,A
144600,Study Drug A,7,6.9,2:No,-2,-2,-2,-2,-2,2:No,,,-2,1:Yes,6.9,91,1:Yes,2:No,Adjust dose,,,-2,,6.8,A
144600,Study Drug A,11,7.5,2:No,-2,-2,-2,-2,-2,2:No,,,-2,1:Yes,7.6,74,1:Yes,2:No,Adjust dose,,,-2,,7.5,A
144600,Study Drug A,16,8.5,2:No,-2,-2,-2,-2,-2,2:No,,,-2,1:Yes,8.5,66,1:Yes,1:Yes,Adjust dose,,,-2,,8.5,A
144605,Study Drug B,31,2.8,2:No,-2,-2,-2,-2,-2,2:No,,,-2,1:Yes,2.8,94,1:Yes,-2,Adjust dose,,,-2,,2.7,A
144622,Study Drug A,19,2.6,2:No,-2,-2,-2,-2,-2,2:No,,,-2,1:Yes,2.6,92,1:Yes,2:No,Adjust dose,,,-2,,2.6,A
144622,Study Drug A,30,3.4,2:No,-2,-2,-2,-2,-2,2:No,,,-2,1:Yes,3.4,87,1:Yes,2:No,Adjust dose,,,-2,,3.4,A
144622,Study Drug A,36,3.8,2:No,-2,-2,-2,-2,-2,2:No,,,-2,1:Yes,3.8,88,1:Yes,2:No,Adjust dose,,,-2,,3.8,A
144627,Study Drug A,13,23.2,2:No,-2,-2,-2,-2,-2,2:No,,,-2,1:Yes,23.2,74,1:Yes,2:No,Continue reuptitration,23.2,1.6,Daily,100.0,,A
144663,Study Drug B,13,12.2,2:No,-2,-2,-2,-2,-2,2:No,,,-2,2:No,,,-2,-2,Adjust dose,,,-2,,12.1,A
144678,Study Drug A,4,23.1,2:No,-2,-2,-2,-2,-2,2:No,,,-2,1:Yes,23.1,65,1:Yes,1:Yes,Adjust dose,,,-2,,23,A
144678,Study Drug A,7,23.7,2:No,-2,-2,-2,-2,-2,2:No,,,-2,1:Yes,23.7,59,1:Yes,1:Yes,Adjust dose,,,-2,,23.6,A
144678,Study Drug A,13,24.6,2:No,-2,-2,-2,-2,-2,2:No,,,-2,1:Yes,24.7,67,1:Yes,2:No,Adjust dose,,,-2,,24.6,A
144699,Study Drug B,12,15,2:No,-2,-2,-2,-2,-2,2:No,,,-2,2:No,,,-2,-2,Adjust dose,,,-2,,14.9,A
144711,Study Drug A,10,13.9,2:No,-2,-2,-2,-2,-2,2:No,,,-2,1:Yes,13.9,69,1:Yes,1:Yes,Adjust dose,,,-2,,13.9,A
144736,Study Drug A,9,15.2,2:No,-2,-2,-2,-2,-2,2:No,,,-2,1:Yes,15.2,74,1:Yes,2:No,Continue reuptitration,15.2,3.9,Daily,250.0,,A
144736,Study Drug A,10,15.2,2:No,-2,-2,-2,-2,-2,2:No,,,-2,1:Yes,15.3,74,1:Yes,2:No,Adjust dose,,,-2,,15.2,A
144766,Study Drug A,6,12.9,2:No,-2,-2,-2,-2,-2,2:No,,,-2,1:Yes,12.9,75,1:Yes,2:No,Continue reuptitration,12.9,2.8,Twice a day,100.0,,A
144766,Study Drug A,5,12.8,1:Yes,2:No,1:Yes,2:No,2:No,2:No,2:No,,,-2,1:Yes,12.8,81,1:Yes,2:No,Continue reuptitration,12.8,2.5,Twice a day,87.5,,A
144766,Study Drug A,8,13.1,1:Yes,2:No,2:No,2:No,2:No,1:Yes,2:No,,,-2,1:Yes,13.1,72,1:Yes,1:Yes,Adjust dose,,,-2,,12.9,A
144766,Study Drug A,10,13.5,2:No,-2,-2,-2,-2,-2,2:No,,,-2,1:Yes,13.4,78,1:Yes,2:No,Continue reuptitration,13.5,3.1,Twice a day,125.0,,A
144766,Study Drug A,11,13.6,2:No,-2,-2,-2,-2,-2,2:No,,,-2,1:Yes,13.5,72,1:Yes,1:Yes,Adjust dose,,,-2,,13.4,A
144771,Study Drug A,14,7,2:No,-2,-2,-2,-2,-2,2:No,,,-2,1:Yes,7,77,1:Yes,1:Yes,Adjust dose,,,-2,,6.9,A
144772,Study Drug A,13,17.1,2:No,-2,-2,-2,-2,-2,2:No,,,-2,1:Yes,17.1,70,1:Yes,2:No,Continue reuptitration,17.2,2.9,Daily,175.0,,A
144772,Study Drug A,14,17.2,2:No,-2,-2,-2,-2,-2,2:No,,,-2,1:Yes,17.3,62,1:Yes,1:Yes,Adjust dose,,,-2,,17.2,A
144794,Study Drug A,15,10.7,1:Yes,2:No,2:No,2:No,2:No,1:Yes,2:No,,,-2,1:Yes,10.6,69,1:Yes,2:No,Adjust dose,,,-2,,10.7,A
144829,Study Drug A,6,10,2:No,-2,-2,-2,-2,-2,2:No,,,-2,1:Yes,10,79,1:Yes,2:No,Continue reuptitration,10,2.5,Twice a day,100.0,,A
144829,Study Drug A,7,10.1,2:No,-2,-2,-2,-2,-2,2:No,,,-2,1:Yes,10.1,79,1:Yes,2:No,Adjust dose,,,-2,,10,A
144831,Study Drug A,9,1.5,2:No,-2,-2,-2,-2,-2,2:No,,,-2,1:Yes,1.6,105,1:Yes,2:No,Adjust dose,,,-2,,1.5,A
144831,Study Drug A,16,2,2:No,-2,-2,-2,-2,-2,2:No,,,-2,1:Yes,2.1,102,1:Yes,2:No,Adjust dose,,,-2,,2,A
144831,Study Drug A,31,3,2:No,-2,-2,-2,-2,-2,2:No,,,-2,1:Yes,3,94,1:Yes,2:No,Adjust dose,,,-2,,3,A
144838,Study Drug A,18,15.5,2:No,-2,-2,-2,-2,-2,2:No,,,-2,1:Yes,15.4,58,1:Yes,2:No,Adjust dose,,,-2,,15.4,A
144879,Study Drug A,4,12.9,2:No,-2,-2,-2,-2,-2,2:No,,,-2,1:Yes,13,68,1:Yes,1:Yes,Adjust dose,,,-2,,13,A
144879,Study Drug A,10,14.7,2:No,-2,-2,-2,-2,-2,2:No,,,-2,1:Yes,14.8,67,1:Yes,1:Yes,Adjust dose,,,-2,,14.8,A
144882,Study Drug A,7,5.3,2:No,-2,-2,-2,-2,-2,2:No,,,-2,1:Yes,5.3,82,1:Yes,2:No,Adjust dose,,,-2,,5.3,A
144882,Study Drug A,10,5.8,2:No,-2,-2,-2,-2,-2,2:No,,,-2,1:Yes,5.8,81,1:Yes,2:No,Adjust dose,,,-2,,5.7,A
144882,Study Drug A,15,7,2:No,-2,-2,-2,-2,-2,2:No,,,-2,1:Yes,7,80,1:Yes,2:No,Adjust dose,,,-2,,7,A
144887,Study Drug B,8,9.6,2:No,-2,-2,-2,-2,-2,2:No,,,-2,1:Yes,9.6,90,1:Yes,-2,Adjust dose,,,-2,,9.5,A
144927,Study Drug A,8,12.5,2:No,-2,-2,-2,-2,-2,2:No,,,-2,1:Yes,12.5,87,1:Yes,1:Yes,Adjust dose,,,-2,,12.4,A
144927,Study Drug A,14,13.6,2:No,-2,-2,-2,-2,-2,2:No,,,-2,1:Yes,13.6,88,1:Yes,1:Yes,Adjust dose,,,-2,,13.5,A
144972,Study Drug B,11,8.2,2:No,-2,-2,-2,-2,-2,2:No,,,-2,2:No,,,-2,-2,Adjust dose,,,-2,,8.2,A
144996,Study Drug A,7,8.9,2:No,-2,-2,-2,-2,-2,2:No,,,-2,1:Yes,8.9,64,1:Yes,2:No,Adjust dose,,,-2,,9,A
144996,Study Drug A,14,10.4,2:No,-2,-2,-2,-2,-2,2:No,,,-2,1:Yes,10.5,65,1:Yes,2:No,Adjust dose,,,-2,,10.4,A
145013,Study Drug A,7,11,2:No,-2,-2,-2,-2,-2,2:No,,,-2,1:Yes,11.1,90,1:Yes,2:No,Adjust dose,,,-2,,11,A
145044,Study Drug A,22,6,2:No,-2,-2,-2,-2,-2,2:No,,,-2,1:Yes,6,79,1:Yes,2:No,Adjust dose,,,-2,,6,A
145080,Study Drug A,7,9.8,2:No,-2,-2,-2,-2,-2,2:No,,,-2,1:Yes,9.7,87,1:Yes,2:No,Continue reuptitration,9.8,3.0,Daily,75.0,,A
145080,Study Drug A,8,9.8,2:No,-2,-2,-2,-2,-2,2:No,,,-2,1:Yes,9.9,80,1:Yes,2:No,Continue reuptitration,9.9,4.0,Daily,100.0,,A
145142,Study Drug A,6,26.8,1:Yes,2:No,1:Yes,2:No,2:No,1:Yes,2:No,,,-2,2:No,,,-2,-2,Adjust dose,,,-2,,26.8,A
145144,Study Drug A,8,19.6,2:No,-2,-2,-2,-2,-2,2:No,,,-2,1:Yes,19.6,65,1:Yes,2:No,Adjust dose,,,-2,,19.5,A
145254,Study Drug A,8,14.8,2:No,-2,-2,-2,-2,-2,2:No,,,-2,2:No,,,-2,-2,Continue reuptitration,14.8,2.1,Daily,100.0,,A
145254,Study Drug A,9,14.9,2:No,-2,-2,-2,-2,-2,2:No,,,-2,2:No,,,-2,-2,Continue reuptitration,14.9,4.0,Daily,200.0,,A
145263,Study Drug A,6,10.6,2:No,-2,-2,-2,-2,-2,2:No,,,-2,1:Yes,10.6,72,1:Yes,2:No,Continue reuptitration,10.7,3.8,Daily,100.0,,A
145263,Study Drug A,7,10.7,2:No,-2,-2,-2,-2,-2,2:No,,,-2,1:Yes,10.7,66,1:Yes,2:No,Adjust dose,,,-2,,10.6,A
145263,Study Drug A,14,12.2,2:No,-2,-2,-2,-2,-2,2:No,,,-2,1:Yes,12.2,71,1:Yes,2:No,Adjust dose,,,-2,,12.2,A
145264,Study Drug A,7,4.7,2:No,-2,-2,-2,-2,-2,2:No,,,-2,1:Yes,4.7,78,1:Yes,2:No,Continue reuptitration,4.7,4.0,Daily,100.0,,A
145264,Study Drug A,8,4.8,2:No,-2,-2,-2,-2,-2,2:No,,,-2,1:Yes,4.8,76,1:Yes,2:No,Adjust dose,,,-2,,4.7,A
145264,Study Drug A,16,6.2,2:No,-2,-2,-2,-2,-2,2:No,,,-2,1:Yes,6.3,67,1:Yes,1:Yes,Adjust dose,,,-2,,6.2,A
145284,Study Drug A,11,4.2,2:No,-2,-2,-2,-2,-2,2:No,,,-2,1:Yes,4.2,94,1:Yes,2:No,Continue reuptitration,4.3,3.0,Daily,50.0,,A
145284,Study Drug A,18,5.1,2:No,-2,-2,-2,-2,-2,2:No,,,-2,1:Yes,5.1,105,1:Yes,2:No,Continue reuptitration,5.1,2.0,Daily,37.5,,A
145284,Study Drug A,19,5.1,1:Yes,2:No,2:No,2:No,2:No,1:Yes,2:No,,,-2,2:No,,,-2,-2,Adjust dose,,,-2,,5,A
145292,Study Drug A,18,4.3,2:No,-2,-2,-2,-2,-2,2:No,,,-2,1:Yes,4.3,98,1:Yes,2:No,Adjust dose,,,-2,,4.2,A
145297,Study Drug A,7,14.5,2:No,-2,-2,-2,-2,-2,2:No,,,-2,1:Yes,14.5,81,1:Yes,1:Yes,Adjust dose,,,-2,,14.3,A
145297,Study Drug A,10,14.9,2:No,-2,-2,-2,-2,-2,2:No,,,-2,1:Yes,14.9,77,1:Yes,1:Yes,Adjust dose,,,-2,,14.8,A
145297,Study Drug A,16,16,2:No,-2,-2,-2,-2,-2,2:No,,,-2,1:Yes,16,86,1:Yes,2:No,Adjust dose,,,-2,,16,A
145330,Study Drug A,9,4.2,2:No,-2,-2,-2,-2,-2,2:No,,,-2,1:Yes,4.2,84,1:Yes,2:No,Adjust dose,,,-2,,4.1,A
145333,Study Drug A,17,17.1,2:No,-2,-2,-2,-2,-2,2:No,,,-2,1:Yes,17.1,59,1:Yes,2:No,Adjust dose,,,-2,,17.1,A
145347,Study Drug A,14,8,2:No,-2,-2,-2,-2,-2,2:No,,,-2,1:Yes,8,84,1:Yes,2:No,Adjust dose,,,-2,,7.9,A
145397,Study Drug A,4,13.6,2:No,-2,-2,-2,-2,-2,2:No,,,-2,1:Yes,13.7,83,1:Yes,2:No,Continue reuptitration,13.7,1.8,Daily,100.0,,A
145397,Study Drug A,5,13.7,2:No,-2,-2,-2,-2,-2,2:No,,,-2,1:Yes,13.8,77,1:Yes,2:No,Adjust dose,,,-2,,13.7,A
145412,Study Drug A,8,4.4,2:No,-2,-2,-2,-2,-2,2:No,,,-2,1:Yes,5.4,70,1:Yes,1:Yes,Adjust dose,,,-2,,5.3,A
145421,Study Drug A,11,3.5,2:No,-2,-2,-2,-2,-2,2:No,,,-2,1:Yes,3.5,87,1:Yes,1:Yes,Adjust dose,,,-2,,3.5,A
145436,Study Drug A,8,11.9,2:No,-2,-2,-2,-2,-2,2:No,,,-2,1:Yes,11.9,81,1:Yes,2:No,Continue reuptitration,12,2.6,Twice a day,125.0,,A
145436,Study Drug A,9,12.1,2:No,-2,-2,-2,-2,-2,2:No,,,-2,2:No,,,-2,-2,Adjust dose,,,-2,,12,A
145447,Study Drug B,13,8,2:No,-2,-2,-2,-2,-2,2:No,,,-2,1:Yes,8,94,1:Yes,-2,Adjust dose,,,-2,,7.9,A
145448,Study Drug A,6,22.3,2:No,-2,-2,-2,-2,-2,2:No,,,-2,1:Yes,22.3,65,1:Yes,2:No,Continue reuptitration,22.3,1.3,Twice a day,100.0,,A
145448,Study Drug A,6,22.3,2:No,-2,-2,-2,-2,-2,2:No,,,-2,1:Yes,22.3,56,1:Yes,1:Yes,Adjust dose,,,-2,,22.3,A
145520,Study Drug A,6,17.6,2:No,-2,-2,-2,-2,-2,2:No,,,-2,1:Yes,17.7,54,1:Yes,2:No,Continue reuptitration,17.7,3.1,Daily,175.0,,A
145528,Study Drug A,7,11.6,2:No,-2,-2,-2,-2,-2,2:No,,,-2,1:Yes,11.5,71,1:Yes,2:No,Continue reuptitration,11.6,2.3,Twice a day,125.0,,A
145564,Study Drug A,36,3.1,2:No,-2,-2,-2,-2,-2,2:No,,,-2,1:Yes,3.1,91,1:Yes,1:Yes,Adjust dose,,,-2,,3.1,A
145606,Study Drug A,13,8.7,2:No,-2,-2,-2,-2,-2,2:No,,,-2,1:Yes,8.7,80,1:Yes,2:No,Adjust dose,,,-2,,8.6,A
145666,Study Drug B,8,16.9,2:No,-2,-2,-2,-2,-2,2:No,,,-2,1:Yes,16.9,76,1:Yes,-2,Continue reuptitration,17,0.8,Daily,69.0,,A
145691,Study Drug A,10,12.7,2:No,-2,-2,-2,-2,-2,2:No,,,-2,1:Yes,12.7,70,1:Yes,2:No,Continue reuptitration,12.7,4.0,Twice a day,150.0,,A
145691,Study Drug A,11,12.8,2:No,-2,-2,-2,-2,-2,2:No,,,-2,1:Yes,12.8,70,1:Yes,2:No,Adjust dose,,,-2,,12.7,A
145734,Study Drug B,6,18.5,2:No,-2,-2,-2,-2,-2,2:No,,,-2,1:Yes,18.5,76,1:Yes,-2,Continue reuptitration,18.6,0.8,Twice a day,50.0,,A
145744,Study Drug A,10,6.9,2:No,-2,-2,-2,-2,-2,2:No,,,-2,1:Yes,6.9,76,1:Yes,2:No,Adjust dose,,,-2,,6.8,A
145744,Study Drug A,15,7.8,2:No,-2,-2,-2,-2,-2,2:No,,,-2,1:Yes,7.9,92,1:Yes,2:No,Adjust dose,,,-2,,7.8,A
145777,Study Drug B,7,11.1,2:No,-2,-2,-2,-2,-2,2:No,,,-2,1:Yes,11.1,90,1:Yes,-2,Adjust dose,,,-2,,11.1,A
145789,Study Drug A,8,12.2,2:No,-2,-2,-2,-2,-2,2:No,,,-2,1:Yes,12.3,65,1:Yes,1:Yes,Adjust dose,,,-2,,12.2,A
145805,Study Drug B,6,24.9,2:No,-2,-2,-2,-2,-2,2:No,,,-2,2:No,,,-2,-2,Adjust dose,,,-2,,24.9,A
145842,Study Drug A,4,16.4,2:No,-2,-2,-2,-2,-2,2:No,,,-2,1:Yes,16.4,48,2:No,1:Yes,Adjust dose,,,-2,,16.3,A
145842,Study Drug A,8,16.9,2:No,-2,-2,-2,-2,-2,2:No,,,-2,1:Yes,16.9,54,1:Yes,2:No,Continue reuptitration,17,1.8,Daily,162.5,,A
145842,Study Drug A,9,17,2:No,-2,-2,-2,-2,-2,2:No,,,-2,1:Yes,17,50,1:Yes,1:Yes,Adjust dose,,,-2,,17,A
145850,Study Drug A,12,12.7,2:No,-2,-2,-2,-2,-2,2:No,,,-2,1:Yes,12.7,77,1:Yes,2:No,Adjust dose,,,-2,,12.6,A
145867,Study Drug A,8,4.3,2:No,-2,-2,-2,-2,-2,2:No,,,-2,1:Yes,4.3,93,1:Yes,2:No,Continue reuptitration,4.3,3.0,Daily,47.0,,A
145867,Study Drug A,9,4.4,2:No,-2,-2,-2,-2,-2,2:No,,,-2,1:Yes,4.4,85,1:Yes,2:No,Continue reuptitration,4.4,3.5,Daily,57.0,,A
145867,Study Drug A,11,4.5,2:No,-2,-2,-2,-2,-2,2:No,,,-2,1:Yes,4.5,82,1:Yes,2:No,Continue reuptitration,4.5,4.0,Daily,66.0,,A
145867,Study Drug A,13,4.6,2:No,-2,-2,-2,-2,-2,2:No,,,-2,1:Yes,4.6,77,1:Yes,2:No,Adjust dose,,,-2,,4.5,A
145867,Study Drug A,21,5.2,2:No,-2,-2,-2,-2,-2,2:No,,,-2,1:Yes,5.2,84,1:Yes,2:No,Adjust dose,,,-2,,5.1,A
145867,Study Drug A,33,6,2:No,-2,-2,-2,-2,-2,2:No,,,-2,1:Yes,6,79,1:Yes,2:No,Adjust dose,,,-2,,6,A
