random_ID,STUDYDRUG124,RX_NUM124,RXSTART_AGE,RXSTOP_AGE,TOTALBOTDIS,BOT_NUM_0,BOT_NUM_1,BOT_NUM_2,BOT_NUM_3,BOT_NUM_4,BOT_RETURN_0,BOT_RETURN_1,BOT_RETURN_2,BOT_RETURN_3,BOT_RETURN_4,NORETURN_R_0,NORETURN_R_1,NORETURN_R_2,NORETURN_R_3,NORETURN_R_4,VOLPERDOSE_0,VOLPERDOSE_1,VOLPERDOSE_2,VOLPERDOSE_3,VOLPERDOSE_4,TOTVOLDISP_0,TOTVOLDISP_1,TOTVOLDISP_2,TOTVOLDISP_3,TOTVOLDISP_4,RESIDUALVOL_0,RESIDUALVOL_1,RESIDUALVOL_2,RESIDUALVOL_3,RESIDUALVOL_4,PCOUNTCOMP,PCOUNTCOMP_R,DISP12_5,RETURN12_5,DISP25,RETURN25,DISP50,RETURN50,DISP100,RETURN100,VER_ID
144508,STUDY DRUG B,4,16.3,16.5,SKIPPED,Missing,Missing,Missing,Missing,Missing,,,,,,,,,,,,,,,,,,,,,,,,,,COMPLETE,SKIPPED,0,0,0,0,180,6,0,0,A
144508,STUDY DRUG B,5,16.5,16.8,SKIPPED,Missing,Missing,Missing,Missing,Missing,,,,,,,,,,,,,,,,,,,,,,,,,,COMPLETE,SKIPPED,0,0,0,0,194,0,0,0,A
144508,STUDY DRUG B,6,16.8,17,SKIPPED,Missing,Missing,Missing,Missing,Missing,,,,,,,,,,,,,,,,,,,,,,,,,,COMPLETE,SKIPPED,0,0,0,0,180,24,0,0,A
144508,STUDY DRUG B,7,17,17.2,SKIPPED,Missing,Missing,Missing,Missing,Missing,,,,,,,,,,,,,,,,,,,,,,,,,,COMPLETE,SKIPPED,0,0,0,0,194,0,0,0,A
144508,STUDY DRUG B,8,17.2,17.5,SKIPPED,Missing,Missing,Missing,Missing,Missing,,,,,,,,,,,,,,,,,,,,,,,,,,COMPLETE,SKIPPED,0,0,0,0,194,0,0,0,A
144508,STUDY DRUG B,10,17.8,17.9,SKIPPED,Missing,Missing,Missing,Missing,Missing,,,,,,,,,,,,,,,,,,,,,,,,,,COMPLETE,SKIPPED,0,0,0,0,56,0,0,0,A
144508,STUDY DRUG B,9,17.5,17.8,SKIPPED,Missing,Missing,Missing,Missing,Missing,,,,,,,,,,,,,,,,,,,,,,,,,,COMPLETE,SKIPPED,0,0,0,0,194,0,0,0,A
144508,STUDY DRUG B,11,17.9,17.9,SKIPPED,Missing,Missing,Missing,Missing,Missing,,,,,,,,,,,,,,,,,,,,,,,,,,COMPLETE,SKIPPED,0,0,0,0,28,8,0,0,A
144511,STUDY DRUG A,5,8.7,8.8,SKIPPED,Missing,Missing,Missing,Missing,Missing,,,,,,,,,,,,,,,,,,,,,,,,,,COMPLETE,SKIPPED,30,0,0,0,30,0,0,0,A
144511,STUDY DRUG A,6,8.8,9,SKIPPED,Missing,Missing,Missing,Missing,Missing,,,,,,,,,,,,,,,,,,,,,,,,,,COMPLETE,SKIPPED,0,0,60,0,60,0,0,0,A
144511,STUDY DRUG A,7,9,9.2,SKIPPED,Missing,Missing,Missing,Missing,Missing,,,,,,,,,,,,,,,,,,,,,,,,,,COMPLETE,SKIPPED,0,0,90,0,180,0,0,0,A
144511,STUDY DRUG A,8,9.2,9.5,SKIPPED,Missing,Missing,Missing,Missing,Missing,,,,,,,,,,,,,,,,,,,,,,,,,,COMPLETE,SKIPPED,0,0,90,0,180,0,0,0,A
144511,STUDY DRUG A,9,9.5,9.7,SKIPPED,Missing,Missing,Missing,Missing,Missing,,,,,,,,,,,,,,,,,,,,,,,,,,NO,BOTTLE NOT RETURNED,,,,,,,,,A
144511,STUDY DRUG A,10,9.7,10,1,1,Missing,Missing,Missing,Missing,2:No,,,,,BOTTLE BROKEN,,,,,,,,,,,,,,,,,,,,SKIPPED,SKIPPED,,,,,,,,,A
144511,STUDY DRUG A,11,10,10.2,SKIPPED,Missing,Missing,Missing,Missing,Missing,,,,,,,,,,,,,,,,,,,,,,,,,,NO,BOTTLE NOT RETURNED,,,,,,,,,A
144511,STUDY DRUG A,12,10.2,10.4,SKIPPED,Missing,Missing,Missing,Missing,Missing,,,,,,,,,,,,,,,,,,,,,,,,,,NO,BOTTLE NOT RETURNED,,,,,,,,,A
144511,STUDY DRUG A,13,10.5,10.8,SKIPPED,Missing,Missing,Missing,Missing,Missing,,,,,,,,,,,,,,,,,,,,,,,,,,NO,BOTTLE NOT RETURNED,,,,,,,,,A
144511,STUDY DRUG A,14,10.8,11,SKIPPED,Missing,Missing,Missing,Missing,Missing,,,,,,,,,,,,,,,,,,,,,,,,,,NO,BOTTLE NOT RETURNED,,,,,,,,,A
144511,STUDY DRUG A,15,11,11.2,SKIPPED,Missing,Missing,Missing,Missing,Missing,,,,,,,,,,,,,,,,,,,,,,,,,,NO,BOTTLE NOT RETURNED,,,,,,,,,A
144511,STUDY DRUG A,16,11.2,11.4,SKIPPED,Missing,Missing,Missing,Missing,Missing,,,,,,,,,,,,,,,,,,,,,,,,,,NO,BOTTLE NOT RETURNED,,,,,,,,,A
144511,STUDY DRUG A,17,11.4,11.7,SKIPPED,Missing,Missing,Missing,Missing,Missing,,,,,,,,,,,,,,,,,,,,,,,,,,NO,BOTTLE NOT RETURNED,,,,,,,,,A
144511,STUDY DRUG A,18,11.7,11.7,SKIPPED,Missing,Missing,Missing,Missing,Missing,,,,,,,,,,,,,,,,,,,,,,,,,,NO,BOTTLE NOT RETURNED,,,,,,,,,A
144511,STUDY DRUG A,19,11.7,11.7,SKIPPED,Missing,Missing,Missing,Missing,Missing,,,,,,,,,,,,,,,,,,,,,,,,,,NO,BOTTLE NOT RETURNED,,,,,,,,,A
144515,STUDY DRUG A,7,12.1,12.2,SKIPPED,Missing,Missing,Missing,Missing,Missing,,,,,,,,,,,,,,,,,,,,,,,,,,COMPLETE,SKIPPED,0,0,195,51,0,0,0,0,A
144515,STUDY DRUG A,8,12.2,12.3,SKIPPED,Missing,Missing,Missing,Missing,Missing,,,,,,,,,,,,,,,,,,,,,,,,,,COMPLETE,SKIPPED,0,0,270,34,0,0,0,0,A
144515,STUDY DRUG A,9,12.3,12.5,SKIPPED,Missing,Missing,Missing,Missing,Missing,,,,,,,,,,,,,,,,,,,,,,,,,,COMPLETE,SKIPPED,0,0,675,33,0,0,0,0,A
144515,STUDY DRUG A,10,12.5,12.6,SKIPPED,Missing,Missing,Missing,Missing,Missing,,,,,,,,,,,,,,,,,,,,,,,,,,COMPLETE,SKIPPED,0,0,300,48,0,0,0,0,A
144515,STUDY DRUG A,11,12.6,12.7,SKIPPED,Missing,Missing,Missing,Missing,Missing,,,,,,,,,,,,,,,,,,,,,,,,,,COMPLETE,SKIPPED,0,0,0,0,0,0,70,8,A
144515,STUDY DRUG A,12,12.7,13,SKIPPED,Missing,Missing,Missing,Missing,Missing,,,,,,,,,,,,,,,,,,,,,,,,,,COMPLETE,SKIPPED,0,0,0,0,0,0,180,7,A
144515,STUDY DRUG A,13,13,13.2,SKIPPED,Missing,Missing,Missing,Missing,Missing,,,,,,,,,,,,,,,,,,,,,,,,,,COMPLETE,SKIPPED,0,0,0,0,0,0,180,0,A
144515,STUDY DRUG A,14,13.2,13.4,SKIPPED,Missing,Missing,Missing,Missing,Missing,,,,,,,,,,,,,,,,,,,,,,,,,,COMPLETE,SKIPPED,0,0,0,0,0,0,180,20,A
144515,STUDY DRUG A,15,13.4,13.7,SKIPPED,Missing,Missing,Missing,Missing,Missing,,,,,,,,,,,,,,,,,,,,,,,,,,COMPLETE,SKIPPED,0,0,0,0,0,0,170,8,A
144515,STUDY DRUG A,16,13.7,13.7,SKIPPED,Missing,Missing,Missing,Missing,Missing,,,,,,,,,,,,,,,,,,,,,,,,,,COMPLETE,SKIPPED,0,0,0,0,162,27,0,0,A
144515,STUDY DRUG A,17,13.7,13.9,SKIPPED,Missing,Missing,Missing,Missing,Missing,,,,,,,,,,,,,,,,,,,,,,,,,,COMPLETE,SKIPPED,0,0,0,0,297,13,0,0,A
144515,STUDY DRUG A,18,13.9,14.2,SKIPPED,Missing,Missing,Missing,Missing,Missing,,,,,,,,,,,,,,,,,,,,,,,,,,COMPLETE,SKIPPED,0,0,0,0,405,6,0,0,A
144515,STUDY DRUG A,19,14.2,14.4,SKIPPED,Missing,Missing,Missing,Missing,Missing,,,,,,,,,,,,,,,,,,,,,,,,,,COMPLETE,SKIPPED,0,0,0,0,428,72,0,0,A
144515,STUDY DRUG A,20,14.4,14.5,SKIPPED,Missing,Missing,Missing,Missing,Missing,,,,,,,,,,,,,,,,,,,,,,,,,,COMPLETE,SKIPPED,0,0,0,0,203,72,0,0,A
144517,STUDY DRUG B,7,19.9,20.2,SKIPPED,Missing,Missing,Missing,Missing,Missing,,,,,,,,,,,,,,,,,,,,,,,,,,COMPLETE,SKIPPED,90,0,180,0,0,0,0,0,A
144517,STUDY DRUG B,6,19.7,19.9,SKIPPED,Missing,Missing,Missing,Missing,Missing,,,,,,,,,,,,,,,,,,,,,,,,,,PARTIAL,SKIPPED,90,0,0,0,90,0,0,0,A
144517,STUDY DRUG B,8,20.2,20.4,SKIPPED,Missing,Missing,Missing,Missing,Missing,,,,,,,,,,,,,,,,,,,,,,,,,,NO,BOTTLE NOT RETURNED,,,,,,,,,A
144517,STUDY DRUG B,9,20.4,20.6,SKIPPED,Missing,Missing,Missing,Missing,Missing,,,,,,,,,,,,,,,,,,,,,,,,,,COMPLETE,SKIPPED,90,0,180,1,0,0,0,0,A
144517,STUDY DRUG B,10,20.6,20.9,SKIPPED,Missing,Missing,Missing,Missing,Missing,,,,,,,,,,,,,,,,,,,,,,,,,,COMPLETE,SKIPPED,90,0,0,0,90,0,0,0,A
144517,STUDY DRUG B,14,21.6,21.8,SKIPPED,Missing,Missing,Missing,Missing,Missing,,,,,,,,,,,,,,,,,,,,,,,,,,NO,BOTTLE NOT RETURNED,,,,,,,,,A
144517,STUDY DRUG B,13,21.3,21.6,SKIPPED,Missing,Missing,Missing,Missing,Missing,,,,,,,,,,,,,,,,,,,,,,,,,,NO,BOTTLE NOT RETURNED,,,,,,,,,A
144517,STUDY DRUG B,12,21.1,21.3,SKIPPED,Missing,Missing,Missing,Missing,Missing,,,,,,,,,,,,,,,,,,,,,,,,,,NO,BOTTLE NOT RETURNED,,,,,,,,,A
144517,STUDY DRUG B,11,20.9,21.1,SKIPPED,Missing,Missing,Missing,Missing,Missing,,,,,,,,,,,,,,,,,,,,,,,,,,NO,BOTTLE NOT RETURNED,,,,,,,,,A
144517,STUDY DRUG B,15,21.8,22,SKIPPED,Missing,Missing,Missing,Missing,Missing,,,,,,,,,,,,,,,,,,,,,,,,,,COMPLETE,SKIPPED,0,0,0,0,90,0,0,0,A
144517,STUDY DRUG B,16,22.3,22.5,SKIPPED,Missing,Missing,Missing,Missing,Missing,,,,,,,,,,,,,,,,,,,,,,,,,,NO,BOTTLE NOT RETURNED,,,,,,,,,A
144519,STUDY DRUG B,10,26,26.3,SKIPPED,Missing,Missing,Missing,Missing,Missing,,,,,,,,,,,,,,,,,,,,,,,,,,NO,BOTTLE NOT RETURNED,,,,,,,,,A
144519,STUDY DRUG B,9,26,26.2,SKIPPED,Missing,Missing,Missing,Missing,Missing,,,,,,,,,,,,,,,,,,,,,,,,,,NO,BOTTLE NOT RETURNED,,,,,,,,,A
144519,STUDY DRUG B,8,25.7,25.9,SKIPPED,Missing,Missing,Missing,Missing,Missing,,,,,,,,,,,,,,,,,,,,,,,,,,NO,BOTTLE NOT RETURNED,,,,,,,,,A
144519,STUDY DRUG B,11,26.5,26.8,SKIPPED,Missing,Missing,Missing,Missing,Missing,,,,,,,,,,,,,,,,,,,,,,,,,,NO,BOTTLE NOT RETURNED,,,,,,,,,A
144519,STUDY DRUG B,6,24.7,24.9,SKIPPED,Missing,Missing,Missing,Missing,Missing,,,,,,,,,,,,,,,,,,,,,,,,,,NO,BOTTLE NOT RETURNED,,,,,,,,,A
144519,STUDY DRUG B,4,24.2,24.4,SKIPPED,Missing,Missing,Missing,Missing,Missing,,,,,,,,,,,,,,,,,,,,,,,,,,NO,BOTTLE NOT RETURNED,,,,,,,,,A
144519,STUDY DRUG B,7,25.1,25.3,SKIPPED,Missing,Missing,Missing,Missing,Missing,,,,,,,,,,,,,,,,,,,,,,,,,,NO,BOTTLE NOT RETURNED,,,,,,,,,A
144519,STUDY DRUG B,5,24.4,24.7,SKIPPED,Missing,Missing,Missing,Missing,Missing,,,,,,,,,,,,,,,,,,,,,,,,,,NO,BOTTLE NOT RETURNED,,,,,,,,,A
144520,STUDY DRUG A,15,6.1,6.2,2,1,2,Missing,Missing,Missing,2:No,1:Yes,,,,OTHER,SKIPPED,,,,,21.5,,,,,345,,,,,0,,,,SKIPPED,SKIPPED,,,,,,,,,A
144520,STUDY DRUG A,14,6,6.1,2,1,2,Missing,Missing,Missing,1:Yes,1:Yes,,,,SKIPPED,SKIPPED,,,,21.5,21.5,,,,300,345,,,,0,182,,,,SKIPPED,SKIPPED,,,,,,,,,A
144520,STUDY DRUG A,13,5.9,6,2,1,2,Missing,Missing,Missing,1:Yes,1:Yes,,,,SKIPPED,SKIPPED,,,,21.5,21.5,,,,300,345,,,,0,9,,,,SKIPPED,SKIPPED,,,,,,,,,A
144520,STUDY DRUG A,12,5.9,5.9,2,1,2,Missing,Missing,Missing,1:Yes,1:Yes,,,,SKIPPED,SKIPPED,,,,21.5,21.5,,,,354,291,,,,354,0,,,,SKIPPED,SKIPPED,,,,,,,,,A
144520,STUDY DRUG A,11,5.8,5.9,2,1,2,Missing,Missing,Missing,1:Yes,1:Yes,,,,SKIPPED,SKIPPED,,,,21.5,21.5,,,,300,345,,,,0,0,,,,SKIPPED,SKIPPED,,,,,,,,,A
144520,STUDY DRUG A,10,5.8,5.8,2,1,2,Missing,Missing,Missing,1:Yes,1:Yes,,,,SKIPPED,SKIPPED,,,,21.5,21.5,,,,345,300,,,,262,300,,,,SKIPPED,SKIPPED,,,,,,,,,A
144520,STUDY DRUG A,8,5.6,5.7,2,1,2,Missing,Missing,Missing,1:Yes,1:Yes,,,,SKIPPED,SKIPPED,,,,20.5,20.5,,,,315,300,,,,14,0,,,,SKIPPED,SKIPPED,,,,,,,,,A
144520,STUDY DRUG A,9,5.7,5.8,2,1,2,Missing,Missing,Missing,1:Yes,1:Yes,,,,SKIPPED,SKIPPED,,,,20.5,20.5,,,,300,315,,,,0,7,,,,SKIPPED,SKIPPED,,,,,,,,,A
144520,STUDY DRUG A,7,5.5,5.6,2,1,2,Missing,Missing,Missing,1:Yes,1:Yes,,,,SKIPPED,SKIPPED,,,,20.5,20.5,,,,315,300,,,,0,62,,,,SKIPPED,SKIPPED,,,,,,,,,A
144520,STUDY DRUG A,16,6.2,6.2,2,1,2,Missing,Missing,Missing,1:Yes,1:Yes,,,,SKIPPED,SKIPPED,,,,23,23,,,,360,330,,,,2.5,168,,,,SKIPPED,SKIPPED,,,,,,,,,A
144520,STUDY DRUG A,17,6.2,6.3,2,1,2,Missing,Missing,Missing,1:Yes,1:Yes,,,,SKIPPED,SKIPPED,,,,23,23,,,,360,330,,,,3,228,,,,SKIPPED,SKIPPED,,,,,,,,,A
144520,STUDY DRUG A,18,6.3,6.4,2,1,2,Missing,Missing,Missing,1:Yes,1:Yes,,,,SKIPPED,SKIPPED,,,,23,23,,,,360,330,,,,85,11,,,,SKIPPED,SKIPPED,,,,,,,,,A
144520,STUDY DRUG A,19,6.4,6.4,2,1,2,Missing,Missing,Missing,1:Yes,1:Yes,,,,SKIPPED,SKIPPED,,,,23,23,,,,360,330,,,,13,106,,,,SKIPPED,SKIPPED,,,,,,,,,A
144520,STUDY DRUG A,20,6.4,6.5,2,1,2,Missing,Missing,Missing,1:Yes,1:Yes,,,,SKIPPED,SKIPPED,,,,23,23,,,,350,340,,,,162,2,,,,SKIPPED,SKIPPED,,,,,,,,,A
144520,STUDY DRUG A,21,6.5,6.6,2,1,2,Missing,Missing,Missing,1:Yes,1:Yes,,,,SKIPPED,SKIPPED,,,,23,23,,,,360,330,,,,18,124,,,,SKIPPED,SKIPPED,,,,,,,,,A
144520,STUDY DRUG A,22,6.6,6.7,2,1,2,Missing,Missing,Missing,1:Yes,1:Yes,,,,SKIPPED,SKIPPED,,,,23,23,,,,360,330,,,,0,300,,,,SKIPPED,SKIPPED,,,,,,,,,A
144520,STUDY DRUG A,23,6.7,6.7,2,1,2,Missing,Missing,Missing,1:Yes,1:Yes,,,,SKIPPED,SKIPPED,,,,23,23,,,,350,340,,,,4.5,132,,,,SKIPPED,SKIPPED,,,,,,,,,A
144520,STUDY DRUG A,24,6.7,6.8,2,1,2,Missing,Missing,Missing,1:Yes,1:Yes,,,,SKIPPED,SKIPPED,,,,23,23,,,,360,330,,,,1,168,,,,SKIPPED,SKIPPED,,,,,,,,,A
144520,STUDY DRUG A,25,6.9,6.9,2,1,2,Missing,Missing,Missing,2:No,1:Yes,,,,OTHER,SKIPPED,,,,,23,,,,,345,,,,,176,,,,SKIPPED,SKIPPED,,,,,,,,,A
144520,STUDY DRUG A,26,6.9,6.9,2,1,2,Missing,Missing,Missing,1:Yes,1:Yes,,,,SKIPPED,SKIPPED,,,,23,23,,,,350,340,,,,9,220,,,,SKIPPED,SKIPPED,,,,,,,,,A
144520,STUDY DRUG A,27,6.9,7,2,1,2,Missing,Missing,Missing,1:Yes,1:Yes,,,,SKIPPED,SKIPPED,,,,23,23,,,,360,330,,,,11,106,,,,SKIPPED,SKIPPED,,,,,,,,,A
144520,STUDY DRUG A,29,7.1,7.1,2,1,2,Missing,Missing,Missing,1:Yes,1:Yes,,,,SKIPPED,SKIPPED,,,,23,23,,,,350,340,,,,2,340,,,,SKIPPED,SKIPPED,,,,,,,,,A
144520,STUDY DRUG A,30,7.1,7.2,SKIPPED,Missing,Missing,Missing,Missing,Missing,,,,,,,,,,,,,,,,,,,,,,,,,,COMPLETE,SKIPPED,0,0,0,0,30,15,0,0,A
144520,STUDY DRUG A,28,7,7.1,2,1,2,Missing,Missing,Missing,1:Yes,1:Yes,,,,SKIPPED,SKIPPED,,,,23,23,,,,350,340,,,,11,156,,,,SKIPPED,SKIPPED,,,,,,,,,A
144520,STUDY DRUG A,31,7.2,7.4,SKIPPED,Missing,Missing,Missing,Missing,Missing,,,,,,,,,,,,,,,,,,,,,,,,,,COMPLETE,SKIPPED,0,0,0,0,90,0,0,0,A
144520,STUDY DRUG A,32,7.4,7.7,SKIPPED,Missing,Missing,Missing,Missing,Missing,,,,,,,,,,,,,,,,,,,,,,,,,,COMPLETE,SKIPPED,0,0,0,0,90,0,0,0,A
144520,STUDY DRUG A,33,7.7,8,SKIPPED,Missing,Missing,Missing,Missing,Missing,,,,,,,,,,,,,,,,,,,,,,,,,,COMPLETE,SKIPPED,0,0,0,0,90,0,0,0,A
144520,STUDY DRUG A,34,8,8.1,SKIPPED,Missing,Missing,Missing,Missing,Missing,,,,,,,,,,,,,,,,,,,,,,,,,,COMPLETE,SKIPPED,0,0,0,0,90,22,0,0,A
144520,STUDY DRUG A,35,8.1,8.1,SKIPPED,Missing,Missing,Missing,Missing,Missing,,,,,,,,,,,,,,,,,,,,,,,,,,COMPLETE,SKIPPED,0,0,0,0,90,90,0,0,A
144520,STUDY DRUG A,36,8.2,8.2,SKIPPED,Missing,Missing,Missing,Missing,Missing,,,,,,,,,,,,,,,,,,,,,,,,,,COMPLETE,SKIPPED,0,0,14,0,0,0,0,0,A
144520,STUDY DRUG A,37,8.2,8.2,SKIPPED,Missing,Missing,Missing,Missing,Missing,,,,,,,,,,,,,,,,,,,,,,,,,,COMPLETE,SKIPPED,0,0,4,0,0,0,0,0,A
144525,STUDY DRUG A,8,1.9,1.9,2,1,2,Missing,Missing,Missing,1:Yes,1:Yes,,,,SKIPPED,SKIPPED,,,,22,22,,,,330,330,,,,1,166,,,,SKIPPED,SKIPPED,,,,,,,,,A
144525,STUDY DRUG A,9,1.9,2,2,1,2,Missing,Missing,Missing,1:Yes,1:Yes,,,,SKIPPED,SKIPPED,,,,22,22,,,,330,330,,,,3.5,5.5,,,,SKIPPED,SKIPPED,,,,,,,,,A
144525,STUDY DRUG A,10,2,2,2,1,2,Missing,Missing,Missing,1:Yes,1:Yes,,,,SKIPPED,SKIPPED,,,,22,22,,,,330,330,,,,55,330,,,,SKIPPED,SKIPPED,,,,,,,,,A
144525,STUDY DRUG A,11,2,2.1,2,1,2,Missing,Missing,Missing,1:Yes,1:Yes,,,,SKIPPED,SKIPPED,,,,27,27,,,,410,400,,,,4,3,,,,SKIPPED,SKIPPED,,,,,,,,,A
144525,STUDY DRUG A,12,2.1,2.2,2,1,2,Missing,Missing,Missing,1:Yes,1:Yes,,,,SKIPPED,SKIPPED,,,,27,27,,,,400,410,,,,4.5,148,,,,SKIPPED,SKIPPED,,,,,,,,,A
144525,STUDY DRUG A,13,2.2,2.3,2,1,2,Missing,Missing,Missing,1:Yes,1:Yes,,,,SKIPPED,SKIPPED,,,,27,27,,,,400,410,,,,2.5,158,,,,SKIPPED,SKIPPED,,,,,,,,,A
144525,STUDY DRUG A,14,2.3,2.3,2,1,1,Missing,Missing,Missing,1:Yes,1:Yes,,,,SKIPPED,SKIPPED,,,,27,27,,,,400,410,,,,1,237,,,,SKIPPED,SKIPPED,,,,,,,,,A
144525,STUDY DRUG A,15,2.3,2.4,2,1,2,Missing,Missing,Missing,1:Yes,1:Yes,,,,SKIPPED,SKIPPED,,,,27,27,,,,400,410,,,,4,47,,,,SKIPPED,SKIPPED,,,,,,,,,A
144525,STUDY DRUG A,16,2.4,2.5,2,1,2,Missing,Missing,Missing,1:Yes,1:Yes,,,,SKIPPED,SKIPPED,,,,27,27,,,,400,410,,,,1,92,,,,SKIPPED,SKIPPED,,,,,,,,,A
144525,STUDY DRUG A,17,2.5,2.5,2,1,2,Missing,Missing,Missing,1:Yes,1:Yes,,,,SKIPPED,SKIPPED,,,,27,27,,,,400,410,,,,8,91,,,,SKIPPED,SKIPPED,,,,,,,,,A
144525,STUDY DRUG A,18,2.6,2.6,2,1,2,Missing,Missing,Missing,1:Yes,1:Yes,,,,SKIPPED,SKIPPED,,,,27,27,,,,400,410,,,,1,39,,,,SKIPPED,SKIPPED,,,,,,,,,A
144525,STUDY DRUG A,19,2.6,2.7,2,1,2,Missing,Missing,Missing,1:Yes,1:Yes,,,,SKIPPED,SKIPPED,,,,27,27,,,,400,425,,,,8,84,,,,SKIPPED,SKIPPED,,,,,,,,,A
144525,STUDY DRUG A,20,2.7,2.8,2,1,2,Missing,Missing,Missing,1:Yes,1:Yes,,,,SKIPPED,SKIPPED,,,,27,27,,,,400,410,,,,1.5,152,,,,SKIPPED,SKIPPED,,,,,,,,,A
144525,STUDY DRUG A,21,2.8,2.8,2,1,2,Missing,Missing,Missing,1:Yes,1:Yes,,,,SKIPPED,SKIPPED,,,,27,27,,,,410,400,,,,0,154,,,,SKIPPED,SKIPPED,,,,,,,,,A
144525,STUDY DRUG A,23,2.9,3,2,1,2,Missing,Missing,Missing,1:Yes,1:Yes,,,,SKIPPED,SKIPPED,,,,27,27,,,,400,410,,,,2,99,,,,SKIPPED,SKIPPED,,,,,,,,,A
144525,STUDY DRUG A,22,2.8,2.9,2,1,2,Missing,Missing,Missing,1:Yes,1:Yes,,,,SKIPPED,SKIPPED,,,,27,27,,,,410,400,,,,1,63,,,,SKIPPED,SKIPPED,,,,,,,,,A
144525,STUDY DRUG A,24,3,3.1,2,1,2,Missing,Missing,Missing,1:Yes,1:Yes,,,,SKIPPED,SKIPPED,,,,27,27,,,,400,410,,,,21,74,,,,SKIPPED,SKIPPED,,,,,,,,,A
144525,STUDY DRUG A,25,3.1,3.1,2,1,2,Missing,Missing,Missing,1:Yes,1:Yes,,,,SKIPPED,SKIPPED,,,,27,27,,,,400,410,,,,5,120,,,,SKIPPED,SKIPPED,,,,,,,,,A
144525,STUDY DRUG A,26,3.1,3.2,2,1,2,Missing,Missing,Missing,1:Yes,1:Yes,,,,SKIPPED,SKIPPED,,,,27,27,,,,400,410,,,,6,147,,,,SKIPPED,SKIPPED,,,,,,,,,A
144525,STUDY DRUG A,28,3.2,3.3,2,1,2,Missing,Missing,Missing,1:Yes,1:Yes,,,,SKIPPED,SKIPPED,,,,27,27,,,,400,410,,,,6,95,,,,SKIPPED,SKIPPED,,,,,,,,,A
144525,STUDY DRUG A,29,3.3,3.4,2,1,2,Missing,Missing,Missing,1:Yes,1:Yes,,,,SKIPPED,SKIPPED,,,,27,27,,,,400,410,,,,10,92,,,,SKIPPED,SKIPPED,,,,,,,,,A
144525,STUDY DRUG A,30,3.4,3.4,2,1,2,Missing,Missing,Missing,1:Yes,1:Yes,,,,SKIPPED,SKIPPED,,,,27,27,,,,400,410,,,,8,44,,,,SKIPPED,SKIPPED,,,,,,,,,A
144525,STUDY DRUG A,31,3.4,3.5,2,1,2,Missing,Missing,Missing,1:Yes,1:Yes,,,,SKIPPED,SKIPPED,,,,27,27,,,,400,410,,,,8,221,,,,SKIPPED,SKIPPED,,,,,,,,,A
144525,STUDY DRUG A,32,3.5,3.6,2,1,2,Missing,Missing,Missing,1:Yes,1:Yes,,,,SKIPPED,SKIPPED,,,,27,27,,,,410,400,,,,8,159,,,,SKIPPED,SKIPPED,,,,,,,,,A
144525,STUDY DRUG A,33,3.6,3.6,2,1,2,Missing,Missing,Missing,1:Yes,1:Yes,,,,SKIPPED,SKIPPED,,,,27,27,,,,400,410,,,,8,176,,,,SKIPPED,SKIPPED,,,,,,,,,A
144525,STUDY DRUG A,34,3.6,3.6,2,1,2,Missing,Missing,Missing,1:Yes,1:Yes,,,,SKIPPED,SKIPPED,,,,27,27,,,,400,410,,,,179,410,,,,SKIPPED,SKIPPED,,,,,,,,,A
144525,STUDY DRUG A,35,3.7,3.7,SKIPPED,Missing,Missing,Missing,Missing,Missing,,,,,,,,,,,,,,,,,,,,,,,,,,COMPLETE,SKIPPED,0,0,60,0,0,0,0,0,A
144525,STUDY DRUG A,36,3.7,4,SKIPPED,Missing,Missing,Missing,Missing,Missing,,,,,,,,,,,,,,,,,,,,,,,,,,COMPLETE,SKIPPED,0,0,180,0,0,0,0,0,A
144525,STUDY DRUG A,37,4,4.2,SKIPPED,Missing,Missing,Missing,Missing,Missing,,,,,,,,,,,,,,,,,,,,,,,,,,COMPLETE,SKIPPED,0,0,180,0,0,0,0,0,A
144525,STUDY DRUG A,38,4.2,4.5,SKIPPED,Missing,Missing,Missing,Missing,Missing,,,,,,,,,,,,,,,,,,,,,,,,,,COMPLETE,SKIPPED,0,0,180,0,0,0,0,0,A
144525,STUDY DRUG A,39,4.5,4.5,SKIPPED,Missing,Missing,Missing,Missing,Missing,,,,,,,,,,,,,,,,,,,,,,,,,,COMPLETE,SKIPPED,0,0,180,176,0,0,0,0,A
144525,STUDY DRUG A,41,4.5,4.5,SKIPPED,Missing,Missing,Missing,Missing,Missing,,,,,,,,,,,,,,,,,,,,,,,,,,COMPLETE,SKIPPED,0,0,4,0,0,0,0,0,A
144525,STUDY DRUG A,40,4.5,4.5,SKIPPED,Missing,Missing,Missing,Missing,Missing,,,,,,,,,,,,,,,,,,,,,,,,,,COMPLETE,SKIPPED,0,0,14,0,0,0,0,0,A
144527,STUDY DRUG A,5,11.6,11.8,SKIPPED,Missing,Missing,Missing,Missing,Missing,,,,,,,,,,,,,,,,,,,,,,,,,,NO,BOTTLE NOT RETURNED,,,,,,,,,A
144527,STUDY DRUG A,9,12.1,12.1,SKIPPED,Missing,Missing,Missing,Missing,Missing,,,,,,,,,,,,,,,,,,,,,,,,,,NO,BOTTLE NOT RETURNED,,,,,,,,,A
144527,STUDY DRUG A,8,12,12.1,SKIPPED,Missing,Missing,Missing,Missing,Missing,,,,,,,,,,,,,,,,,,,,,,,,,,NO,BOTTLE NOT RETURNED,,,,,,,,,A
144527,STUDY DRUG A,4,11.5,11.5,SKIPPED,Missing,Missing,Missing,Missing,Missing,,,,,,,,,,,,,,,,,,,,,,,,,,NO,BOTTLE NOT RETURNED,,,,,,,,,A
144527,STUDY DRUG A,6,11.8,12,SKIPPED,Missing,Missing,Missing,Missing,Missing,,,,,,,,,,,,,,,,,,,,,,,,,,NO,BOTTLE NOT RETURNED,,,,,,,,,A
144527,STUDY DRUG A,11,12.2,12.3,SKIPPED,Missing,Missing,Missing,Missing,Missing,,,,,,,,,,,,,,,,,,,,,,,,,,COMPLETE,SKIPPED,0,0,0,0,35,4,0,0,A
144527,STUDY DRUG A,13,12.3,12.4,SKIPPED,Missing,Missing,Missing,Missing,Missing,,,,,,,,,,,,,,,,,,,,,,,,,,NO,BOTTLE NOT RETURNED,,,,,,,,,A
144527,STUDY DRUG A,10,12.1,12.2,SKIPPED,Missing,Missing,Missing,Missing,Missing,,,,,,,,,,,,,,,,,,,,,,,,,,NO,BOTTLE NOT RETURNED,,,,,,,,,A
144527,STUDY DRUG A,12,12.3,12.3,SKIPPED,Missing,Missing,Missing,Missing,Missing,,,,,,,,,,,,,,,,,,,,,,,,,,NO,BOTTLE NOT RETURNED,,,,,,,,,A
144527,STUDY DRUG A,7,11.8,12,SKIPPED,Missing,Missing,Missing,Missing,Missing,,,,,,,,,,,,,,,,,,,,,,,,,,NO,BOTTLE NOT RETURNED,,,,,,,,,A
144527,STUDY DRUG A,14,12.4,12.6,SKIPPED,Missing,Missing,Missing,Missing,Missing,,,,,,,,,,,,,,,,,,,,,,,,,,COMPLETE,SKIPPED,0,0,0,0,315,55,0,0,A
144527,STUDY DRUG A,15,12.6,12.8,SKIPPED,Missing,Missing,Missing,Missing,Missing,,,,,,,,,,,,,,,,,,,,,,,,,,NO,BOTTLE NOT RETURNED,,,,,,,,,A
144527,STUDY DRUG A,16,12.8,13.1,SKIPPED,Missing,Missing,Missing,Missing,Missing,,,,,,,,,,,,,,,,,,,,,,,,,,NO,BOTTLE NOT RETURNED,,,,,,,,,A
144527,STUDY DRUG A,18,13.3,13.5,SKIPPED,Missing,Missing,Missing,Missing,Missing,,,,,,,,,,,,,,,,,,,,,,,,,,COMPLETE,SKIPPED,0,0,0,0,315,238,0,0,A
144527,STUDY DRUG A,17,13.1,13.3,SKIPPED,Missing,Missing,Missing,Missing,Missing,,,,,,,,,,,,,,,,,,,,,,,,,,NO,BOTTLE NOT RETURNED,,,,,,,,,A
144527,STUDY DRUG A,19,13.5,13.7,SKIPPED,Missing,Missing,Missing,Missing,Missing,,,,,,,,,,,,,,,,,,,,,,,,,,NO,BOTTLE NOT RETURNED,,,,,,,,,A
144527,STUDY DRUG A,20,13.5,13.7,SKIPPED,Missing,Missing,Missing,Missing,Missing,,,,,,,,,,,,,,,,,,,,,,,,,,NO,BOTTLE NOT RETURNED,,,,,,,,,A
144527,STUDY DRUG A,21,13.7,13.9,SKIPPED,Missing,Missing,Missing,Missing,Missing,,,,,,,,,,,,,,,,,,,,,,,,,,NO,BOTTLE NOT RETURNED,,,,,,,,,A
144527,STUDY DRUG A,22,13.9,14.2,SKIPPED,Missing,Missing,Missing,Missing,Missing,,,,,,,,,,,,,,,,,,,,,,,,,,NO,BOTTLE NOT RETURNED,,,,,,,,,A
144527,STUDY DRUG A,23,14.2,14.3,SKIPPED,Missing,Missing,Missing,Missing,Missing,,,,,,,,,,,,,,,,,,,,,,,,,,NO,BOTTLE NOT RETURNED,,,,,,,,,A
144527,STUDY DRUG A,24,14.3,14.4,SKIPPED,Missing,Missing,Missing,Missing,Missing,,,,,,,,,,,,,,,,,,,,,,,,,,NO,BOTTLE NOT RETURNED,,,,,,,,,A
144527,STUDY DRUG A,25,14.4,14.4,SKIPPED,Missing,Missing,Missing,Missing,Missing,,,,,,,,,,,,,,,,,,,,,,,,,,NO,BOTTLE NOT RETURNED,,,,,,,,,A
144527,STUDY DRUG A,26,14.4,14.5,SKIPPED,Missing,Missing,Missing,Missing,Missing,,,,,,,,,,,,,,,,,,,,,,,,,,NO,BOTTLE NOT RETURNED,,,,,,,,,A
144529,STUDY DRUG B,6,4,4.1,2,1,2,Missing,Missing,Missing,1:Yes,1:Yes,,,,SKIPPED,SKIPPED,,,,11,11,,,,200,200,,,,8,110,,,,SKIPPED,SKIPPED,,,,,,,,,A
144529,STUDY DRUG B,5,4,4,2,1,2,Missing,Missing,Missing,1:Yes,1:Yes,,,,SKIPPED,SKIPPED,,,,11,11,,,,200,200,,,,69,89,,,,SKIPPED,SKIPPED,,,,,,,,,A
144529,STUDY DRUG B,8,4.1,4.2,2,1,2,Missing,Missing,Missing,1:Yes,1:Yes,,,,SKIPPED,SKIPPED,,,,11,11,,,,200,200,,,,12,155,,,,SKIPPED,SKIPPED,,,,,,,,,A
144529,STUDY DRUG B,4,3.9,4,2,1,2,Missing,Missing,Missing,1:Yes,1:Yes,,,,SKIPPED,SKIPPED,,,,11,11,,,,200,200,,,,77,67,,,,SKIPPED,SKIPPED,,,,,,,,,A
144529,STUDY DRUG B,7,4.1,4.2,2,1,2,Missing,Missing,Missing,1:Yes,1:Yes,,,,SKIPPED,SKIPPED,,,,11,11,,,,200,200,,,,13,164,,,,SKIPPED,SKIPPED,,,,,,,,,A
144529,STUDY DRUG B,13,4.5,4.5,2,1,2,Missing,Missing,Missing,1:Yes,1:Yes,,,,SKIPPED,SKIPPED,,,,12,12,,,,200,200,,,,11,77,,,,SKIPPED,SKIPPED,,,,,,,,,A
144529,STUDY DRUG B,11,4.4,4.4,2,1,2,Missing,Missing,Missing,1:Yes,1:Yes,,,,SKIPPED,SKIPPED,,,,12,12,,,,200,200,,,,13,200,,,,SKIPPED,SKIPPED,,,,,,,,,A
144529,STUDY DRUG B,10,4.3,4.4,2,1,2,Missing,Missing,Missing,1:Yes,1:Yes,,,,SKIPPED,SKIPPED,,,,12,12,,,,200,200,,,,6,127,,,,SKIPPED,SKIPPED,,,,,,,,,A
144529,STUDY DRUG B,14,4.5,4.6,2,1,2,Missing,Missing,Missing,1:Yes,1:Yes,,,,SKIPPED,SKIPPED,,,,12,12,,,,200,200,,,,5,100,,,,SKIPPED,SKIPPED,,,,,,,,,A
144529,STUDY DRUG B,12,4.4,4.5,2,1,2,Missing,Missing,Missing,1:Yes,1:Yes,,,,SKIPPED,SKIPPED,,,,12,12,,,,200,200,,,,8,111,,,,SKIPPED,SKIPPED,,,,,,,,,A
144529,STUDY DRUG B,9,4.2,4.3,2,1,2,Missing,Missing,Missing,2:No,1:Yes,,,,OTHER,SKIPPED,,,,,12,,,,,200,,,,,123,,,,SKIPPED,SKIPPED,,,,,,,,,A
144529,STUDY DRUG B,15,4.6,4.7,2,1,2,Missing,Missing,Missing,2:No,1:Yes,,,,OTHER,SKIPPED,,,,,12,,,,,200,,,,,100,,,,SKIPPED,SKIPPED,,,,,,,,,A
144529,STUDY DRUG B,24,5.2,5.3,2,1,2,Missing,Missing,Missing,1:Yes,1:Yes,,,,SKIPPED,SKIPPED,,,,12.5,12.5,,,,200,200,,,,12,105,,,,SKIPPED,SKIPPED,,,,,,,,,A
144529,STUDY DRUG B,19,4.9,5,2,1,2,Missing,Missing,Missing,1:Yes,1:Yes,,,,SKIPPED,SKIPPED,,,,12.5,12.5,,,,200,200,,,,124,0,,,,SKIPPED,SKIPPED,,,,,,,,,A
144529,STUDY DRUG B,28,5.5,5.5,2,1,2,Missing,Missing,Missing,2:No,2:No,,,,OTHER,OTHER,,,,,,,,,,,,,,,,,,,SKIPPED,SKIPPED,,,,,,,,,A
144529,STUDY DRUG B,20,5,5,2,1,2,Missing,Missing,Missing,1:Yes,1:Yes,,,,SKIPPED,SKIPPED,,,,12.5,12.5,,,,200,200,,,,9,135,,,,SKIPPED,SKIPPED,,,,,,,,,A
144529,STUDY DRUG B,23,5.1,5.2,2,1,2,Missing,Missing,Missing,1:Yes,1:Yes,,,,SKIPPED,SKIPPED,,,,12.5,12.5,,,,200,200,,,,6,95,,,,SKIPPED,SKIPPED,,,,,,,,,A
144529,STUDY DRUG B,18,4.8,4.9,2,1,2,Missing,Missing,Missing,1:Yes,1:Yes,,,,SKIPPED,SKIPPED,,,,12.5,12.5,,,,200,200,,,,9,110,,,,SKIPPED,SKIPPED,,,,,,,,,A