random_ID,FORM_REASON,STUDYDRUG_B,DRUGPHASE_B,RX_AGE_214,ORIG_SITE,LASTSEEN_AGE,TRANS_SITE_B,MAS_CONSENT,GEN_CONSENT,BLOODDRAWN,STUDYDRUG_C,DRUGPHASE_C,TRANS_SITE_C,TRANS_CONS_AGE,MAS_PARTICIP,MAS_CONS_AGE,GEN_PARTICIP,GEN_CONS_AGE,VER_ID
144558,Subject ending study follow-up at this site,STUDY DRUG B,MAINTENANCE,5,1,4.3,83,,YES,YES,S,S,,,S,,S,,A
144558,Subject beginning study follow-up at this site,S,S,,,,,S,S,S,STUDY DRUG B,MAINTENANCE,83,5.3,,,,,A
144708,Subject ending study follow-up at this site,STUDY DRUG B,MAINTENANCE,13,71,12.7,15,NO,YES,YES,S,S,,,S,,S,,A
144708,Subject beginning study follow-up at this site,S,S,,,,,S,S,S,STUDY DRUG B,MAINTENANCE,15,13.2,NO,,NO,,A
144739,Subject ending study follow-up at this site,STUDY DRUG B,MAINTENANCE,11.8,65,11.5,4,NO,NO,S,S,S,,,S,,S,,A
144739,Subject beginning study follow-up at this site,S,S,,,,,S,S,S,STUDY DRUG B,MAINTENANCE,4,11.9,NO,,NO,,A
144740,Subject ending study follow-up at this site,STUDY DRUG A,MAINTENANCE,16.9,13,16.6,83,NO,NO,S,S,S,,,S,,S,,A
144740,Subject beginning study follow-up at this site,S,S,,,,,S,S,S,STUDY DRUG A,MAINTENANCE,83,17.9,NO,,NO,,A
144741,Subject ending study follow-up at this site,STUDY DRUG B,MAINTENANCE,11.3,17,10.4,36,NO,NO,S,S,S,,,S,,S,,A
144741,Subject beginning study follow-up at this site,S,S,,,,,S,S,S,STUDY DRUG B,MAINTENANCE,36,11.4,NO,,YES,11.4,A
144769,Subject ending study follow-up at this site,STUDY DRUG B,MAINTENANCE,13.7,17,12.9,36,NO,NO,S,S,S,,,S,,S,,A
144769,Subject beginning study follow-up at this site,S,S,,,,,S,S,S,STUDY DRUG B,MAINTENANCE,36,14,NO,,YES,14,A
144854,Subject ending study follow-up at this site,STUDY DRUG A,MAINTENANCE,10.7,36,9.7,96,YES,YES,YES,S,S,,,S,,S,,A
144854,Subject beginning study follow-up at this site,S,S,,,,,S,S,S,STUDY DRUG A,MAINTENANCE,96,10.8,,,,,A
144855,Subject ending study follow-up at this site,STUDY DRUG A,MAINTENANCE,11.4,1,10.6,54,NO,YES,YES,S,S,,,S,,S,,A
144855,Subject beginning study follow-up at this site,S,S,,,,,S,S,S,STUDY DRUG A,MAINTENANCE,54,11.7,,,,,A
145060,Subject ending study follow-up at this site,STUDY DRUG A,MAINTENANCE,8.8,1,8.5,65,NO,NO,S,S,S,,,S,,S,,A
145060,Subject beginning study follow-up at this site,S,S,,,,,S,S,S,STUDY DRUG A,MAINTENANCE,65,9,,,,,A
145142,Subject ending study follow-up at this site,STUDY DRUG A,MAINTENANCE,27,83,27,54,NO,NO,S,S,S,,,S,,S,,A
145142,Subject beginning study follow-up at this site,S,S,,,,,S,S,S,STUDY DRUG A,MAINTENANCE,54,27.2,NO,,NO,,A
145302,Subject ending study follow-up at this site,STUDY DRUG A,MAINTENANCE,16.8,13,16.4,83,,,S,S,S,,,S,,S,,A
145302,Subject beginning study follow-up at this site,S,S,,,,,S,S,S,STUDY DRUG A,MAINTENANCE,83,16.8,,,,,A
145411,Subject ending study follow-up at this site,STUDY DRUG B,MAINTENANCE,7.1,1,6.4,83,,NO,S,S,S,,,S,,S,,A
145411,Subject beginning study follow-up at this site,S,S,,,,,S,S,S,STUDY DRUG B,MAINTENANCE,83,7.3,,,,,A
145838,Subject ending study follow-up at this site,STUDY DRUG A,MAINTENANCE,15.1,96,14.7,52,,,S,S,S,,,S,,S,,A
145838,Subject ending study follow-up at this site,STUDY DRUG A,MAINTENANCE,15.8,52,15.8,96,NO,NO,S,S,S,,,S,,S,,A
145838,Subject beginning study follow-up at this site,S,S,,,,,S,S,S,STUDY DRUG A,MAINTENANCE,52,15.2,,,,,A
145838,Subject beginning study follow-up at this site,S,S,,,,,S,S,S,STUDY DRUG A,MAINTENANCE,96,16.6,,,,,A
