random_ID,READ_AGE,VISIT,ACCEPTABLE,CGENDER,AGE_ECHO,WT_ECHO,WT_Z,HT_ECHO,HT_Z,BSA,SBP_ECHO,DBP_ECHO,MBP_ECHO,HR_ECHO,CAVAMIN1,CAVAMAX1,CAVAMIN2,CAVAMAX2,CAVAMIN3,CAVAMAX3,CAVAMINAV,CAVAMAXAV,CAVAZ,CASVMIN1,CASVMAX1,CASVMIN2,CASVMAX2,CASVMIN3,CASVMAX3,CASVMINAV,CASVMAXAV,CASVZ,CSTJCTMIN1,CSTJCTMAX1,CSTJCTMIN2,CSTJCTMAX2,CSTJCTMIN3,CSTJCTMAX3,CSTJCTMINAV,CSTJCTMAXAV,CSTJCTZ,CAAOMIN1,CAAOMAX1,CAAOMIN2,CAAOMAX2,CAAOMIN3,CAAOMAX3,CAAOMINAV,CAAOMAXAV,CAAOZ,CDAO,CMPA,CMPAZ,CAVRSV,CAOPLAXJ1W,CAOPSAXJ1W,CAOREGURGJ1A,CAOREGURGJ2,CAOPLAXJ2W,CAOPSAXJ2W,CAOREGURGJ2A,CAOREGURGTOT,CAOREGTOTIND,CPROXFLOW,CPROXFLOWREV,CPROXPERFLOW,CDISTFLOW,CDISTFLOWREV,CDISTPERFLOW,IMGQUAL,echopurp,VER_ID
144508,16.5,BASELINE,1:Yes,1:Male,15.98,91.50,2.02,192.00,2.63,2.21,121,71,85,70,2.65,2.80,2.70,2.93,2.53,2.88,2.627,2.870,2.33,4.84,5.07,4.95,5.02,4.97,5.05,4.920,5.047,5.49,3.03,3.38,3.15,3.48,3.02,3.42,3.067,3.427,2.36,2.61,3.11,2.64,3.09,2.65,3.13,2.633,3.110,0.88,1.98,3.43,2.42,None,,,,-2,,,,,,736,127,17.2,792,0,0.0,Excellent,Regular echo read,B
144508,16.8,STUDY VISIT 1 (Month 6),1:Yes,1:Male,16.49,94.00,2.01,193.50,2.71,2.25,105,63,75,64,2.41,3.15,2.76,3.02,2.67,3.43,2.613,3.200,3.62,4.85,5.01,4.64,5.15,4.72,4.96,4.737,5.040,5.32,3.10,3.63,3.23,3.48,2.93,3.43,3.087,3.513,2.52,2.65,2.94,2.55,3.02,2.56,3.06,2.587,3.007,0.50,1.74,3.15,1.61,None,,,,-2,,,,,,613,188,30.7,544,0,0.0,Good,Regular echo read,B
144508,17.3,STUDY VISIT 2 (Month 12),1:Yes,1:Male,16.97,92.80,1.85,196.00,2.98,2.25,112,58,75,80,2.55,2.85,2.42,2.88,2.39,2.66,2.453,2.797,1.91,4.97,4.98,4.82,5.01,4.96,5.03,4.917,5.007,5.25,3.43,3.62,3.50,3.91,3.31,3.74,3.413,3.757,3.27,2.65,3.04,2.60,3.02,2.56,3.12,2.603,3.060,0.66,1.84,3.16,1.65,Trivial,,,,-2,,,,,,555,159,28.7,492,0,0.0,Good,Regular echo read,B
144511,8.9,BASELINE,1:Yes,1:Male,8.42,31.40,0.87,144.90,2.34,1.11,93,53,67,80,1.97,2.23,1.96,2.19,1.95,2.38,1.960,2.267,4.16,3.00,3.17,3.05,3.10,3.03,3.17,3.027,3.147,4.21,2.17,2.25,2.14,2.27,2.09,2.26,2.133,2.260,1.88,1.88,2.29,1.98,2.15,1.91,2.20,1.923,2.213,1.05,1.26,1.84,0.29,None,,,,-2,,,,,,506,,,569,,,Good,Regular echo read,B
144511,10.9,STUDY VISIT 3 (Month 24),1:Yes,1:Male,10.55,55.70,2.05,163.40,3.13,1.59,95,58,72,75,1.89,2.35,1.89,2.22,1.94,2.23,1.907,2.267,1.59,3.15,3.25,3.12,3.23,3.00,3.23,3.090,3.237,2.21,2.12,2.38,2.09,2.49,2.18,2.39,2.130,2.420,0.67,2.02,2.21,1.99,2.33,2.02,2.25,2.010,2.263,,0.85,2.15,0.12,None,,,,-2,,,,,,503,101,20.2,532,,,Good,Regular echo read,B
144511,9.4,STUDY VISIT 1 (Month 6),1:Yes,1:Male,9.02,40.40,1.65,149.40,2.45,1.29,91,53,67,76,1.93,2.25,1.65,2.47,1.98,2.23,1.853,2.317,3.33,3.02,3.14,2.97,3.05,2.85,3.06,2.947,3.083,2.93,2.23,2.33,2.08,2.44,2.04,2.31,2.117,2.360,1.51,1.92,2.15,2.03,2.31,1.96,2.19,1.970,2.217,0.36,,,,None,,,,-2,,,,,,574,,,704,63,9.0,Good,Regular echo read,B
144511,11.7,STUDY VISIT 4 (Month 36),1:Yes,1:Male,11.57,63.30,2.07,173.20,3.53,1.74,93,56,68,69,2.02,2.37,1.66,2.11,1.75,2.15,1.810,2.210,0.73,3.05,3.21,3.04,3.26,2.82,3.26,2.970,3.243,1.70,2.11,2.40,2.09,2.54,2.12,2.50,2.107,2.480,0.46,1.94,2.37,1.87,2.38,2.11,2.35,1.973,2.367,,1.63,,,None,,,,-2,,,,,,544,,,527,0,0.0,Good,Regular echo read,B
144511,9.9,STUDY VISIT 2 (Month 12),1:Yes,1:Male,9.55,47.40,1.97,155.00,2.82,1.43,94,55,69,73,2.04,2.42,2.00,2.49,2.24,2.41,2.093,2.440,3.31,2.97,3.21,3.02,3.34,3.13,3.17,3.040,3.240,2.89,2.22,2.55,2.23,2.49,2.29,2.59,2.247,2.543,1.74,2.16,2.39,2.06,2.42,2.09,2.38,2.103,2.397,0.60,,1.60,,None,,,,-2,,,,,,575,,,603,51,8.4,Good,Regular echo read,B
144515,12,BASELINE,1:Yes,1:Male,11.65,43.10,0.53,170.00,3.05,1.41,88,53,66,64,1.89,2.35,1.97,2.32,2.26,2.39,2.040,2.353,2.91,3.94,4.14,3.84,3.99,3.95,4.05,3.910,4.060,6.08,2.63,2.84,2.70,2.72,2.62,2.71,2.650,2.757,2.73,,,,,,,,,,1.31,2.97,3.51,None,,,,-2,,,,,,,,,652,21,3.2,Good,Regular echo read,B
144515,15.1,WITHDRAWAL FROM TRIAL,1:Yes,1:Male,14.20,57.70,0.52,190.50,3.33,1.72,96,61,,69,2.12,2.85,2.36,2.54,2.12,2.42,2.200,2.603,2.82,4.45,4.63,4.36,4.70,4.27,4.75,4.360,4.693,6.57,3.11,3.25,3.16,3.24,3.12,3.27,3.130,3.253,3.37,2.27,2.90,,2.89,,2.97,2.270,2.920,1.54,,3.20,3.11,Trivial,,,,-2,,,,,,,,,,,,Fair,Regular echo read,B
144515,12.9,STUDY VISIT 2 (Month 12),1:Yes,1:Male,12.61,49.80,0.64,177.80,3.08,1.55,97,54,72,65,1.96,2.53,2.31,2.49,1.86,2.66,2.043,2.560,3.38,4.18,4.24,4.12,4.25,4.03,4.27,4.110,4.253,5.99,2.87,2.96,2.83,3.05,2.78,2.97,2.827,2.993,3.09,2.30,2.67,2.24,2.71,2.29,2.69,2.277,2.690,1.29,1.46,2.85,2.56,None,,,,-2,,,,,,626,,,718,0,0.0,Good,Regular echo read,B
144515,13.9,STUDY VISIT 3 (Month 24),1:Yes,1:Male,13.64,57.60,0.80,187.00,3.32,1.71,97,53,71,73,2.26,2.76,2.36,2.81,2.15,2.36,2.257,2.643,3.09,4.25,4.36,4.26,4.32,4.17,4.49,4.227,4.390,5.64,2.51,2.95,2.66,3.08,2.82,2.91,2.663,2.980,2.41,2.24,2.69,,2.66,,2.65,2.240,2.667,0.72,1.52,2.75,1.75,None,,,,-2,,,,,,478,,,444,0,0.0,Good,Regular echo read,B
144515,14,STUDY VISIT 3 (Month 24),1:Yes,1:Male,13.64,57.60,0.80,187.00,3.32,1.71,97,53,71,73,2.35,2.65,2.32,2.73,2.32,2.71,2.330,2.697,3.37,4.27,4.48,4.29,4.47,4.24,4.47,4.267,4.473,5.91,2.58,2.59,2.61,2.81,2.23,2.95,2.473,2.783,1.68,2.69,2.71,2.29,2.72,2.17,2.66,2.383,2.697,0.82,1.48,2.89,2.19,Trivial,,,,-2,,,,,,497,,,454,0,0.0,Good,Repeat QC echo read,B
144515,12.5,STUDY VISIT 1 (Month 6),1:Yes,1:Male,12.18,48.60,0.75,172.80,2.86,1.51,100,60,72,68,2.24,2.29,2.26,2.40,2.22,2.49,2.240,2.393,2.63,3.92,4.12,4.06,4.07,3.89,4.09,3.957,4.093,5.62,2.54,3.02,2.54,2.92,2.71,2.86,2.597,2.933,3.01,2.41,2.75,2.42,2.70,2.46,2.77,2.430,2.740,1.60,1.57,3.06,3.41,None,,,,-2,,,,,,615,,,541,0,0.0,Good,Regular echo read,B
144517,19.6,BASELINE,1:Yes,1:Male,19.40,46.00,-3.22,178.60,0.27,1.49,102,64,81,52,2.11,2.52,2.04,2.49,1.59,2.40,1.913,2.470,3.19,3.87,4.14,3.72,4.19,3.71,4.09,3.767,4.140,5.93,2.75,3.20,2.88,3.16,2.71,3.10,2.780,3.153,4.02,2.23,2.50,2.01,2.55,1.99,2.44,2.077,2.497,0.78,1.60,2.33,0.99,None,,,,-2,,,,,,734,127,17.3,813,0,0.0,Good,Regular echo read,B
144517,22.8,STUDY VISIT 4 (Month 36),1:Yes,1:Male,22.48,46.80,,179.10,,1.50,98,63,78,50,2.67,2.81,2.09,2.41,2.06,2.83,2.273,2.683,4.31,4.22,4.70,4.26,4.87,4.24,4.69,4.240,4.753,8.06,2.61,2.95,2.88,3.24,3.10,3.20,2.863,3.130,3.85,2.26,2.47,2.16,2.55,2.12,2.69,2.180,2.570,1.00,1.13,2.29,0.80,Trivial,,,,-2,,,,,,844,,,828,,,Good,Regular echo read,B
144517,21.9,STUDY VISIT 3 (Month 24),1:Yes,1:Male,21.43,49.50,,178.80,,1.55,94,63,77,59,2.04,2.53,2.17,2.44,2.17,2.36,2.127,2.443,2.74,3.97,4.15,3.61,4.32,3.82,4.34,3.800,4.270,6.05,2.60,2.79,2.68,2.91,2.77,2.83,2.683,2.843,2.49,2.32,2.54,2.30,2.78,2.34,2.71,2.320,2.677,1.24,1.09,2.34,0.85,Trivial,,,,-2,,,,,,739,,,792,0,0.0,Good,Regular echo read,B
144517,20.1,STUDY VISIT 1 (Month 6),1:Yes,1:Male,19.95,46.30,-3.19,178.30,0.20,1.49,94,56,72,59,2.10,2.77,1.81,2.28,1.96,2.28,1.957,2.443,3.01,3.94,4.27,3.79,4.04,3.90,4.09,3.877,4.133,5.87,2.61,2.88,2.61,2.94,2.49,2.74,2.570,2.853,2.77,,2.45,,2.62,,2.44,,2.503,0.79,1.33,1.99,,None,,,,-2,,,,,,628,,,549,0,0.0,Good,Regular echo read,B
144517,21.3,STUDY VISIT 2 (Month 12),1:Yes,1:Male,20.45,45.90,,179.10,,1.49,102,64,81,53,1.82,2.94,2.07,2.91,2.25,2.64,2.047,2.830,5.23,3.92,4.30,4.04,4.46,3.52,4.36,3.827,4.373,6.78,2.37,2.67,2.49,2.87,2.44,2.86,2.433,2.800,2.57,,,,,,,,,,0.99,2.16,0.40,Trivial,,,,-2,,,,,,675,,,665,0,0.0,Good,Regular echo read,B
144519,25.7,STUDY VISIT 2 (Month 12),1:Yes,1:Male,24.90,128.30,,208.40,,2.74,113,61,77,66,2.38,2.91,2.51,3.12,2.44,3.45,2.443,3.160,2.08,4.26,4.68,4.32,4.75,3.89,4.64,4.157,4.690,3.01,3.38,3.71,3.16,3.60,3.40,3.56,3.313,3.623,1.72,3.29,3.55,3.15,3.54,3.35,3.63,3.263,3.573,1.10,2.06,2.33,,None,,,,-2,,,,,,615,,,588,0,0.0,Good,Regular echo read,B
144519,27.5,STUDY VISIT 4 (Month 36),1:Yes,1:Male,27.02,121.20,,206.40,,2.65,147,75,75,98,2.51,3.15,2.13,3.39,2.03,2.81,2.223,3.117,2.14,4.53,4.81,4.39,4.72,4.21,4.78,4.377,4.770,3.42,3.33,3.84,3.61,3.85,3.58,3.83,3.507,3.840,2.48,3.38,3.83,3.53,3.69,3.43,3.84,3.447,3.787,1.82,2.18,1.90,,None,,,,-2,,,,,,584,,,566,0,0.0,Good,Regular echo read,B
144519,24.3,BASELINE,1:Yes,1:Male,23.85,121.70,,208.10,,2.66,145,76,98,73,2.11,3.12,2.59,3.49,2.45,3.37,2.383,3.327,2.90,3.82,4.80,4.44,4.86,4.53,4.83,4.263,4.830,3.53,3.41,3.60,3.44,3.62,3.54,3.61,3.463,3.610,1.84,3.49,3.60,3.47,3.67,3.61,3.78,3.523,3.683,1.52,,3.43,1.55,None,,,,-2,,,,,,541,,,595,,,Good,Regular echo read,B
144519,24.7,STUDY VISIT 1 (Month 6),1:Yes,1:Male,24.37,124.60,,208.50,,2.70,140,79,99,66,2.65,3.35,2.52,3.47,2.63,3.20,2.600,3.340,2.86,4.56,4.93,4.63,4.93,4.59,4.82,4.593,4.893,3.59,2.75,3.86,2.94,3.69,3.16,3.49,2.950,3.680,1.96,3.19,3.37,3.12,3.66,3.03,3.56,3.113,3.530,1.07,1.95,3.01,0.56,None,,,,-2,,,,,,581,0,0.0,676,0,0.0,Good,Regular echo read,B
144519,26.4,STUDY VISIT 3 (Month 24),1:Yes,1:Male,25.93,123.70,,206.40,,2.68,120,75,90,65,2.35,3.21,2.24,2.74,2.24,2.84,2.277,2.930,1.37,4.16,4.78,4.33,4.73,4.46,4.80,4.317,4.770,3.35,3.42,3.49,3.10,3.53,3.17,3.68,3.230,3.567,1.70,3.22,3.43,3.03,3.57,3.00,3.62,3.083,3.540,1.13,2.02,3.52,1.73,None,,,,-2,,,,,,547,,,656,0,0.0,Good,Regular echo read,B
144520,6.4,STUDY VISIT 2 (Month 12),1:Yes,1:Male,6.13,23.10,0.66,127.80,2.30,0.90,89,53,69,66,1.38,1.47,1.43,1.79,1.45,1.57,1.420,1.610,0.95,2.79,2.88,2.63,2.81,2.76,2.93,2.727,2.873,4.47,2.18,2.41,2.22,2.45,2.26,2.40,2.220,2.420,4.15,1.81,2.19,2.03,2.23,2.01,2.30,1.950,2.240,2.30,1.18,2.44,4.03,None,,,,-2,,,,,,526,0,0.0,505,0,0.0,Good,Regular echo read,B
144520,8.4,STUDY VISIT 4 (Month 36),1:Yes,1:Male,8.17,27.90,0.38,141.60,2.08,1.04,79,47,61,61,1.59,1.79,1.49,1.87,1.57,2.01,1.550,1.890,2.09,2.88,3.22,2.94,3.13,2.93,3.27,2.917,3.207,5.01,2.44,2.54,2.33,2.63,2.25,2.63,2.340,2.600,4.10,2.15,2.34,2.00,2.32,1.90,2.38,2.017,2.347,2.02,1.23,2.29,2.54,None,,,,-2,,,,,,834,,,701,0,0.0,Good,Regular echo read,B
144520,7.4,STUDY VISIT 3 (Month 24),1:Yes,1:Male,7.09,25.30,0.51,134.00,2.08,0.96,85,52,66,63,1.40,1.89,1.54,2.02,1.42,1.56,1.453,1.823,2.11,2.95,3.06,2.80,3.08,2.86,3.06,2.870,3.067,4.91,2.35,2.52,2.30,2.51,2.31,2.71,2.320,2.580,4.54,2.20,2.35,2.30,2.39,2.13,2.46,2.210,2.400,2.68,1.29,2.25,2.76,None,,,,-2,,,,,,513,83,16.3,534,79,14.8,Good,Regular echo read,B
144520,5.5,BASELINE,1:Yes,1:Male,5.08,20.60,0.79,118.80,2.09,0.82,82,56,65,71,1.40,1.57,1.42,1.84,1.37,1.73,1.397,1.713,2.34,2.77,2.97,2.55,2.85,2.71,3.04,2.677,2.953,5.54,2.23,2.34,2.19,2.53,2.14,2.40,2.187,2.423,4.84,1.82,2.05,1.80,2.08,1.91,2.25,1.843,2.127,2.23,1.05,2.53,5.04,None,,,,-2,,,,,,471,,,517,33,6.5,Good,Regular echo read,B
144520,6,STUDY VISIT 1 (Month 6),1:Yes,1:Male,5.62,21.60,0.61,122.20,1.91,0.85,84,47,63,77,1.54,1.74,1.61,1.67,1.61,1.72,1.587,1.710,2.07,2.78,2.87,2.72,2.90,2.65,2.93,2.717,2.900,5.00,2.24,2.56,2.23,2.40,2.22,2.45,2.230,2.470,4.83,1.93,2.11,1.84,2.21,1.85,2.17,1.873,2.163,2.21,1.35,2.83,6.26,None,,,,-2,,,,,,563,88,15.6,742,46,6.2,Good,Regular echo read,B
144525,4.9,STUDY VISIT 3 (Month 24),1:Yes,2:Female,3.56,18.00,1.36,110.10,2.88,0.74,103,45,57,97,1.32,1.62,1.37,1.57,1.30,1.57,1.330,1.587,2.00,1.81,2.19,1.85,2.21,1.76,2.16,1.807,2.187,2.20,1.38,1.72,1.48,1.71,1.33,1.66,1.397,1.697,1.03,1.28,1.66,1.36,1.64,1.23,1.72,1.290,1.673,0.41,,1.57,0.67,None,,,,-2,,,,,,532,,,,,,Good,Regular echo read,B
144525,2.7,STUDY VISIT 2 (Month 12),1:Yes,2:Female,2.55,15.00,1.16,98.90,2.25,0.64,114,53,78,96,1.16,1.51,1.00,1.40,1.29,1.55,1.150,1.487,2.06,1.72,2.08,1.71,2.06,1.76,2.09,1.730,2.077,2.41,1.29,1.61,1.31,1.58,1.31,1.58,1.303,1.590,1.09,1.13,1.60,1.14,1.59,1.19,1.60,1.153,1.597,0.64,0.69,1.67,1.83,None,,,,-2,,,,,,,,,394,,,Good,Regular echo read,B
144525,2.3,STUDY VISIT 1 (Month 6),1:Yes,2:Female,1.99,13.40,1.01,91.00,1.63,0.59,103,52,68,118,1.25,1.30,1.21,1.41,1.38,1.54,1.280,1.417,2.02,1.84,2.05,1.81,2.08,1.83,2.04,1.827,2.057,2.83,1.29,1.63,1.28,1.67,1.24,1.66,1.270,1.653,2.05,1.29,1.57,1.28,1.53,1.27,1.40,1.280,1.500,0.51,0.83,1.59,1.80,None,,,,-2,,,,,,313,,,321,184,57.1,Good,Regular echo read,B
144525,1.7,BASELINE,1:Yes,2:Female,1.49,11.20,0.27,83.50,1.17,0.51,102,52,68,125,1.34,1.47,1.32,1.47,1.22,1.47,1.293,1.470,3.39,1.69,1.83,1.59,1.79,1.61,1.85,1.630,1.823,2.15,1.30,1.53,1.35,1.43,1.24,1.49,1.297,1.483,1.55,1.32,1.43,1.26,1.39,1.18,1.43,1.253,1.417,0.60,0.82,1.33,0.80,None,,,,-2,,,,,,300,196,65.3,346,,,Good,Regular echo read,B
144525,5.4,STUDY VISIT 4 (Month 36),1:Yes,2:Female,4.49,21.40,1.56,118.50,3.03,0.84,88,53,68,79,1.43,1.63,1.50,1.64,1.43,1.84,1.453,1.703,2.13,2.02,2.45,2.03,2.44,2.00,2.31,2.017,2.400,2.58,1.57,1.88,1.63,1.90,1.41,1.69,1.537,1.823,1.13,1.39,1.75,1.37,1.81,1.41,1.71,1.390,1.757,0.28,1.06,1.59,0.27,None,,,,-2,,,,,,515,,,,77,,Good,Regular echo read,B
144527,12.2,STUDY VISIT 1 (Month 6),1:Yes,1:Male,11.84,48.00,0.88,159.70,1.51,1.45,105,63,80,83,1.86,2.54,1.90,2.15,2.05,2.19,1.937,2.293,2.32,3.33,3.37,3.30,3.35,3.20,3.39,3.277,3.370,3.25,2.76,2.77,2.67,2.82,2.62,2.78,2.683,2.790,2.66,2.50,2.89,2.38,2.88,2.44,2.76,2.440,2.843,2.19,1.49,2.98,3.35,None,,,,-2,,,,,,588,74,12.6,652,0,0.0,Good,Regular echo read,B
144527,14.6,STUDY VISIT 4 (Month 36),1:Yes,1:Male,14.41,58.20,0.48,181.10,1.91,1.70,107,68,74,67,2.34,2.72,2.18,2.68,2.22,2.73,2.247,2.710,3.49,3.70,3.81,3.57,3.76,3.48,3.82,3.583,3.797,3.71,3.00,3.08,2.96,3.18,2.93,3.08,2.963,3.113,2.95,2.60,2.88,2.56,2.88,2.52,2.81,2.560,2.857,1.41,1.93,2.42,0.74,None,,,,-2,,,,,,676,,,665,0,0.0,Good,Regular echo read,B
144527,12.6,STUDY VISIT 2 (Month 12),1:Yes,1:Male,12.36,50.80,0.86,164.00,1.61,1.52,113,78,89,74,1.90,2.17,1.97,2.41,1.90,2.02,1.923,2.200,1.52,3.36,3.49,3.29,3.54,3.32,3.45,3.323,3.493,3.43,2.74,2.79,2.72,3.04,2.74,3.01,2.733,2.947,3.04,2.63,2.95,2.68,2.90,2.72,3.01,2.677,2.953,2.36,1.31,,,None,,,,-2,,,,,,730,122,16.7,531,0,0.0,Good,Regular echo read,B
144527,13.7,STUDY VISIT 3 (Month 24),1:Yes,1:Male,13.38,54.00,0.62,175.00,2.01,1.61,101,66,73,65,2.04,2.26,2.20,2.47,2.12,2.38,2.120,2.370,2.08,3.52,3.70,3.60,3.72,3.60,3.68,3.573,3.700,3.76,2.75,3.25,2.91,3.06,2.82,3.05,2.827,3.120,3.34,2.71,3.04,2.63,2.98,2.57,2.92,2.637,2.980,2.13,1.46,2.76,2.07,None,,,,-2,,,,,,720,132,18.3,662,0,0.0,Good,Regular echo read,B
144527,11.7,BASELINE,1:Yes,1:Male,11.30,42.10,0.61,157.30,1.68,1.35,83,63,68,58,2.06,2.24,2.17,2.37,2.07,2.24,2.100,2.283,2.81,3.43,3.49,3.47,3.48,3.39,3.52,3.430,3.497,4.27,2.78,2.97,2.73,2.96,2.73,2.90,2.747,2.943,3.83,2.64,2.89,2.65,2.97,2.64,2.96,2.643,2.940,3.01,1.72,2.96,3.74,None,,,,-2,,,,,,,,,673,51,7.5,Good,Regular echo read,A
144529,3.8,BASELINE,1:Yes,2:Female,3.64,19.90,1.89,112.00,3.15,0.79,76,49,57,95,1.31,1.48,1.34,1.63,1.37,1.79,1.340,1.633,1.98,2.29,2.47,2.36,2.43,2.14,2.39,2.263,2.430,3.12,1.84,1.86,1.76,2.00,1.69,2.01,1.763,1.957,2.30,1.64,1.92,1.65,1.97,1.47,1.90,1.587,1.930,1.45,,2.17,3.47,None,,,,-2,,,,,,291,,,351,0,0.0,Good,Regular echo read,B
144529,6.3,STUDY VISIT 3 (Month 24),1:Yes,2:Female,5.60,25.40,1.57,125.00,2.42,0.94,70,41,51,80,1.43,1.83,1.58,1.94,1.56,1.91,1.523,1.893,2.80,2.36,2.69,2.50,2.70,2.48,2.76,2.447,2.717,3.43,1.94,2.14,2.02,2.26,1.93,2.24,1.963,2.213,2.69,1.75,2.12,1.81,2.15,1.86,2.15,1.807,2.140,1.59,1.18,2.34,3.31,None,,,,-2,,,,,,312,,,317,0,0.0,Good,Regular echo read,B
144529,7.1,STUDY VISIT 4 (Month 36),1:Yes,2:Female,6.58,28.00,1.43,132.80,2.50,1.01,71,44,55,87,1.59,1.80,1.68,1.77,1.47,1.95,1.580,1.840,1.89,2.52,2.81,2.58,2.90,2.62,2.89,2.573,2.867,3.62,2.02,2.31,1.65,2.39,1.98,2.38,1.883,2.360,3.00,1.85,2.17,1.78,2.18,1.76,2.15,1.797,2.167,1.33,1.11,2.36,2.98,None,,,,-2,,,,,,325,,,531,0,0.0,Good,Regular echo read,B
144529,5,STUDY VISIT 2 (Month 12),1:Yes,2:Female,4.68,22.30,1.58,118.00,2.52,0.85,73,47,56,92,1.52,1.84,1.43,1.79,1.50,1.81,1.483,1.813,2.85,2.42,2.64,2.43,2.64,2.40,2.60,2.417,2.627,3.60,1.85,2.22,1.86,2.14,1.92,2.20,1.877,2.187,3.15,1.70,2.04,1.66,1.99,1.64,2.09,1.667,2.040,1.59,0.91,2.17,3.02,None,,,,-2,,,,,,346,103,29.8,317,0,0.0,Good,Repeat QC echo read,B
144529,4.9,STUDY VISIT 2 (Month 12),1:Yes,2:Female,4.68,22.30,1.58,118.00,2.52,0.85,73,47,56,92,1.51,1.74,1.45,1.92,1.38,1.79,1.447,1.817,2.88,2.41,2.56,2.33,2.58,2.47,2.57,2.403,2.570,3.31,1.90,2.21,1.88,2.08,1.87,1.99,1.883,2.093,2.60,1.68,1.96,1.66,2.05,1.73,2.10,1.690,2.037,1.57,0.91,2.19,3.12,None,,,,-2,,,,,,335,61,18.1,312,0,0.0,Good,Regular echo read,B
144529,4.6,STUDY VISIT 1 (Month 6),1:Yes,2:Female,4.22,21.00,1.66,114.00,2.55,0.82,77,51,59,94,1.40,1.71,1.42,1.60,1.51,1.67,1.443,1.660,1.95,2.37,2.55,2.39,2.48,2.34,2.54,2.367,2.523,3.37,1.91,2.16,1.84,2.06,1.88,2.04,1.877,2.087,2.86,1.74,2.03,1.79,2.03,1.70,1.96,1.743,2.007,1.66,,2.14,3.12,None,,,,-2,,,,,,333,92,27.8,412,0,0.0,Good,Regular echo read,B
144530,6.7,BASELINE,1:Yes,1:Male,6.59,23.30,0.34,130.00,2.01,0.91,81,54,65,90,1.51,1.80,1.48,1.71,1.58,1.77,1.523,1.760,2.02,2.47,2.63,2.55,2.66,2.18,2.63,2.400,2.640,3.26,1.71,2.01,1.72,1.96,1.74,2.13,1.723,2.033,1.88,1.67,1.95,1.57,2.00,1.61,1.95,1.617,1.967,0.93,1.11,1.64,0.19,None,,,,-2,,,,,,388,,,421,0,0.0,Good,Regular echo read,B
144530,10.1,STUDY VISIT 4 (Month 36),1:Yes,1:Male,9.60,29.70,-0.18,148.00,1.71,1.09,77,51,61,86,1.39,1.60,1.43,1.86,1.44,1.87,1.420,1.777,0.97,2.57,2.85,2.49,2.91,2.52,2.77,2.527,2.843,3.02,1.79,2.04,1.79,2.12,1.73,2.00,1.770,2.053,0.96,1.84,2.15,1.80,2.09,1.75,2.12,1.797,2.120,0.75,0.85,1.82,0.29,None,,,,-2,,,,,,418,,,340,0,0.0,Good,Regular echo read,B
144530,9.6,STUDY VISIT 3 (Month 24),1:Yes,1:Male,8.66,26.70,-0.17,144.00,2.03,1.02,89,59,71,86,1.47,1.67,1.41,1.78,1.59,1.75,1.490,1.733,1.08,2.60,2.86,2.59,2.77,2.61,2.81,2.600,2.813,3.33,1.46,1.88,1.69,2.07,1.66,1.87,1.603,1.940,0.74,1.48,1.91,1.61,1.93,1.75,1.99,1.613,1.943,0.28,0.87,2.11,1.84,None,,,,-2,,,,,,418,104,24.8,410,,,Good,Regular echo read,B
144530,9.3,STUDY VISIT 3 (Month 24),1:Yes,1:Male,8.66,26.70,-0.17,144.00,2.03,1.02,89,59,71,86,1.49,1.74,1.52,1.73,1.45,1.86,1.487,1.777,1.40,2.66,2.84,2.57,2.83,2.59,2.72,2.607,2.797,3.26,1.50,1.99,1.46,2.05,1.65,1.84,1.537,1.960,0.84,1.37,1.88,1.39,1.90,1.46,1.73,1.407,1.837,,1.05,2.36,2.94,None,,,,-2,,,,,,429,,,396,0,0.0,Good,Repeat QC echo read,B
144530,7.3,STUDY VISIT 1 (Month 6),1:Yes,1:Male,7.07,24.30,0.32,133.00,2.00,0.94,76,40,55,106,1.53,1.81,1.56,1.81,1.58,1.90,1.557,1.840,2.40,2.36,2.63,2.37,2.59,2.44,2.60,2.390,2.607,2.90,1.80,2.11,1.84,1.99,2.03,2.17,1.890,2.090,2.01,1.62,1.90,1.68,1.92,1.80,1.94,1.700,1.920,0.55,1.10,1.73,0.49,None,,,,-2,,,,,,333,,,303,22,7.3,Good,Regular echo read,B
144530,7.8,STUDY VISIT 2 (Month 12),1:Yes,1:Male,7.61,25.90,0.32,137.00,1.98,0.98,86,50,64,94,1.56,1.78,1.58,1.78,1.48,1.72,1.540,1.760,1.50,2.31,2.64,2.16,2.58,2.29,2.53,2.253,2.583,2.50,1.54,1.94,1.75,1.87,1.66,1.94,1.650,1.917,0.80,1.58,1.81,1.56,1.79,1.52,1.83,1.553,1.810,,1.13,1.64,,None,,,,-2,,,,,,355,,,348,0,0.0,Good,Regular echo read,B
144531,7.2,BASELINE,1:Yes,1:Male,6.83,23.80,0.36,129.40,1.67,0.92,99,55,66,79,1.49,1.77,1.61,1.84,1.53,1.90,1.543,1.837,2.53,2.59,2.83,2.65,2.84,2.70,2.83,2.647,2.833,4.13,1.89,2.10,1.60,2.25,2.06,2.24,1.850,2.197,2.74,1.87,1.94,1.79,2.25,1.94,2.11,1.867,2.100,1.52,1.11,2.09,2.26,None,,,,-2,,,,,,512,119,23.2,539,53,9.8,Good,Regular echo read,B
144531,7.3,BASELINE,1:Yes,1:Male,6.83,23.80,0.36,129.40,1.67,0.92,99,55,66,79,1.32,1.75,1.33,1.72,1.51,1.85,1.387,1.773,2.05,2.29,2.82,2.38,2.80,2.61,2.82,2.427,2.813,4.04,1.71,2.20,1.98,2.25,1.93,2.24,1.873,2.230,2.93,1.84,2.17,1.84,2.13,1.79,2.08,1.823,2.127,1.64,1.13,2.08,2.22,None,,,,-2,,,,,,497,127,25.5,541,50,9.3,Good,Repeat QC echo read,B
144531,8.1,STUDY VISIT 2 (Month 12),1:Yes,1:Male,7.88,27.40,0.49,136.70,1.64,1.01,82,43,54,77,1.71,2.08,1.72,2.06,1.75,1.99,1.727,2.043,3.34,2.64,2.96,2.46,2.96,2.63,2.96,2.577,2.960,4.05,1.98,2.05,1.60,2.32,1.84,2.15,1.807,2.173,2.01,1.86,2.09,1.80,2.11,1.83,2.07,1.830,2.090,0.98,1.06,2.19,2.22,None,,,,-2,,,,,,420,106,25.2,573,0,0.0,Good,Regular echo read,B
144531,10,STUDY VISIT 3 (Month 24),1:Yes,1:Male,8.79,28.90,0.21,142.00,1.55,1.06,79,44,54,78,1.38,1.58,1.55,1.76,1.68,1.89,1.537,1.743,0.93,2.64,2.95,2.65,2.89,2.66,2.86,2.650,2.900,3.48,2.02,2.23,1.92,2.32,1.94,2.16,1.960,2.237,2.08,1.99,2.11,1.95,2.29,1.89,2.23,1.943,2.210,1.30,0.87,2.29,2.44,None,,,,-2,,,,,,467,,,438,29,6.6,Good,Regular echo read,B
144531,10,STUDY VISIT 4 (Month 36),1:Yes,1:Male,9.90,33.90,0.40,149.00,1.65,1.17,81,46,56,63,1.43,2.01,1.69,2.14,1.59,2.12,1.570,2.090,2.58,2.60,3.07,2.81,3.08,2.64,3.09,2.683,3.080,3.55,2.15,2.46,2.17,2.49,2.08,2.48,2.133,2.477,2.63,2.05,2.49,2.11,2.49,2.07,2.59,2.077,2.523,2.11,1.30,2.61,3.20,None,,,,-2,,,,,,724,,,607,0,0.0,Good,Regular echo read,B
144531,7.5,STUDY VISIT 1 (Month 6),1:Yes,1:Male,7.33,25.60,0.47,133.10,1.71,0.97,96,51,66,99,1.68,2.04,1.64,1.84,1.66,1.99,1.660,1.957,3.06,2.73,2.84,2.61,2.79,2.66,2.81,2.667,2.813,3.69,,,,,,,,,,,,,,,,,,,1.20,1.95,1.37,None,,,,-2,,,,,,391,66,16.9,401,69,17.1,Good,Regular echo read,B
144533,7.3,BASELINE,1:Yes,1:Male,7.10,28.70,1.22,128.80,1.14,1.01,92,57,67,96,1.88,2.23,1.87,2.06,1.85,2.23,1.867,2.173,4.25,3.00,3.13,2.97,3.15,3.00,3.11,2.990,3.130,4.82,1.98,2.34,1.98,2.43,2.08,2.28,2.013,2.350,2.93,1.83,2.18,1.80,2.20,1.86,2.26,1.830,2.213,1.53,0.98,2.76,4.73,None,,,,-2,,,,,,301,,,296,0,0.0,Good,Regular echo read,B
144533,11,STUDY VISIT 4 (Month 36),1:Yes,1:Male,10.17,47.00,1.63,148.00,1.23,1.40,76,43,55,91,1.82,2.01,1.92,2.00,1.88,2.18,1.873,2.063,1.26,3.07,3.32,3.05,3.35,3.07,3.28,3.063,3.317,3.33,2.09,2.38,2.10,2.35,2.01,2.44,2.067,2.390,1.21,1.88,2.33,1.97,2.46,2.04,2.25,1.963,2.347,0.51,,2.58,2.16,None,,,,-2,,,,,,401,,,391,0,0.0,Good,Regular echo read,B
144533,8.5,STUDY VISIT 2 (Month 12),1:Yes,1:Male,8.12,35.50,1.62,136.00,1.25,1.16,77,45,55,83,2.04,2.37,2.04,2.39,1.92,2.28,2.000,2.347,4.36,2.88,3.17,2.79,3.24,2.79,3.18,2.820,3.197,4.13,2.05,2.38,2.10,2.36,2.12,2.36,2.090,2.367,2.16,1.90,2.26,1.92,2.21,1.99,2.21,1.937,2.227,0.91,1.23,2.50,2.82,None,,,,-2,,,,,,367,,,436,0,0.0,Good,Regular echo read,B
144533,7.9,STUDY VISIT 1 (Month 6),1:Yes,1:Male,7.66,33.40,1.65,133.00,1.29,1.11,80,50,59,86,1.97,2.05,1.82,2.00,1.87,2.05,1.887,2.033,2.57,2.80,3.08,2.86,2.99,2.90,3.07,2.853,3.047,3.77,1.99,2.28,1.91,2.10,2.06,2.30,1.987,2.227,1.72,1.98,2.17,1.91,2.18,2.01,2.17,1.967,2.173,0.88,0.89,2.27,2.09,None,,,,-2,,,,,,465,0,0.0,404,0,0.0,Good,Regular echo read,B
144533,9.3,STUDY VISIT 3 (Month 24),1:Yes,1:Male,9.12,41.00,1.66,142.00,1.24,1.28,84,54,64,82,1.90,2.19,1.93,2.22,1.70,2.15,1.843,2.187,2.61,3.01,3.25,2.70,3.14,3.13,3.28,2.947,3.223,3.57,2.16,2.41,2.22,2.43,2.09,2.51,2.157,2.450,1.99,2.02,2.34,2.13,2.34,2.12,2.42,2.090,2.367,1.02,1.26,2.52,2.39,None,,,,-2,,,,,,450,46,10.2,375,0,0.0,Good,Regular echo read,B
144534,15.1,STUDY VISIT 2 (Month 12),1:Yes,2:Female,13.46,54.00,0.62,178.00,2.85,1.62,97,52,55,60,1.77,2.28,1.77,2.26,1.85,2.34,1.797,2.293,1.62,3.47,3.75,3.37,3.79,3.43,3.67,3.423,3.737,3.84,2.50,2.72,2.36,2.82,2.49,2.76,2.450,2.767,1.93,1.93,2.48,1.92,2.36,2.00,2.22,1.950,2.353,,1.31,,,None,,,,-2,,,,,,584,,,525,0,0.0,Good,Repeat QC echo read,B
144534,14,STUDY VISIT 1 (Month 6),1:Yes,2:Female,13.01,55.80,0.90,175.00,2.59,1.64,105,55,69,59,1.81,1.88,1.92,2.23,1.89,2.11,1.873,2.073,0.37,3.16,3.56,3.54,3.82,3.50,3.55,3.400,3.643,3.43,2.38,2.47,2.11,2.62,2.32,2.39,2.270,2.493,0.81,2.19,2.56,2.15,2.45,2.10,2.39,2.147,2.467,0.23,1.42,,,None,,,,-2,,,,,,680,,,799,0,0.0,Good,Regular echo read,B
144534,14,STUDY VISIT 2 (Month 12),1:Yes,2:Female,13.46,54.00,0.62,178.00,2.85,1.62,97,52,55,60,1.56,2.14,1.67,1.77,1.60,2.24,1.610,2.050,0.31,3.38,3.68,3.37,3.66,3.38,3.58,3.377,3.640,3.50,2.41,2.58,2.54,2.63,2.43,2.73,2.460,2.647,1.46,1.89,2.20,1.93,2.22,1.87,2.22,1.897,2.213,,1.37,,,None,,,,-2,,,,,,569,,,473,0,0.0,Good,Regular echo read,B
144534,15.2,STUDY VISIT 3 (Month 24),1:Yes,2:Female,14.47,62.50,1.00,178.00,2.56,1.75,102,52,69,78,1.93,2.01,2.00,2.34,1.95,2.35,1.960,2.233,0.82,3.34,3.70,3.22,3.37,3.20,3.71,3.253,3.593,2.82,2.46,2.58,2.51,2.80,2.42,2.68,2.463,2.687,1.20,2.26,2.42,1.89,2.52,1.78,2.42,1.977,2.453,,1.49,,,None,,,,-2,,,,,,466,,,540,0,0.0,Good,Regular echo read,B