"Blind_id","Blinded_SiteID","global_rr_","pr_gbl","p_axis_","pamp_ii","pamp_v1","pndur_gbl","pndur_ii","qrs_gbl","qrs_axis_","qt_gbl","qt_ii","qt_v5","qt_v6","qtp_gbl","qamp_i","qamp_ii","qamp_iii","qamp_v1","qamp_v6","qamp_avf","qamp_avl","r_amp_v1","rtp_gbl","ramp_v1","ramp_v2","ramp_v3","ramp_v4","ramp_v5","ramp_v6","stamp_gbl","stamp_i","stamp_ii","stamp_iii","stamp_v1","stamp_v2","stamp_v3","stamp_v4","stamp_v5","stamp_v6","stamp_avf","stamp_avl","stamp_avr","samp_v1","samp_v2","samp_v3","samp_v4","samp_v5","samp_v6","tw_gbl","t_axis_","tamp_gbl","tamp_i","tamp_ii","tamp_iii","tamp_v1","tamp_v2","tamp_v3","tamp_v4","tamp_v5","tamp_v6","tamp_avf","tamp_avl","tamp_avr","tpte_gbl","hr","rs_amp_v3v4","rv1_sv6","rv6_sv1","QTc_gbl_Bazett","QTc_ii_Bazett","QTc_v5_Bazett","QTc_v6_Bazett","QTc_gbl_Fridericia","QTc_ii_Fridericia","QTc_v5_Fridericia","QTc_v6_Fridericia","SEX","ECG_AGE","ECG_HT","ECG_WT","race","age_group","nettamp_v1v5v6","ln_r_amp_v1","ln_ramp_v1","ln_ramp_v2","ln_ramp_v3","ln_rv1_sv6","ln_samp_v1","ln_samp_v2","ln_samp_v3","ln_samp_v4","ln_samp_v5","ln_samp_v6","ln_qamp_i","ln_qamp_ii","ln_qamp_iii","ln_qamp_v1","ln_qamp_v6","ln_qamp_avf","ln_qamp_avl"
1,6,745,114,33,0.076,0.086,80,82,68,77,346,348,346,356,286,,-0.073,-0.216,,-0.065,-0.129,,,242,0.231,1.068,2.701,3.224,2.265,1.666,0.05,-0.001,0.019,0.016,0.073,0.125,0.114,0.062,0.028,0.02,0.016,-0.007,-0.011,-1.204,-1.891,-0.778,-0.467,-0.183,,140,75,0.426,0.126,0.435,0.301,0.088,0.515,0.735,0.691,0.491,0.347,0.372,-0.083,-0.28,60,80.536912752,7.17,,2.87,400.86483688,403.18197467,400.86483688,412.45052581,381.67232858,383.87852701,381.67232858,392.70332074,"Male",2.99,103.6,18.5,1,2,0.926,,0.2078268472,0.7265819566,1.3086030534,,0.7902738913,1.061602463,0.5754891371,0.3832194992,0.168053585,,,0.0704584636,0.1955667835,,0.0629747992,0.1213322852,
2,6,532,134,59,0.22,0.121,80,62,78,86,286,280,282,282,242,,-0.294,-0.543,,-0.349,-0.403,,,200,0.601,0.987,0.75,2.331,2.269,1.765,0.026,0.011,-0.001,-0.01,0.013,0.046,0.033,0,-0.003,-0.008,-0.004,0.01,-0.005,-0.78,-1.542,-0.802,-0.196,,,104,53,0.199,0.176,0.313,0.133,-0.096,0.027,-0.053,0.209,0.295,0.273,0.223,0.023,-0.242,44,112.78195489,4.079,,2.545,392.11207543,383.88594797,386.62799046,386.62799046,352.96270767,345.55789562,348.02616631,348.02616631,"Male",3.27,98,15.7,1,3,0.472,,0.470628434,0.6866259636,0.5596157879,,0.5766133643,0.9329511728,0.5888971592,0.1789826555,,,,0.2577381961,0.4337285734,,0.2993635772,0.3386128011,
3,6,641,118,57,0.128,0.083,72,84,80,93,316,326,322,324,278,,-0.077,-0.244,,-0.136,-0.149,,,240,0.62,1.239,1.876,2.233,1.364,0.925,0.01,0.014,0.02,0.007,-0.005,0.042,0.041,0.041,0.023,0.02,0.016,0.003,-0.015,-0.713,-1.173,-0.366,-0.383,-0.323,-0.215,136,81,0.291,0.028,0.255,0.227,-0.277,-0.646,-0.277,0.248,0.306,0.29,0.242,-0.095,-0.137,38,93.60374415,4.858,0.835,1.638,394.69176741,407.18201322,402.1859149,404.68396406,366.49473451,378.09266915,373.45349529,375.77308222,"Male",4.58,110,17.4,1,3,0.319,,0.4824261492,0.8060293376,1.0564004399,0.6070444815,0.5382462193,0.7761087013,0.3118867611,0.3242550527,0.2799018851,0.1947440768,,0.0741793982,0.2183319943,,0.1275133203,0.1388919989,
4,6,1206,170,25,0.11,-0.056,92,98,102,81,426,426,416,416,362,-0.042,-0.136,-0.095,,-0.19,-0.118,,0.24,308,0.376,0.582,0.487,0.917,2.117,1.95,0.053,0.015,0.036,0.02,0.028,0.066,0.144,0.106,0.041,0.009,0.024,-0.003,-0.026,-1.757,-2.327,-3.284,-1.02,,,240,51,0.171,0.13,0.213,0.085,-0.146,-0.013,0.161,0.162,0.298,0.26,0.149,0.022,-0.167,64,49.751243781,5.708,,3.707,387.91443894,387.91443894,378.8084662,378.8084662,400.21543122,400.21543122,390.82070278,390.82070278,"Male",16.21,173,58,1,6,0.412,0.2151113796,0.3191807395,0.4586898693,0.3967606675,,1.014143132,1.202070997,1.4548871526,0.7030975114,,,0.0411419433,0.1275133203,0.0907543633,,0.1739533071,0.1115413747,
5,6,464,112,65,0.203,-0.017,74,82,72,48,266,264,260,264,216,,-0.04,-0.7,,-0.234,-0.298,,,182,0.5,1.689,1.587,1.856,1.63,1.021,0.08,0.083,0.145,0.062,-0.063,0.093,0.054,0.151,0.159,0.11,0.106,0.011,-0.115,-0.201,-1.466,-0.904,-0.798,-0.492,-0.179,138,67,0.446,0.204,0.619,0.411,-0.369,-0.188,0.102,0.604,0.713,0.538,0.518,-0.097,-0.409,50,129.31034483,5.145,0.679,1.222,390.50144598,387.56534488,381.69314268,387.56534488,343.59141959,341.00802545,335.84123719,341.00802545,"Female",0.93,65,6.7,3,2,0.882,,0.4054651081,0.9891693773,0.9504989032,0.5181983781,0.1831545431,0.9025974047,0.6439569364,0.586674936,0.4001175018,0.1646666216,,0.0392207132,0.5306282511,,0.2102609255,0.2608246183,
6,6,432,108,62,0.187,0.112,88,88,88,101,250,250,250,254,206,,-0.103,-0.311,,-0.177,-0.186,,,172,0.154,1.003,1.779,1.57,1.202,0.938,0.026,0.028,0.022,-0.005,-0.001,0.048,0.038,0.029,0.016,0.012,0.008,0.017,-0.025,-0.369,-1.698,-1.304,-0.546,-0.288,-0.147,100,62,0.23,0.145,0.327,0.179,-0.215,-0.116,0.217,0.326,0.292,0.241,0.255,-0.012,-0.233,44,138.88888889,5.199,0.301,1.307,380.36288716,380.36288716,380.36288716,386.44869335,330.70855249,330.70855249,330.70855249,335.99988933,"Female",1.54,81,10.5,3,2,0.318,,0.1432341681,0.6946460567,1.0220911508,0.2631331995,0.3140805463,0.9925107578,0.8346467428,0.4356709502,0.2530906277,0.1371498381,,0.0980337403,0.2707902048,,0.1629688283,0.1705863006,
7,6,438,100,63,0.18,-0.012,60,62,76,83,254,262,254,258,214,,-0.108,-0.165,,-0.144,-0.134,,,182,0.87,1.664,1.847,2.487,1.947,1.186,0.032,0.017,0.056,0.043,-0.015,0.012,0.059,0.097,0.068,0.045,0.051,-0.012,-0.036,-0.397,-1.097,-0.922,-0.774,-0.473,-0.218,112,64,0.199,0.08,0.174,0.091,-0.298,-0.332,-0.155,0.245,0.265,0.211,0.134,-0.002,-0.126,40,136.98630137,6.03,1.088,1.583,383.79265711,395.88061482,383.79265711,389.83663596,334.45858377,344.99271239,334.45858377,339.72564808,"Male",0.14,54,4.4,1,2,0.178,,0.6259384309,0.9798287527,1.0462658083,0.73620667,0.3343270803,0.7405077519,0.6533663105,0.5732368839,0.3873011375,0.1972101693,,0.1025565883,0.152721087,,0.134530893,0.1257512053,
8,6,681,132,53,0.217,0.084,86,92,98,122,338,348,352,342,292,,-0.109,-0.246,,-0.111,-0.169,,,246,0.111,0.512,0.774,1.364,1.764,1.521,0.02,0.038,0.021,-0.02,0.018,0.056,0.055,0.047,0.028,0.013,0,0.031,-0.029,-0.48,-1.683,-1.307,-1.072,-0.682,-0.277,116,44,0.218,0.127,0.216,0.087,-0.236,-0.342,-0.411,-0.183,0.139,0.233,0.15,0.02,-0.169,46,88.105726872,4.517,0.388,2.001,409.58415213,421.70202646,426.54917619,414.43130186,384.17962619,395.54588732,400.09239178,388.72613065,"Female",4.34,105,16,1,3,0.136,,0.1052605107,0.4134332778,0.5732368839,0.3278638621,0.3920420878,0.9869355714,0.8359479792,0.7285143244,0.5199835616,0.2445135771,,0.1034587084,0.2199384204,,0.1052605107,0.1561486825,
9,6,485,88,56,0.147,0.064,66,80,92,145,294,314,316,304,260,,,-0.025,,-0.036,,,,206,0.092,0.82,0.635,0.65,0.509,0.413,0.019,0.032,0.024,-0.008,-0.013,0.024,0.027,0.044,0.045,0.034,0.005,0.02,-0.027,-0.148,-1.057,-0.551,-0.465,-0.235,,64,6,0.096,0.081,0.03,-0.05,-0.116,-0.224,-0.129,-0.061,0.045,0.092,-0.007,0.065,-0.052,34,123.71134021,2.301,,0.561,422.15939727,450.87772361,453.74955625,436.51856044,374.19681289,399.6523784,402.19793495,386.92459565,"Female",1.38,78,9.6,1,2,0.021,,0.0880108773,0.5988365011,0.4916428043,,0.1380212979,0.7212486107,0.4388998842,0.3818552425,0.2110709701,,,,0.0246926126,,0.0353671438,,
11,6,481,72,52,-0.003,0.067,36,,70,134,268,270,262,268,220,,-0.081,-0.193,,-0.072,-0.13,,,178,1.267,1.433,1.803,1.424,0.872,0.485,0.059,0.052,0.071,0.015,-0.009,0.014,0.126,0.134,0.094,0.064,0.043,0.018,-0.061,-0.496,-1.512,-0.543,-0.646,-0.424,-0.218,136,51,0.216,0.153,0.238,0.082,-0.074,-0.147,0.087,0.417,0.369,0.251,0.164,0.038,-0.194,48,124.74012474,4.416,1.485,0.981,386.42236649,389.30611549,377.77111948,386.42236649,342.04751157,344.60010494,334.38973146,342.04751157,"Male",0.03,53.3,4,3,1,0.546,,0.8184573715,0.8891250638,1.0306902722,0.9102726595,0.4027948796,0.9210792486,0.4337285734,0.4983481023,0.353469813,0.1972101693,,0.0778865387,0.1764711431,,0.0695260626,0.1222176327,
12,6,769,118,29,0.08,0.026,90,76,108,69,376,396,370,378,322,-0.044,-0.058,,,-0.113,-0.036,,,268,0.198,0.908,1.607,1.878,1.737,1.28,0.024,0.007,0.02,0.016,0.017,0.062,0.067,0.051,0.024,0.013,0.016,-0.002,-0.011,-0.504,-0.791,-0.572,-0.482,-0.261,,120,23,0.273,0.218,0.177,-0.044,-0.096,0.472,0.304,0.457,0.386,0.271,0.072,0.131,-0.19,54,78.023407022,4.539,,1.784,428.7702802,451.57721,421.92820126,431.05097318,410.40476861,432.2348095,403.85575635,412.5877727,"Female",12.99,170.2,58.8,1,5,0.561,,0.1806534997,0.646055573,0.958200135,,0.4081282255,0.5827741231,0.452348694,0.3933925269,0.231905057,,0.0430594895,0.0563803334,,,0.1070590723,0.0353671438,
13,6,505,138,63,0.193,-0.077,88,88,68,77,272,274,266,272,226,,-0.11,-0.282,,-0.203,-0.181,,,190,0.335,0.84,0.694,2.741,2.248,1.63,0.06,-0.004,-0.047,-0.041,0.049,0.076,0.044,-0.028,-0.044,-0.04,-0.046,0.017,0.027,-1.359,-2.103,-1.091,-0.748,-0.353,-0.121,104,29,0.185,0.154,0.179,0.023,-0.177,-0.053,0.093,0.362,0.304,0.216,0.102,0.066,-0.165,46,118.81188119,5.274,0.456,2.989,382.75706433,385.57145451,374.3138938,382.75706433,341.56375393,344.07525212,334.02925936,341.56375393,"Male",4.2,116,21.6,1,3,0.343,,0.2889312919,0.6097655716,0.5270925962,0.3756929498,0.8582378004,1.1323693855,0.7376424204,0.5584722772,0.3023243492,0.1142211441,,0.1043600153,0.2484213585,,0.184818437,0.1663615372,
14,6,1055,138,64,0.105,0.069,86,92,98,83,462,454,468,480,410,,-0.114,-0.095,,-0.088,-0.106,,,368,0.696,0.606,2.328,1.487,1.074,0.787,0.014,0.006,0.024,0.015,0.045,0.043,0.023,0.026,0.032,0.016,0.019,-0.004,-0.013,-1.85,-1.618,-0.373,,,,124,77,0.338,0.12,0.527,0.407,0.003,-0.005,0.496,0.405,0.323,0.234,0.47,-0.138,-0.322,52,56.872037915,,,2.637,449.79616236,442.00748423,455.63767097,467.32068817,453.82786255,445.96937143,459.7217309,471.50946759,"Male",12.77,163,35,1,5,0.56,,0.5282725374,0.4737466155,1.202371523,,1.0473189943,0.9624106675,0.3169981268,,,,,0.1079571415,0.0907543633,,0.0843411484,0.1007499031,
15,6,681,108,67,0.241,0.072,78,78,86,95,330,326,324,328,276,,-0.035,-0.223,,-0.123,-0.105,,,238,0.161,0.958,1.079,3.032,2.534,2.072,0.03,0.026,0.005,-0.015,0.011,0.096,0.097,0.025,0.01,0.005,-0.006,0.017,-0.014,-0.528,-2.465,-1.12,-0.466,-0.214,,122,63,0.454,0.257,0.617,0.358,-0.235,0.073,0.426,0.74,0.633,0.525,0.49,-0.045,-0.436,54,88.105726872,5.697,,2.6,399.88985268,395.04270295,392.61912808,397.46627781,375.08661729,370.54011284,368.26686061,372.81336506,"Male",12.86,158,40.3,1,5,0.923,,0.1492817027,0.6719235441,0.7318870089,,0.4239596907,1.2427126326,0.7514160887,0.3825376035,0.1939206926,,,0.0344014267,0.2013068567,,0.1160036758,0.099845335,
16,6,1150,134,53,0.091,0.084,98,116,96,264,402,406,392,408,338,-0.109,,,,-0.185,,-0.123,0.093,276,0.266,0.601,0.62,1.578,1.399,0.892,0.063,0.006,0.045,0.037,0.037,0.107,0.134,0.108,0.054,0.024,0.044,-0.015,-0.027,-0.317,-1.903,-1.774,-1.188,-0.379,-0.139,136,65,0.581,0.249,0.56,0.302,-0.015,0.779,0.67,1.084,0.856,0.527,0.435,-0.022,-0.401,64,52.173913043,5.16,0.405,1.209,374.86693291,378.59695215,365.54188483,380.46196176,383.70144933,387.5193742,374.15663716,389.42833663,"Male",13.12,169,54.9,1,5,1.368,0.0889262092,0.2358623237,0.470628434,0.4824261492,0.3400373028,0.2753564228,1.065744685,1.0202903219,0.7829878846,0.3213585988,0.1301506845,0.1034587084,,,,0.1697427746,,0.1160036758
18,6,552,116,34,0.104,0.098,72,92,68,68,278,278,276,280,232,,-0.177,-0.271,,-0.205,-0.187,,,194,0.516,1.374,2.932,3.019,2.28,1.695,0.039,0.031,0.046,0.015,0.053,0.129,0.111,0.072,0.046,0.027,0.032,0.008,-0.041,-1.073,-0.602,-0.48,-0.348,-0.219,-0.152,116,51,0.379,0.303,0.465,0.156,-0.328,0.13,0.458,0.602,0.519,0.419,0.314,0.07,-0.38,46,108.69565217,6.779,0.668,2.768,374.17542193,374.17542193,371.48351242,376.86733144,338.89495471,338.89495471,336.45686151,341.33304791,"Male",3.01,97,14.7,1,3,0.61,,0.4160752872,0.8645762962,1.3691482023,0.5116253039,0.7289968335,0.4712528486,0.3920420878,0.2986220125,0.1980308505,0.1414995623,,0.1629688283,0.2398039922,,0.1864795669,0.1714291156,
19,6,595,112,49,0.161,-0.043,74,90,78,108,316,320,312,318,264,-0.115,-0.056,,,-0.32,,-0.088,,208,0.497,1.518,2.125,2.169,1.79,1.256,0.075,0.051,0.058,0.008,0.01,0.167,0.169,0.153,0.107,0.066,0.033,0.02,-0.055,-0.56,-2.625,-2.328,-1.762,-1.019,-0.449,152,49,0.542,0.344,0.526,0.18,-0.295,0.592,0.833,0.867,0.756,0.566,0.354,0.082,-0.434,52,100.84033613,8.384,0.946,1.816,409.66475328,414.85038307,404.4791235,412.25756818,375.70596822,380.46173997,370.95019647,378.0838541,"Male",2.55,88.2,13.4,1,2,1.027,,0.4034631054,0.9234649356,1.1394342832,0.6657759838,0.4446858213,1.2878542883,1.202371523,1.015955055,0.7026023393,0.3708736633,0.1088544049,0.0544881853,,,0.2776317366,,0.0843411484
20,1,732,100,56,0.123,0.102,70,65,96,80,324,328,322,332,276,,-0.25,-0.286,,-0.17,-0.269,,0.335,230,0.912,1.724,1.724,1.609,1.233,0.85,0.041,0.039,0.033,-0.005,-0.042,0.047,0.097,0.077,0.042,0.03,0.011,0.022,-0.036,-1.081,-2.002,-0.954,-0.435,-0.193,-0.124,130,51,0.406,0.276,0.444,0.165,-0.484,-0.2,0.439,0.76,0.53,0.358,0.307,0.057,-0.358,48,81.967213115,4.722,1.036,1.931,378.69491159,383.37015741,376.35728868,388.04540324,359.50752332,363.94588781,357.28834108,368.3842523,"Female",5.83,111,18,1,3,0.404,0.2889312919,0.6481498146,1.0021013883,1.0021013883,0.7109870987,0.7328485474,1.0992787332,0.6698785536,0.3611648492,0.1764711431,0.1168937515,,0.2231435513,0.2515366258,,0.1570037488,0.2382291887,
21,1,590,96,61,0.119,0.167,60,55,68,202,304,300,306,302,188,,-0.048,-0.223,,,-0.124,,,146,1.594,1.981,1.761,1.41,0.955,0.524,0.052,0.035,0.077,0.042,-0.038,-0.045,-0.028,0.052,0.086,0.075,0.061,-0.001,-0.055,-1.219,-1.769,-2.187,-1.737,-1.262,-0.707,182,66,0.163,0.089,0.157,0.068,-0.273,-0.264,-0.152,0.094,0.201,0.189,0.112,0.01,-0.123,116,101.69491525,7.095,2.301,1.743,395.77428938,390.56673294,398.3780676,393.17051116,362.4567954,357.68762704,364.84137958,360.07221122,"Male",0.01,58,4.1,1,1,0.117,,0.9532010859,1.0922588147,1.0155929329,1.1942254529,0.797056644,1.0184862442,1.1590800354,1.0068624301,0.8162493777,0.5347374438,,0.0468835859,0.2013068567,,,0.1168937515,
23,1,723,118,7,0.152,0.162,56,60,82,36,294,302,292,294,250,-0.194,-0.071,,,-0.586,-0.044,-0.186,,220,1.457,2.298,2.272,2.131,2.646,2.209,0.042,0.035,0.062,0.026,0.039,0.035,0.145,0.132,0.101,0.049,0.044,0.002,-0.048,-1.163,-2.132,-2.333,-1.243,-0.525,-0.168,108,50,0.537,0.402,0.575,0.172,-0.588,-0.47,0.265,0.887,0.834,0.654,0.377,0.117,-0.487,44,82.987551867,7.979,1.625,3.372,345.76273255,355.17124228,343.41060512,345.76273255,327.56782066,336.48123074,325.33946814,327.56782066,"Male",5,117,20.9,1,3,0.9,,0.8989410935,1.1933162241,1.1854014187,0.965080896,0.771496147,1.1416717781,1.2038727993,0.8078142555,0.4219944101,0.1552928844,0.177309015,0.0685927915,,,0.4612151232,0.0430594895,0.1705863006
24,1,922,120,39,0.106,0.092,86,85,84,14,372,362,356,358,294,-0.159,,,,-0.224,,-0.152,,258,0.837,1.31,1.098,1.522,1.824,1.143,0.047,0.055,0.062,0.009,0.019,0.085,0.076,0.058,0.07,0.042,0.034,0.023,-0.06,-1.06,-1.821,-1.281,-0.73,-0.365,,150,27,0.359,0.444,0.423,-0.02,-0.189,0.008,0.124,0.345,0.655,0.543,0.203,0.233,-0.429,78,65.075921909,4.631,,2.203,387.41593448,377.00152764,370.75288354,372.8357649,382.20758328,371.93318588,365.76854744,367.82342692,"Male",7.77,130,31.3,3,4,1.009,,0.6081338062,0.8372475245,0.74098451,,0.7227059828,1.037091432,0.8246139433,0.5481214085,0.3111544286,,0.1475575644,,,,0.2021241841,,0.1414995623
25,1,629,148,32,0.136,0.03,92,90,76,79,314,318,326,322,272,,-0.058,-0.33,,-0.066,-0.171,,,232,0.671,0.98,1.123,1.387,1.368,1.144,0.112,0.057,0.095,0.039,,0.076,0.189,0.088,0.064,0.093,0.067,0.009,-0.074,-1.549,-2.046,-1.564,-0.535,-0.289,-0.135,114,64,0.278,0.15,0.383,0.234,-0.297,-0.391,-0.225,0.054,0.282,0.4,0.309,-0.04,-0.267,42,95.389507154,4.609,0.806,2.693,395.91715984,400.96069054,411.04775194,406.00422124,366.47647341,371.14496352,380.48194373,375.81345363,"Male",3.92,103,15.6,2,3,0.385,,0.5134222496,0.6830968447,0.7528301827,0.591114455,0.9357011254,1.1138292545,0.9415685391,0.428530381,0.253866724,0.1266326509,,0.0563803334,0.2851789422,,0.0639133257,0.1578580846,
28,1,614,128,38,0.118,0.131,90,90,98,49,298,302,298,304,252,-0.137,-0.146,-0.087,,-0.166,-0.106,-0.07,,210,1.501,2.073,1.654,1.541,1.041,0.721,0.029,0.039,0.029,-0.01,0.04,0.086,0.08,0.049,0.026,0.019,0.01,0.024,-0.034,-1.938,-2.999,-2.263,-0.832,-0.159,,114,41,0.451,0.369,0.474,0.105,-0.304,0.309,0.743,0.754,0.559,0.413,0.292,0.133,-0.418,46,97.719869707,6.29,,2.659,380.30503786,385.40980347,380.30503786,387.96218628,350.61202496,355.31822663,350.61202496,357.67132747,"Male",3.92,108,20.2,1,3,0.668,,0.9166906519,1.1226542831,0.9760679359,,1.0777290778,1.3860443299,1.1826470176,0.6054082663,0.1475575644,,0.1283932148,0.1362776183,0.0834216081,,0.1535790879,0.1007499031,0.0676586485
29,1,791,130,52,0.138,0.093,86,90,82,0,328,322,318,328,268,,,-0.095,,,,,0.249,242,0.634,1.116,1.622,2.721,1.921,0.939,0.044,0.044,0.063,0.02,0.038,0.087,0.099,0.076,0.055,0.04,0.043,0.013,-0.054,-0.444,-1.473,-1.89,-1.453,-0.96,-0.527,140,59,0.342,0.247,0.498,0.252,-0.247,-0.07,0.182,0.511,0.517,0.348,0.377,-0.003,-0.37,60,75.85335019,7.686,1.161,1.383,368.79549046,362.04923148,357.5517255,368.79549046,354.6622916,348.17456676,343.84941686,354.6622916,"Male",4.17,109,17.7,1,3,0.618,0.2223432311,0.4910309964,0.749527514,0.9639373853,0.7705710775,0.3674170405,0.9054319885,1.0612565021,0.8973117653,0.6729444732,0.4233050262,,,0.0907543633,,,,
30,1,673,110,38,0.145,0.118,80,78,86,60,326,340,322,324,272,-0.122,-0.06,,,-0.241,-0.029,-0.146,,242,0.824,1.767,2.309,3.092,2.351,1.445,0.027,0.022,0.026,0.006,0.046,0.078,0.113,0.079,0.037,0.017,0.014,0.007,-0.024,-0.376,-1.779,-2.208,-1.557,-0.716,-0.346,126,39,0.282,0.2,0.236,0.036,-0.389,-0.331,-0.059,0.44,0.448,0.358,0.139,0.083,-0.216,54,89.153046062,9.166,1.17,1.821,397.38371723,414.44927564,392.5078434,394.94578032,372.00254581,387.97811526,367.43809739,369.7203216,"Male",4.45,108,18.3,1,3,0.417,,0.6010318917,1.0177637008,1.1966460289,0.7747271676,0.3191807395,1.0220911508,1.16564769,0.9388346963,0.5399960011,0.2971372312,0.1151128071,0.0582689081,,,0.2159175062,0.0285874569,0.1362776183
32,1,658,120,41,0.157,0.137,82,80,82,77,310,318,308,314,264,,-0.177,-0.194,,-0.177,-0.185,,,222,0.936,1.519,1.453,2.14,1.529,1.062,0.035,0.019,0.029,0.009,0.026,0.064,0.097,0.097,0.041,0.015,0.019,0.004,-0.024,-1.557,-2.125,-1.988,-1.123,-0.26,,118,43,0.329,0.264,0.323,0.059,-0.394,-0.263,0.162,0.624,0.481,0.342,0.193,0.105,-0.291,46,91.185410334,6.704,,2.619,382.16309636,392.02536981,379.697528,387.09423309,356.41261124,365.61035604,354.11317503,361.01148364,"Female",5.58,112,21.2,1,3,0.429,,0.6606239889,0.9238619974,0.8973117653,,0.9388346963,1.1394342832,1.0946042673,0.7528301827,0.231111721,,,0.1629688283,0.177309015,,0.1629688283,0.1697427746,
33,1,723,116,39,0.1,0.07,60,60,84,77,338,338,332,338,292,,-0.409,-0.471,,-0.377,-0.439,,,250,0.609,1.024,1.06,2.834,3.072,2.14,0.06,0.023,0.028,0.008,0.058,0.121,0.166,0.127,0.058,0.043,0.017,0.005,-0.026,-1.661,-2.778,-2.727,-0.557,,,116,66,0.422,0.194,0.53,0.335,-0.318,-0.242,0.07,0.619,0.742,0.537,0.435,-0.065,-0.359,46,82.987551867,7.178,,3.801,397.50953606,397.50953606,390.45315376,397.50953606,376.59157613,376.59157613,369.90651857,376.59157613,"Male",7,127,25,1,4,0.961,,0.475612868,0.7050757514,0.7227059828,,0.978701992,1.3291947691,1.3156036205,0.4427608929,,,,0.3428802329,0.3859424416,,0.3199072197,0.3639484279,
35,1,607,130,64,0.161,0.105,90,85,78,50,300,302,298,302,254,-0.095,,,,-0.108,,-0.1,,216,0.892,1.284,2.627,2.37,1.912,1.485,0.028,0.009,-0.018,-0.026,0.006,0.041,0.013,-0.009,-0.011,-0.009,-0.021,0.017,0.005,-0.805,-1.04,-0.424,-0.114,,,104,59,0.296,0.157,0.325,0.168,0.065,0.253,0.464,0.471,0.415,0.313,0.247,-0.004,-0.24,46,98.846787479,5.535,,2.29,385.05867244,387.62573025,382.49161462,387.62573025,354.31675598,356.67886769,351.95464428,356.67886769,"Female",11.17,160,46.2,3,4,0.793,,0.6376344706,0.8259282918,1.2884058603,,0.5905605918,0.7129498079,0.353469813,0.1079571415,,,0.0907543633,,,,0.1025565883,,0.0953101798
36,1,915,120,33,0.057,0.079,90,85,80,56,370,372,366,374,312,-0.076,,,,-0.091,,-0.086,,272,0.349,0.586,1.926,2.954,2.268,1.673,0.056,-0.005,0.02,0.024,0.106,0.193,0.09,0.045,0.008,-0.006,0.021,-0.015,-0.008,-1.722,-2.415,-0.791,-0.454,-0.179,,132,51,0.38,0.279,0.429,0.15,-0.116,0.282,0.511,0.693,0.512,0.368,0.292,0.067,-0.351,58,65.573770492,6.125,,3.395,386.80419638,388.89502988,382.62252939,390.98586337,381.11966615,383.17977246,376.99945355,385.23987876,"Male",12.49,157,47.8,2,5,0.764,,0.2993635772,0.4612151232,1.0736363026,,1.0013669042,1.228177493,0.5827741231,0.3743183791,0.1646666216,,0.0732504617,,,,0.0870947069,,0.0825012215
37,1,929,140,17,0.091,0.118,90,70,88,71,366,362,360,374,292,-0.08,-0.184,-0.127,,-0.271,-0.154,,0.127,250,1.17,1.724,2.2,2.341,1.64,1.285,0.078,0.023,0.052,0.028,0.098,0.114,0.207,0.168,0.032,0.022,0.042,-0.004,-0.035,-1.586,-2.311,-3.151,-1.44,-0.125,,142,69,0.387,0.17,0.444,0.272,0.188,0.418,0.447,0.777,0.416,0.295,0.362,-0.048,-0.305,74,64.585575888,9.132,,2.871,379.72853031,375.57849172,373.50347243,388.02860747,375.09607011,370.99665951,368.94695421,383.29489132,"Male",13.68,176,60.3,3,5,0.899,0.1195592351,0.7747271676,1.0021013883,1.1631508098,,0.9501122803,1.1972502586,1.4233492691,0.8919980393,0.1177830357,,0.0769610411,0.1688985365,0.1195592351,,0.2398039922,0.1432341681,
38,1,600,136,36,0.138,0.122,70,65,74,54,300,302,296,300,250,,-0.093,-0.495,,-0.136,-0.206,,,222,0.818,1.435,2.372,3.757,2.605,1.821,0.018,0.01,0.044,0.033,0.041,0.047,0.071,0.053,0.035,0.035,0.038,-0.01,-0.025,-1.543,-2.637,-1.436,-0.573,-0.191,,120,47,0.355,0.281,0.387,0.105,-0.414,-0.293,0.34,0.557,0.489,0.41,0.247,0.089,-0.331,50,100,8.138,,3.364,387.29833462,389.88032352,382.13435683,387.29833462,355.68933045,358.06059265,350.94680604,355.68933045,"Female",3.92,99,16.2,1,3,0.485,,0.5977369958,0.8899467565,1.2155060401,,0.9333444864,1.291159166,0.8903573498,0.4529846241,0.1747932904,,,0.0889262092,0.4021262068,,0.1275133203,0.1873090983,
39,1,693,195,48,0.124,0.073,75,75,74,44,310,308,308,314,264,,,-0.129,,,-0.075,,,234,0.575,1.553,1.524,2.326,1.271,0.82,0.027,0.023,0.059,0.036,0.022,0.082,0.086,0.051,0.021,0.017,0.048,-0.008,-0.043,-0.601,-0.901,-0.873,-0.767,-0.553,-0.234,110,67,0.3,0.168,0.416,0.246,-0.322,-0.248,-0.016,0.471,0.388,0.286,0.334,-0.035,-0.29,46,86.58008658,5.49,0.809,1.421,372.38748458,369.98498468,369.98498468,377.19248438,350.30845186,348.04839733,348.04839733,354.82856092,"Male",4.91,108,18.5,2,3,0.352,,0.4542552723,0.9372691383,0.9258449447,0.5927742064,0.470628434,0.6423800635,0.6275414235,0.5692831933,0.4401885442,0.2102609255,,,0.1213322852,,,0.0723206616,
40,1,913,140,46,0.197,0.073,90,90,84,60,362,366,358,374,296,,-0.097,-0.08,,-0.097,-0.088,,,250,0.266,0.389,0.739,2.086,1.927,1.46,0.039,0.011,0.034,0.023,0.043,0.157,0.083,0.012,0.036,0.019,0.029,-0.005,-0.021,-1.507,-1.904,-0.755,-0.496,-0.226,,130,59,0.432,0.226,0.435,0.207,-0.02,0.539,0.706,0.74,0.547,0.332,0.322,0.01,-0.329,66,65.717415115,4.076,,2.967,378.85513824,383.04138286,374.66889362,391.41387211,373.15131637,377.27453533,369.0280974,385.52097326,"Female",10.67,143,33.6,1,4,0.859,,0.2358623237,0.3285840638,0.5533102354,,0.9190868192,1.066089097,0.5624688569,0.4027948796,0.2037568375,,,0.0925791813,0.0769610411,,0.0925791813,0.0843411484,
41,1,971,166,51,0.087,0.083,96,86,74,97,380,372,378,382,300,,-0.042,-0.064,,-0.036,-0.053,,,262,0.424,0.733,0.784,1.33,0.96,0.769,0.057,0.023,0.07,0.047,0.058,0.1,0.116,0.077,0.049,0.036,0.058,-0.009,-0.044,-0.635,-1.485,-0.631,-0.385,-0.205,-0.132,160,64,0.201,0.112,0.261,0.149,0.136,0.355,0.193,0.21,0.215,0.183,0.205,-0.017,-0.185,80,61.791967044,3.13,0.556,1.404,385.63281416,377.51422859,383.60316776,387.66246055,383.74599267,375.66712966,381.72627692,385.76570842,"Female",13.33,163,44.4,3,5,0.534,,0.353469813,0.5498540107,0.5788580342,0.4421184258,0.4916428043,0.9102726595,0.4891933236,0.3257001396,0.1864795669,0.1239859798,,0.0411419433,0.0620353909,,0.0353671438,0.0516432332,