"Blind_id","Blinded_SiteID","ACCEPTABLE","NA_REAS","QUALITY","FAIR_REAS","ADJ_RQST","ADJ_REAS","AAPTAD","AADTAD","AAAID","ARAVAD","ARARD","ARASJD","AR_AAD","CAPR","CALAD","CALMCA","LVSWD","LVEDDD","LVPWDD","LVESD","LVEDA","LVESA","LVEDA_EPI","LVEDL","LVEDL_EPI","LVESL","MVAVD","MVLAD","MPA","RPA","LPA","TVAVD","TVLAD","COMMENTS","PVAD_SHORT","PVAD_LONG"
1,6,"Yes",,"Excellent",,"No",,"1.1","1.1","1.1","1.3","1.7","1.2","1.7","2","2.1","2.3","0.5","3.2","0.5","2.3","7.2","3.4","12","4.7","5.1","3.4","1.9","1.9","1.8","0.8","0.8","1.9","2.4","Excellent quality study","1.3","1.3"
2,6,"Yes",,"Excellent",,"No",,"1.1","1","1","1.2","1.4","1.1","1.2","1.9","1.5","2.2","0.4","2.8","0.4","2","6.8","3.1","11.3","5.9","6.3","4.7","1.9","1.6","1.3","0.7","0.7","1.5","1.6","Excellent study with complete imaging","1.3","1.4"
3,6,"Yes",,"Good",,"No",,"1","1.1","1","1.4","1.7","1.5","1.4","","","2.3","0.4","3.2","0.4","2.1","9.6","3.6","14.7","5.2","5.6","4","1.8","1.8","1.7","1","1.1","2","2.2","Overall good quality study","","1.2"
4,6,"Yes",,"Excellent",,"No",,"1.7","1.2","1.4","1.9","2.4","2","1.9","3.3","2.8","2.7","0.6","4.9","0.7","2.7","19.9","9.2","33.4","7.9","8.9","5.8","2.9","2.4","2","1.3","1.4","2.6","2.7","Excellent quality study","2.3","2.7"
5,6,"Yes",,"Excellent",,"No",,"0.8","0.7","0.7","0.9","1.2","1","1","1.4","1.2","1.3","0.3","2.4","0.3","1.4","4.4","2","7.7","3.6","3.9","2.9","1.3","1.4","1.3","0.7","0.7","1.5","1.4","Beautiful, complete study--thanks!","1","1.2"
6,6,"Yes",,"Excellent",,"No",,"0.8","0.9","0.9","1.1","1.4","1.1","1.1","1.9","1.3","2.5","0.5","3","0.5","1.7","6.7","2.8","10.9","4.3","4.8","3.4","1.6","1.5","1.4","0.9","0.9","1.5","1.8","Excellent study with complete imaging","1.6","1.4"
7,6,"Yes",,"Excellent",,"No",,"0.7","0.6","0.6","0.7","1.1","0.8","1","1.4","1","1.9","0.3","2.1","0.4","1.4","3.8","2.4","6.6","3.9","4.1","2.9","1.1","0.9","","0.7","0.6","1","1.1",,"","0.9"
8,6,"Yes",,"Excellent",,"No",,"1.2","1.1","1","1.1","1.6","1.3","1.1","1.4","1.5","1.9","0.5","3.4","0.5","2.3","9.6","4.6","15.4","5.2","5.7","4","2.1","2.1","1.8","0.9","1","1.5","2","Excellent study; all protocol measures available","1.6","1.7"
9,6,"Yes",,"Good",,"No",,"1.3","1.1","1.1","1.1","1.4","1","1.2","1.4","","1.4","0.3","2.5","0.3","1.5","4.5","2.3","7.9","4.4","4.7","3.6","1.6","1.5","1.2","0.9","1","1.2","1.1","Overall good quality study with complete imaging","","1.4"
10,6,"Yes",,"Good",,"No",,"1","0.9","1.1","1.2","1.9","1.5","1.1","2","2","2","0.5","3.1","0.5","1.9","7.1","3.3","11.9","4.8","5.2","3.9","1.7","2","1.4","1","0.9","1.9","1.9","Overall good quality study with all images available.","","1.6"
11,6,"Yes",,"Excellent",,"No",,"0.7","0.9","0.8","0.6","1","0.8","0.8","1.2","0.9","1.4","0.3","2","0.3","1.2","3.6","2","6","3.7","4","2.7","1.2","1.1","0.7","0.5","0.5","1","1.2",,"0.9","0.8"
12,6,"Yes",,"Excellent",,"No",,"1.6","1.2","1.1","1.7","2.2","1.8","2","3.1","","","0.5","4.9","0.5","3.3","18.8","9.6","29.9","7.3","8","5.7","3.2","2.7","2","1.2","1.3","2.2","2.5",,"1.9","2.1"
13,6,"Yes",,"Excellent",,"No",,"1.1","1.2","1.4","1.3","1.6","1.4","1.3","2.2","1.8","2.8","0.5","3.6","0.5","2.4","10.8","5.1","17.4","5.9","6.4","4.4","2.3","2.2","1.7","1.2","1","2.1","2.2",,"1.8",""
14,6,"No","missing protocol images",,,,,"","","","","","","","","","","","","","","","","","","","","","","","","","","","Missing image of LV SAX at the level of the papilary muscles.","",""
15,6,"Yes",,"Good",,"No",,"","1.4","1.1","1.5","2.5","1.9","1.9","2.4","1.9","3","0.6","4.3","0.6","2.8","14.4","6.1","23","6.9","7.4","5.1","2.5","2.2","","","","2.6","2.3","Bovine variant","1.9","2.4"
16,6,"Yes",,"Excellent",,"No",,"1.9","1.2","1.4","1.9","2.6","2","2","3.1","2.5","3.4","0.6","4.9","0.7","2.9","18.9","7.9","30.5","7.2","7.9","5.3","2.8","2.8","2.4","1.4","1.4","3.4","2.8","Excellent quality study","2.5","2.5"
17,6,"Yes",,"Excellent",,"No",,"1.2","1","1.2","1.4","1.8","1.6","1.5","3.6","1.7","2.4","0.3","3.3","0.4","2.2","8.4","4.3","13.2","5.9","6.5","4.6","1.8","2","1.4","1","1","1.9","1.7","Excellent quality study","1.5","1.4"
18,6,"Yes",,"Excellent",,"No",,"1.2","0.9","0.9","1.1","1.4","1.3","1.2","1.3","","1.8","0.5","3.1","0.5","2.1","8.1","4.1","13.6","4.9","5.5","3.2","1.9","1.7","1.2","0.8","0.9","1.8","1.5",,"1.4","1.5"
19,6,"Yes",,"Excellent",,"No",,"0.9","1.1","1.1","1.1","1.5","1.2","1.3","1.2","1.7","2.1","0.4","3.5","0.4","2","8.1","3.6","12.9","5.4","5.9","4.1","1.9","1.9","1.4","0.9","0.8","1.7","2.2","Excellent quality study","1.5","1.3"
20,1,"Yes",,"Excellent",,"No",,"1","1.2","1.1","1.4","1.7","1.4","1.1","1.4","1.9","2.6","0.3","3.8","0.3","2.5","10.4","5.4","15.3","5.5","5.9","4.1","1.9","1.8","1.6","1.4","1.3","2.1","2","Excellent quality study with all protocol measures available.","1.8","1.7"
21,1,"No","missing protocol image",,"poor quality images",,,"","","","","","","","","","","","","","","","","","","","","","","","","","","","Missing image of LV SAX at the level of the papillary muscles; bovine arch","",""
22,1,"Yes",,"Good",,"No",,"1.5","1.1","1.1","1.6","2.4","1.9","1.8","","","2.8","0.5","4.1","0.5","2.7","14.4","6.2","21.8","7.6","8.2","5.5","2.5","2.2","1.8","0.9","0.9","2","2.1","Fairly good quality study, but image quality made extraction of many of the protocol measures _x000D_ challenging.  No imaging to obtain measures of the right coronary and LAD coronary arteries.","","1.9"
23,1,"Yes",,"Excellent",,"No",,"1.1","1","1.1","1.3","1.7","1.7","1.6","3.1","2.4","3.2","0.4","3.8","0.4","2.5","10.6","5.8","16.4","5.1","5.5","4.1","2.2","2.2","1.8","1","1.1","2.2","2",,"","1.6"
24,1,"Yes",,"Excellent",,"No",,"1.3","1.3","1.1","1.7","2.2","1.8","1.5","2.3","2.3","3.3","0.5","4.2","0.5","3.1","15.1","8","22.5","6","6.6","4.6","2.1","2.6","2.3","1.4","1.3","2.3","2.8",,"","2.1"
25,1,"Yes",,"Good",,"No",,"","1","1.3","1.4","1.8","1.4","1.6","1.6","2","2.5","0.4","3.7","0.4","2.7","11","6","16.3","5.3","5.7","4.6","2.1","2","1.4","0.8","0.9","1.8","1.8","Multiple","","1.6"
26,1,"Yes",,"Excellent",,"No",,"1","0.9","1","1.4","2.1","1.8","1.3","2.2","2.1","2.5","0.5","3.5","0.5","2.3","9.4","5.4","14.8","5.9","6.4","4.1","2","1.9","2.2","1.2","1.2","2","2.5",,"","1.6"
27,1,"Yes",,"Excellent",,"No",,"1.8","1.5","1.5","1.7","2.2","2.1","2.2","","","","0.5","4.2","0.6","2.5","14","6.9","23.2","7.4","7.8","6.3","2.7","2.7","1.9","1.1","1.3","1.9","2.1","Overall excellent quality study; no coronary artery imaging obtained","2","2"
28,1,"Yes",,"Good",,"No",,"1.1","1","1","1.3","1.7","1.6","1.6","1.5","1.2","3","0.6","3.3","0.6","2.6","8.6","5.5","15.5","5.6","5.9","4.1","1.9","1.9","1.6","1","1","2.1","2.6",,"1.5","1.4"
29,1,"Yes",,"Good",,"No",,"","","","1.4","1.7","1.5","1.6","1.8","1.2","2.5","0.5","3.7","0.5","2.5","11.5","5.1","17.8","6","6.4","4.6","2.1","2","1.7","1.1","1.1","2.3","2.1","Multiple","1.5","1.7"
30,1,"Yes",,"Good",,"No",,"","1.1","1.1","1.4","1.9","1.7","1.9","2","2.2","3.2","0.5","3.6","0.4","2.5","10.3","5.6","15.9","5.7","6.2","4.6","2.1","2","1.7","1.1","1","2","2","Bovine arch; Multiple","","1.6"
31,1,"Yes",,"Excellent",,"No",,"2.5","1.9","1.5","2.2","2.8","2.5","2.4","5","3.1","5.1","0.7","5.1","0.7","3.3","17.2","9.9","27.8","7.3","8","5.3","2.8","2.9","2.2","1.5","1.2","2.7","2.6",,"2.1","2.3"
32,1,"Yes",,"Excellent",,"No",,"1.2","1.2","1.2","1.5","2","1.6","1.5","1.8","2.4","2.5","0.5","3.7","0.5","2.5","11","5.1","16.8","5.6","6.2","4.3","2.3","2.4","1.7","0.9","1","2.1","2.1",,"1.7","1.8"
33,1,"Yes",,"Excellent",,"No",,"1.3","1.3","1.2","1.6","2.3","1.7","1.8","2.9","2.2","2.8","0.5","4.1","0.5","2.5","11.8","5.7","18.8","6.9","7.5","5.3","2.3","2.2","1.9","0.9","1.1","2.8","2.2",,"2","1.9"
34,1,"Yes",,"Excellent",,"No",,"1.6","1.2","1.6","1.4","2.1","1.8","1.8","2.5","1.8","3.6","0.6","4.2","0.6","2.4","13.8","7.2","24.2","6.6","7.2","4.7","2.5","2.3","2","1","1","2.6","2.4",,"","1.8"
35,1,"Yes",,"Excellent",,"No",,"1.8","1.2","1.2","2.2","2.9","2","2.2","3","2","4.5","0.6","4.5","0.7","2.8","17.9","9.2","28.5","7.1","7.8","5.4","2.1","2.6","2.1","1.2","1.3","2.6","2.5",,"2","2.5"
36,1,"Yes",,"Good",,"No",,"1.6","1.2","1.3","1.9","2.8","2.2","2.2","1.5","2.2","2.9","0.6","4.9","0.6","3","18.1","7.3","28","8","8.6","6.4","2.9","2.2","2.4","1.3","1.4","3","2.4",,"3","2.9"
37,1,"Yes",,"Excellent",,"No",,"1.5","1.1","1","2.1","2.9","2.5","2.6","2.9","1.7","2.9","0.7","5.3","0.7","3.4","22.2","10.6","35.7","8.6","9.1","6.8","3.3","2.9","2.1","1.6","1.4","3.7","3",,"2.3","2.6"
38,1,"Yes",,"Excellent",,"No",,"1.1","1","1.2","1.3","1.8","1.7","1.8","","1.7","2.1","0.4","3.5","0.5","2.5","9.8","4.9","15","5.2","5.6","4.4","1.8","2.1","1.9","1.1","1.2","1.8","2.3",,"1.6","1.7"
39,1,"Yes",,"Good",,"No",,"","1.1","1.2","1.4","1.9","1.3","1.4","1.4","1.5","2.1","0.5","3.6","0.5","2.6","11.1","6.2","17.9","5.9","6.3","4.6","2.2","2.3","1.6","0.8","0.9","2","2.4",,"1.8","1.8"
40,1,"Yes",,"Good",,"No",,"1.6","1.8","1.5","1.6","2","1.7","1.8","3","2.1","2.8","0.5","3.9","0.5","2.5","12","6.4","18.7","7.1","7.6","5.1","2.5","2.1","1.9","1.3","1.3","2.3","2.1",,"","2.3"
41,1,"Yes",,"Excellent",,"No",,"1.9","1.7","1.3","1.8","2.2","1.9","1.9","1.7","1.5","2.1","0.4","4.2","0.5","3","13.8","8","21.1","8.2","8.6","7","2","2.5","2.4","1.4","1.4","2.4","2.1",,"2.2","2"
42,1,"Yes",,"Good",,"No",,"1.3","1.1","1","1.2","1.5","1.3","1.3","1.3","1.2","1.7","0.4","3.5","0.4","2.6","8.7","4.9","13.5","5","5.3","3.8","2.2","1.9","1.5","0.9","0.8","2.2","1.9",,"1.7",""
43,1,"Yes",,"Good",,"No",,"0.7","0.6","0.5","0.8","1.2","0.9","1","","1.1","1.9","0.4","2.1","0.4","1.3","3.6","2.2","6.7","3.8","4","2.7","1.1","1","1.1","0.6","0.5","1.4","1.6",,"1","1"
44,1,"Yes",,"Excellent",,"No",,"0.9","0.8","0.8","0.9","1.2","0.9","1","","1.6","","0.4","2.8","0.4","1.7","6","2.8","9.2","4.4","4.7","3.1","1.5","1.4","","","","1.8","1.7","LAD and circumflex coronary arteries originate from the aortic root separately","1.2","1.5"
45,1,"Yes",,"Excellent",,"No",,"1.4","1.3","1.2","1.5","2","1.6","1.6","","","","0.5","3.6","0.5","2","9.7","4.1","15.8","5.8","6.2","3.9","1.7","1.6","1.6","0.9","0.9","2.3","2",,"1.7","1.7"
46,1,"Yes",,"Excellent",,"No",,"1.1","1.1","0.9","1.2","1.6","1.3","1.5","","1.5","3.5","0.5","3.1","0.5","2","7.9","3.5","13.6","5.4","5.8","3.6","1.7","1.7","1.5","0.7","0.8","2.3","1.9",,"","1.8"
47,1,"Yes",,"Excellent",,"No",,"1.9","1.6","1.4","1.8","2.7","1.8","2","2","2.5","3.1","0.6","4.8","0.7","3.2","18.4","8.1","29.1","7.3","7.8","6.4","2.7","2.8","2.2","1.1","1.3","2.6","3.1","multiple","2.4","2.4"
48,1,"Yes",,"Good",,"No",,"1.6","1.4","1.3","1.6","2","1.7","1.7","1.8","1.5","2.7","0.6","4.5","0.5","3.4","15.1","8.9","23.5","6.2","6.6","5","3.1","2.2","2.2","1.1","1.1","2.8","2.1",,"","2"
49,1,"No","missing protocol image",,,,,"","","","","","","","","","","","","","","","","","","","","","","","","","","","Unable to measure LV SAX dimensions; as all walls are inadequately displayed","",""
50,1,"Yes",,"Good",,"No",,"","","0.8","0.8","1.1","0.8","0.9","1","1.2","1.8","0.3","2.2","0.4","1.5","3.5","1.8","6.4","3.7","3.9","2.9","1.3","1.4","1.1","0.6","0.7","1.3","1.5",,"1","0.9"
51,1,"Yes",,"Excellent",,"No",,"2.1","1.6","1.4","1.7","2.5","2.1","2","3.9","2.1","3.5","0.6","4.5","0.6","3","15.3","8.4","25.2","7.7","8.3","5.9","2.5","2.8","1.6","1.1","1.1","2.7","2.7","single","2","2"
52,1,"Yes",,"Excellent",,"No",,"0.7","0.6","0.6","0.7","1","0.7","1","1.5","","1.9","0.4","2.5","0.4","1.7","4.7","2.8","7.9","3.5","3.9","2.5","1.4","1.2","1","0.5","0.6","1.2","1.3",,"1.1","0.9"
53,1,"No","missing protocol image",,,,,"","","","","","","","","","","","","","","","","","","","","","","","","","","","Unable to measure LV 4CH endo and epicardial lengths due to image quality","",""
54,1,"No","missing protocol image",,,,,"","","","","","","","","","","","","","","","","","","","","","","","","","","","Unable to reliably measure the ascending aorta from available images","",""
55,1,"Yes",,"Good",,"No",,"1.4","1.5","1.2","1.7","2.1","1.8","1.8","1.9","2","1.9","0.4","4.2","0.4","2.8","13.5","6.3","19.2","5.8","6.2","5.2","2.4","2.3","2","1.2","1.2","2.3","2","single","2.1","2.2"
56,1,"Yes",,"Good",,"No",,"2.2","2","1.6","1.7","2.2","1.8","1.7","2.3","2.5","2.3","0.6","4.6","0.7","3.1","16.9","8.3","28.3","7.7","8.3","6","3.2","2.6","","1.6","","2.9","2.9","single","","2.2"
57,1,"No","missing protocol image",,,,,"","","","","","","","","","","","","","","","","","","","","","","","","","","","Unable to measure the ascending aorta and the A4C epicardial dimension","",""
58,1,"Yes",,"Good",,"No",,"0.9","0.7","0.7","0.8","1","0.8","0.9","1.6","","","0.5","1.9","0.5","1.2","3.7","1.7","7.3","3.9","4.2","2.7","1.3","1.4","1.1","0.5","0.5","1.2","1.4","single","1.2","1.1"
59,1,"Yes",,"Excellent",,"No",,"","","","1","1.5","1.2","1.4","1.6","1.9","2.6","0.5","3.2","0.5","2","6.3","3.3","10.8","4.7","5.1","3.3","1.7","1.7","1.5","0.9","0.9","1.8","1.6","single","1.5",""
60,1,"Yes",,"Excellent",,"No",,"1.2","0.8","1","0.9","1.3","1","1.1","2","","","0.4","3.1","0.4","1.7","6.8","3.4","11.3","4.5","4.9","3.2","1.6","1.6","1.3","0.9","0.9","1.5","1.6","multiple","1.3","1.4"
61,1,"No","missing protocol image",,,,,"","","","","","","","","","","","","","","","","","","","","","","","","","","","Unable to measure the entire aortic root","",""
62,1,"Yes",,"Good",,"No",,"1.8","1.3","1.2","1.6","2","1.8","2","2.6","2.1","3.3","0.5","4.2","0.4","2.9","12.4","6.1","19","6.3","6.8","5","2.4","2.3","2.4","1.1","1.3","2.6","2.3","Multiple","1.9","2.2"
63,1,"Yes",,"Good",,"No",,"1.9","1.7","1.9","2","2.8","2.3","2.6","1.8","","2.4","0.7","5","0.7","3.4","20.7","10","34.8","7.9","8.9","6.5","3.2","3.2","2.2","1.2","1.1","3.7","3.3","Single","","2.7"
64,1,"Yes",,"Good",,"No",,"1.6","1.6","1.2","1","1.4","1.3","1.5","2","","","0.4","3.2","0.4","1.9","7.8","4","13","4.7","5.1","3.7","1.8","1.6","1.3","0.9","0.9","1.8","2","single","1.1","1.2"
65,1,"Yes",,"Good",,"No",,"2.1","2","1.8","1.8","2.4","1.9","2.4","2.8","","2.5","0.6","4.8","0.7","3.3","17.9","9","30.2","8.6","9.1","7.5","3.4","2.8","2.4","1.2","1.1","2.9","2.8",,"2.5","2.5"
66,1,"Yes",,"Good",,"No",,"1.9","2.2","1.6","1.9","2","1.8","1.9","3.6","2.3","4","0.6","4.7","0.6","3.1","18.3","8.4","27.9","7.8","8.4","6.3","3.1","3.2","2.1","1.4","1.5","2.9","2.8","single","","2.8"
67,1,"Yes",,"Good",,"No",,"1.4","1.5","1.4","1.5","2","1.7","1.7","2.4","1.8","2.5","0.5","3.9","0.5","2.7","11.3","5.6","17.8","5.5","6","4.5","2.5","2.4","1.9","1.4","1.1","2.2","2.1","Multiple","","2.2"
68,1,"Yes",,"Good",,"No",,"1.7","1.4","1.4","1.6","2.4","1.9","1.7","2","1.5","2","0.6","4.3","0.7","3","14.8","6.9","24.9","6.9","7.5","5.5","2.2","2.2","2.5","1.5","1.5","2.8","2.7","Single","","2.8"
69,1,"No","Missing protocol image",,,,,,,,,,,,,,,,,,,,,,,,,,,,,,,,"Unable to measure ascending aorta, all of the LV wall at the SAX imaging of the LV at the level of the pap muscles, and the apical 4 chamber of the LV appears foreshortened",,
70,2,"Yes",,"Good",,"No",,"1","1.1","1.1","1.2","1.5","1.4","1.5","1.9","1.2","1.8","0.3","3.3","0.4","2","8.3","3.6","12.6","5.5","5.9","4.1","1.9","1.9","1.2","0.8","0.9","2.2","2.2",,"1.5",""
71,2,"Yes",,"Excellent",,"No",,"1.4","1.3","1.2","1.4","2","1.7","1.8","1.9","1.1","2.3","0.4","4.1","0.5","2.6","13.2","5.7","19.1","5.9","6.5","4.5","2","2.2","1.9","1.1","1.2","2.3","2.5",,"2.1",""
72,2,"No","missing protocol images",,,,,"","","","","","","","","","","","","","","","","","","","","","","","","","","","Unable to measure LV SAX from captured images.","",""
73,2,"Yes",,"Good",,"No",,"0.7","0.7","0.8","0.8","1.2","0.8","0.9","1.4","1.4","2","0.3","2.2","0.3","1.2","3.9","1.7","6.9","4.1","4.4","3","1.3","1.1","1.2","0.5","0.6","1.1","1.2",,"","0.8"
74,2,"Yes",,"Excellent",,"No",,"1.4","1.3","1.4","1.8","2.2","2","2.1","1.9","2.1","2.8","0.7","4.5","0.7","2.7","14.9","6.8","26.3","7.5","8.1","6.4","2.9","2.7","1.8","1.2","1.4","2.6","2.3","All measures available--excellent quality study in completeness and image quality","2","1.6"
75,2,"Yes",,"Excellent",,"No",,"1.4","1.5","1.4","1.4","1.9","1.6","1.8","2.2","1.5","2.4","0.5","3.8","0.5","2.2","10.9","5.2","17.5","6.5","7","4.8","1.8","2.2","1.9","1","1","2.2","2.3",,"","2.1"
76,2,"No","missing protocol images",,,,,,,,,,,,,,,,,,,,,,,,,,,,,,,,"Poor image quality made protocol measures difficult: unable to measure Ao root and arch dimensions; CA's; MV A/P diameter; RPA and LPA",,
77,2,"Yes",,"Good",,"No",,"1.6","1.1","1.2","1.3","1.9","1.5","1.5","1.7","1.6","2.1","0.4","4","0.4","2.2","12.4","4.9","18.5","6.2","6.7","4.7","2.6","2.1","1.8","1","1.1","2.3","2.2",,"1.9",""
78,2,"Yes",,"Good",,"No",,"0.8","0.7","0.6","0.7","0.9","0.8","0.7","0.7","1.1","1.4","0.4","2.1","0.4","1.6","3.6","1.7","6.1","3.3","3.6","2.7","1.4","1.2","0.8","0.4","0.4","1.1","1","pfo","0.7","0.7"
79,2,"Yes",,"Excellent",,"No",,"1.6","1.3","1.3","1.6","2.3","1.9","1.7","1.5","2.7","3.3","0.6","3.8","0.6","2.7","13","6.6","21.6","6.6","7","4.9","2.3","2.4","2.1","1.2","1.3","2.7","2.5",,"","1.9"
80,2,"No","missing protocol images",,,,,,,,,,,,,,,,,,,,,,,,,,,,,,,,"Overall good quality study:could not extract LV SAX dimensions. Unable to measure LAD, RPA and LPA.",,
81,2,"Yes",,"Good",,"No",,"1","0.8","0.8","1","1.4","1.1","1.1","1.6","1.6","2.7","0.4","3.5","0.4","1.9","8.6","3.9","14","5.2","5.6","3.7","1.4","1.5","1.3","0.7","0.9","1.5","1.6",,"1.7","1.1"
82,2,"No","missing protocol image",,,,,"","","","","","","","","","","","","","","","","","","","","","","","","","","","Unable to measure the pulmonary valve from the long or short axis from available images.","",""
83,2,"Yes",,"Excellent",,"No",,"1.9","1.6","1.5","2","2.4","2","2.2","2.3","","3.3","0.6","5","0.7","3.2","21.2","9.7","33.9","9.3","10.2","7.6","3.1","2.5","2.2","1.6","1.6","4","3.4",,"","2.8"
84,2,"Yes",,"Excellent",,"No",,"2.2","","1.7","1.6","2.2","1.8","1.8","","","2.6","0.8","4.2","0.8","2.6","14.7","7.7","26.3","8.4","9","6.5","2.2","2.4","2","1.2","1.1","2.5","2.6",,"2.2",""
85,2,"Yes",,"Excellent",,"No",,"1.8","1.5","1.8","2","2.7","2.1","2.1","3.4","2.4","2.9","0.8","4.4","0.8","2.6","16.3","6.6","31.2","8.5","9.2","6.8","2.6","2.6","2.2","1.6","","3.3","3",,"","2.7"
86,2,"Yes",,"Good",,"No",,"2.6","2.1","1.9","2","3.9","2.9","2.8","4.5","3.1","4.1","0.7","5.5","0.7","3.4","22.5","12.1","35.7","9.1","9.9","7.3","2.9","3.1","2.7","1.4","1.5","3.6","4",,"","2.9"
87,2,"Yes",,"Excellent",,"No",,"1.6","1.5","1.5","1.8","2.4","1.8","2.1","3.4","2.2","3.2","0.8","4.3","0.8","2.6","16.7","6.2","28.7","7.7","8.3","5.6","2.7","2.8","2.2","1","1.2","2.5","2.5",,"2.8","2.3"
88,2,"Yes",,"Excellent",,"No",,"1.7","1.4","1.2","1.5","2.5","2.1","2.2","3","","2.9","0.7","3.7","0.6","2.4","12","5.9","20.6","6.2","6.7","4.6","1.8","2.2","1.9","1.2","1.4","2.5","2.6",,"2.2",""
89,2,"Yes",,"Excellent",,"No",,"1.2","1","1","1.4","2","1.5","1.5","2","1.7","2.2","0.6","3.8","0.6","2.3","11.4","5.3","19.7","5.6","6.5","4.1","1.9","2.1","1.6","1.1","1.2","2.1","2.2",,"1.5","1.6"
90,2,"Yes",,"Good",,"No",,"1.3","1.3","1.2","1.6","2.1","1.6","1.9","3","2.6","3","0.5","3.9","0.7","2.4","11.8","5.8","20.9","7.1","7.9","5.7","2.3","2.3","1.7","1","1.1","2.4","2.4",,"1.5",""
91,2,"Yes",,"Good",,"No",,"2.2","2.2","2.4","1.9","2.4","2","1.9","","","3","0.7","5","0.7","2.8","17.5","6.8","29.7","8.4","8.9","6.3","3.3","2.9","2.2","1.3","1.5","3.3","3.4",,"2.2",""
92,2,"Yes",,"Good",,"No",,"0.6","0.6","0.6","0.9","1.3","1","1.1","1.3","1.4","1.2","0.3","1.7","0.3","1.1","2.1","1.1","3.7","3.7","4.1","2.8","1.1","1.2","0.9","0.5","0.6","1.1","1.2","pfo","0.9","1"
93,2,"Yes",,"Good",,"No",,"","","","1.9","2.4","2","2","2.4","","3.2","0.9","5","0.9","3.3","17.6","10.4","34.3","8","8.9","6.2","3","3.1","1.9","1.3","1.4","3.2","2.9",,"2.2","2.4"
94,2,"Yes",,"Good",,"No",,"0.8","0.7","0.5","0.7","1.2","1","0.9","1.6","","","0.3","2.5","0.3","1.5","4.8","2.6","7.6","3.9","4.2","3","1.1","1.2","0.8","0.6","0.7","1.1","1.4",,"1","0.9"
95,2,"Yes",,"Excellent",,"No",,"1.3","0.9","0.9","1.4","1.7","1.6","1.6","2.1","2.1","2.2","0.5","3.9","0.4","2.5","12.2","5.6","19.4","5.6","6.4","4.5","2.1","2","1.7","0.7","0.9","2.1","1.8",,"","1.9"
96,2,"Yes",,"Excellent",,"No",,"1.4","1.2","1.1","1.4","2","1.7","1.7","2","1.8","3","0.8","3.3","0.7","2.3","9.4","5.3","17","5.7","6.2","4.4","1.9","1.8","1.5","1.1","1","2.3","2.4",,"2.1","1.9"
97,2,"Yes",,"Good",,"No",,"0.9","0.9","1","1.1","1.5","1.3","1.3","1.2","1.2","2","0.4","3.4","0.4","2.1","9.2","4.5","13.8","5","5.5","3.8","1.8","1.7","1.4","0.8","0.9","1.7","2",,"1.4",""
98,2,"Yes",,"Excellent",,"No",,"0.9","1","0.9","1.1","1.6","1.4","1.4","1.7","","1.9","0.4","3.4","0.4","2.1","8.5","4.6","13.7","5.1","5.6","3.8","1.9","1.7","1.3","0.7","0.7","1.4","1.4",,"1.2","1.5"
99,2,"No","missing protocol image",,,,,"","","","","","","","","","","","","","","","","","","","","","","","","","","","Missing image of LV SAX at the level of the papillary muscles","",""
100,2,"Yes",,"Excellent",,"No",,"0.8","0.6","0.5","0.7","1.2","0.9","1.1","1.5","0.8","1.5","0.3","1.7","0.3","1.2","2.2","1.4","4","3.6","3.9","2.6","1.1","1.1","0.7","0.4","0.4","1","1.1",,"0.8","0.8"
101,2,"No","missing protocol images",,,,,"1.4","1.2","1.2","1.4","1.9","1.5","1.5","2.6","1.7","2.4","","","","","","","","5.8","6.6","4.4","2.7","2.2","1.6","0.8","1","2.4","2.2","Missing SAX image of the LV at the level of the papillary muscles.","1.7","1.7"
102,2,"Yes",,"Excellent",,"No",,"1.1","1.2","1.2","1.4","1.8","1.5","1.6","1.8","2.1","2.6","0.5","3.9","0.5","2.2","12","4.5","19.8","6.3","6.8","4.4","2","2.1","1.8","1.2","1.1","2.3","2.3",,"1.8",""
103,2,"Yes",,"Excellent",,"No",,"1.2","1","1","1.3","1.9","1.7","1.6","1.9","1.8","2.1","0.4","3.3","0.4","2.2","8.6","4.9","13.5","5.4","6","3.8","2","2.1","1.6","0.9","1","2.2","1.8",,"1.6","1.2"
104,2,"Yes",,"Good",,"No",,"1.9","1.6","1.4","1.9","2.4","2","2.2","3.1","2","3.4","0.6","4.6","0.6","3.3","18.7","9.9","29.9","6.5","7.4","5.1","2.7","2.6","2","1","1","2.9","2.6",,"1.8",""
105,2,"Yes",,"Excellent",,"No",,"0.6","0.6","0.7","0.7","1","0.8","0.9","1.2","0.9","1.1","0.4","2.1","0.4","1.6","3.6","2","6.8","3.5","3.8","2.8","1.1","1.2","0.9","0.5","0.5","1.1","1",,"0.9","0.9"
106,2,"Yes",,"Good",,"No",,"1.5","1.4","1.4","1.8","2.4","2.3","2.3","1.9","1.5","2.7","0.5","3.7","0.6","2.8","11.3","6.6","18","6.5","7","5.1","2.4","2.5","2.1","1","1.2","2.3","2.9",,"2.2","2.1"
107,2,"Yes",,"Excellent",,"No",,"1.7","1.1","1.2","1.6","2.2","1.9","2.1","2.6","2.1","5.2","0.5","4.3","0.5","2.5","13.7","6.2","21","6.2","6.7","4.6","2","2.4","1.5","1","1.2","2.3","2.4",,"1.6","1.8"
108,2,"Yes",,"Good",,"No",,"1.4","1.2","1.1","1.3","1.7","1.5","1.5","1.9","1.7","3.6","0.6","3.3","0.6","2.2","8.7","4.2","14.9","5.3","5.7","3.7","1.7","1.7","1.2","1","0.9","1.9","1.9",,"1.7","1.6"
109,2,"Yes",,"Excellent",,"No",,"1","1.1","0.8","1.1","1.4","1.2","1.3","2","1.3","2.2","0.4","3.4","0.4","2.2","8.5","4.3","12.3","4.8","5.3","3.4","1.4","1.5","1.4","0.9","0.9","1.6","1.7",,"1.4","1.3"
110,2,"Yes",,"Excellent",,"No",,"1.1","0.8","0.8","1.2","1.7","1.5","1.6","2","1","1.9","0.4","3.7","0.4","2.1","9.9","4.5","15.4","5.1","5.7","3.8","1.8","1.7","1.4","1","0.9","1.8","1.8",,"1.5","1.8"
111,2,"Yes",,"Excellent",,"No",,"1.9","1.5","1.2","1.7","2.5","2.1","2.1","2.2","","2.4","0.5","4.3","0.5","2.9","14.4","8.1","21.4","6.9","7.5","5.4","2.8","2.1","2.3","1.2","1.2","2.4","2.7",,"","2.5"
112,2,"Yes",,"Good",,"No",,"0.7","0.6","0.6","0.8","1.1","1","0.8","1.4","0.8","1.2","0.5","2.1","0.5","1.1","3","1.1","6.1","4.1","4.3","3","1.3","1.2","0.9","0.5","0.5","1.1","1.3",,"1",""
113,2,"Yes",,"Good",,"No",,"0.7","0.6","0.6","0.6","1","0.8","1","1.4","","1.8","0.3","2.4","0.3","1.5","3.8","2.1","6","3.9","4.1","2.9","1.3","1.1","0.8","","","1","1.4",,"0.8","0.8"
114,2,"Yes",,"Excellent",,"No",,"1.7","1.5","1.3","1.6","2.2","1.7","1.7","2.7","1.7","3.9","0.6","3.7","0.5","2.2","11.5","5.4","18.9","6","6.6","4.1","2.1","1.8","2","1.2","1.4","2.4","2.5",,"2.3","2"