f001_age,f001_6to19,GENDER,RACE,MORESPEC,OTHRSPEC,HISPANIC,ANASPEC,dx1,dx2,dx3,dx4,dx5,f001_dx,f001_dxcat,vent_type,lloop,twovent,reclassified,RECLASS,WKSHCOMP,fontan_prior,fontan_gt6,fontan,fontancat,FONPROL1,FONPROL2,FONPROL3,FONPROL4,CONPRO_N,conpro,CONPRO1_0,CONPRO1_1,CONPRO1_2,CONPRO1_3,CONPRO1_4,CONPRO1S_0,CONPRO1S_1,CONPRO1S_2,CONPRO1S_3,CONPRO1S_4,FONTANRV,fontanrv_prior,fontanrv_gt6,PHNCARE,ACEINHIB,ACE_NAME,ACE_SP,lastvisit_prior,lastvisit_gt6,DEPRESVF,DEVDELAY,LEARNDIS,ATRIALTA,VENTTACH,PACEMAKER,THROMBOS,STROKE,NEURODEF,ENTEROPA,INTERVT6,interv_prior,interv_gt6,ELIGIBLE,FORMSTAT_ID,FORM_ID,VER_ID,DESTATUS,F01A_COMP_AGE,FONTAN_AGE,FONTANRV_AGE,LASTVIS_AGE,INTERV_AGE,subj_id,site_ID
18.800821355,1:YES,1:MALE,3:Other,-2,-2,2:NO,-2,A1,04,04,,,"A1.04.04: SV, TA, L-loop, TGA (Type 3)","A1.04: SV, TA",1:LV,1:YES,2:NO,1:YES,4:Revision and expansion of category code assignments,2:NO,171.18421053,1:YES,"B2.02.01.02: SV Physiologic Repair, Fontan, Atriopulmonary connection, w/ lateral tunnel",B2.02.01,B2,02,01,02,0,,,,,,,,,,,,2:NO,-2,-2:N/A,2:NO,-2:N/A,-2,-2,,,-2:N/A,-2:N/A,-2,-2:N/A,-2:N/A,-2,-2:N/A,-2,-2:N/A,-2,-2:N/A,,,2:NO,1661,F001,A,C,19.32,4.55,,,,277,5
18.770704997,1:YES,2:FEMALE,1:White,-2,-2,2:NO,-2,A1,01,01,01,01,"A1.01.01.01.01: SV, DILV, {S,L,L/D/I} Outlet chamber, Large VSD, No PS/PA","A1.01: SV, DILV",1:LV,1:YES,2:NO,1:YES,3:Additional choices added to category level,2:NO,175.46052632,1:YES,"B2.02.01.01: SV Physiologic Repair, Fontan, Atriopulmonary connection, w/ ASD closure",B2.02.01,B2,02,01,01,2,1 99,01:PATCH REPAIR OF PA STENOSIS,99:OTHER,,,,,Patch closure of Atrio-ventricular valve,.,.,.,2:NO,-2,-2:N/A,2:NO,-2:N/A,-2,-2,,,-2:N/A,-2:N/A,-2,-2:N/A,-2:N/A,-2,-2:N/A,-2,-2:N/A,-2,-2:N/A,,,2:NO,1662,F001,A,C,19.27,4.17,,,,110,5
18.724161533,1:YES,1:MALE,-8,-2,-2,-8:UNKNOWN,-2,A1,03,03,03,,"A1.03.03.03: SV, MA, {S,L,L/D/I}, PS","A1.03: SV, MA",2:RV,1:YES,2:NO,2:NO,"-1:None, not reclassified",2:NO,30.625,1:YES,"B2.02.05.02: SV Physiologic Repair, Fontan, TCPC extracardiac conduit, Nonfenestrated",B2.02.05,B2,02,05,02,4,11 99 99 99,11:PACEMAKER INSERTION,99:OTHER,99:OTHER,99:OTHER,,,creation of atrial septal defect,Bidirectional Cavopulmonary Shunt,Atrial Maze Procedure,.,2:NO,-2,-2:N/A,2:NO,-2:N/A,-2,-2,,,-2:N/A,-2:N/A,-2,-2:N/A,-2:N/A,-2,-2:N/A,-2,-2:N/A,-2,-2:N/A,,,2:NO,1663,F001,A,C,19.27,16.18,,,,442,5
18.721423682,1:YES,1:MALE,1:White,-2,-2,2:NO,-2,A1,01,01,01,03,"A1.01.01.01.03: SV, DILV, {S,L,L/D/I} Outlet chamber, Large VSD, PA","A1.01: SV, DILV",1:LV,1:YES,2:NO,1:YES,3:Additional choices added to category level,2:NO,4.8026315789,2:NO,"B2.02.04.02: SV Physiologic Repair, Fontan, TCPC extracardiac lateral tunnel, Nonfenestrated",B2.02.04,B2,02,04,02,4,11 99 99 99,11:PACEMAKER INSERTION,99:OTHER,99:OTHER,99:OTHER,,,Bilateral Maze Procedure,Right Bidirectional Cavopulmonary shunt,atrial resection,.,2:NO,-2,-2:N/A,2:NO,-2:N/A,-2,-2,,,-2:N/A,-2:N/A,-2,-2:N/A,-2:N/A,-2,-2:N/A,-2,-2:N/A,-2,-2:N/A,,,2:NO,1664,F001,A,C,19.13,18.32,,,,123,5
18.587268994,1:YES,2:FEMALE,-8,-2,-2,-8:UNKNOWN,-2,A1,04,01,02,,"A1.04.01.02: SV, TA, D-loop, no TGA, Pulm. hypoplasia, Small VSD (Type 1b)","A1.04: SV, TA",1:LV,2:NO,2:NO,1:YES,4:Revision and expansion of category code assignments,2:NO,159.76973684,1:YES,"B2.02.02: SV Physiologic Repair, Fontan, Atrioventricular connection (Bjork)",B2.02.02,B2,02,02,,3,1 99 99,01:PATCH REPAIR OF PA STENOSIS,99:OTHER,99:OTHER,,,,takedown on (R) Blalock-Taussig Shunt,Suture Closure of Atrial Septal Defect,.,.,-8:UNKNOWN,-2,-2:N/A,2:NO,-2:N/A,-2,-2,,,-2:N/A,-2:N/A,-2,-2:N/A,-2:N/A,-2,-2:N/A,-2,-2:N/A,-2,-2:N/A,,,2:NO,1665,F001,A,C,19.09,5.29,,,,295,5
18.472279261,1:YES,2:FEMALE,1:White,-2,-2,2:NO,-2,A1,04,01,03,,"A1.04.01.03: SV, TA, D-loop, no TGA, No pulm. hypoplaisa, Large VSD (Type 1c)","A1.04: SV, TA",1:LV,2:NO,2:NO,1:YES,4:Revision and expansion of category code assignments,2:NO,176.97368421,1:YES,"B2.02.01.01: SV Physiologic Repair, Fontan, Atriopulmonary connection, w/ ASD closure",B2.02.01,B2,02,01,01,2,5 99,05:LIGATION OF MAIN PULMOMARY ARTERY,99:OTHER,,,,,modified (r) Glenn Shunt,.,.,.,2:NO,-2,-2:N/A,2:NO,-2:N/A,-2,-2,,,-2:N/A,-2:N/A,-2,-2:N/A,-2:N/A,-2,-2:N/A,-2,-2:N/A,-2,-2:N/A,,,2:NO,1666,F001,A,C,18.97,3.74,,,,107,5
18.422997947,1:YES,1:MALE,3:Other,-2,-2,2:NO,-2,A1,06,01,02,,"A1.06.01.02: SV, Heterotaxia syndrome, DORV w/ AVCD, Polysplenia","A1.06: SV, Heterotaxia syndrome",3:MIXED,2:NO,1:YES,1:YES,99:Other,2:NO,179.80263158,1:YES,"B2.02.01.02: SV Physiologic Repair, Fontan, Atriopulmonary connection, w/ lateral tunnel",B2.02.01,B2,02,01,02,2,1  2,02:REPAIR OF AV VALVE FOR REGURGITATION,01:PATCH REPAIR OF PA STENOSIS,,,,,-2,.,.,.,2:NO,-2,-2:N/A,2:NO,-2:N/A,-2,-2,,,-2:N/A,-2:N/A,-2,-2:N/A,-2:N/A,-2,-2:N/A,-2,-2:N/A,-2,-2:N/A,,,2:NO,1667,F001,A,C,19.19,3.46,,,,49,5
18.412046543,1:YES,2:FEMALE,1:White,-2,-2,2:NO,-2,A1,02,01,01,,"A1.02.01.01: SV, DIRV, DORV, No PS/PA","A1.02: SV, DIRV",2:RV,2:NO,2:NO,1:YES,3:Additional choices added to category level,2:NO,177.46710526,1:YES,"B2.02.01.02: SV Physiologic Repair, Fontan, Atriopulmonary connection, w/ lateral tunnel",B2.02.01,B2,02,01,02,2,5 99,05:LIGATION OF MAIN PULMOMARY ARTERY,99:OTHER,,,,,bidirectional cavopulmonary anastomosis,.,.,.,2:NO,-2,-2:N/A,2:NO,-2:N/A,-2,-2,,,-2:N/A,-2:N/A,-2,-2:N/A,-2:N/A,-2,-2:N/A,-2,-2:N/A,-2,-2:N/A,,,2:NO,1668,F001,A,C,18.9,3.64,,,,128,5
18.360027379,1:YES,1:MALE,4,-2,-2,2:NO,-2,A1,07,01,,,"A1.07.01: SV, Other SV, Mostly LV","A1.07: SV, Other SV",1:LV,2:NO,2:NO,2:NO,"-1:None, not reclassified",2:NO,119.70394737,1:YES,"B2.02.04.01: SV Physiologic Repair, Fontan, TCPC extracardiac lateral tunnel, Fenestrated",B2.02.04,B2,02,04,01,1,99,99:OTHER,,,,,Resection of Subaortic Stenosis,.,.,.,.,2:NO,-2,-2:N/A,2:NO,-2:N/A,-2,-2,,,-2:N/A,-2:N/A,-2,-2:N/A,-2:N/A,-2,-2:N/A,-2,-2:N/A,-2,-2:N/A,,,2:NO,1669,F001,A,C,18.89,8.4,,,,498,5
18.346338125,1:YES,2:FEMALE,1:White,-2,-2,-8:UNKNOWN,-2,A1,01,01,01,03,"A1.01.01.01.03: SV, DILV, {S,L,L/D/I} Outlet chamber, Large VSD, PA","A1.01: SV, DILV",1:LV,1:YES,2:NO,1:YES,3:Additional choices added to category level,2:NO,158.42105263,1:YES,"B2.02.01.02: SV Physiologic Repair, Fontan, Atriopulmonary connection, w/ lateral tunnel",B2.02.01,B2,02,01,02,3,3 99 99,03:ATRIAL SEPTECTOMY,99:OTHER,99:OTHER,,,,Glenn procedure,Ligation of RT Blalock-Taussig shunt,.,.,2:NO,-2,-2:N/A,2:NO,-2:N/A,-2,-2,,,-2:N/A,-2:N/A,-2,-2:N/A,-2:N/A,-2,-2:N/A,-2,-2:N/A,-2,-2:N/A,,,2:NO,1670,F001,A,C,18.75,5.16,,,,173,5
18.231348392,1:YES,2:FEMALE,1:White,-2,-2,2:NO,-2,A1,04,03,02,,"A1.04.03.02: SV, TA, D-loop, TGA, PS/subPS (Type 2b)","A1.04: SV, TA",1:LV,2:NO,2:NO,1:YES,4:Revision and expansion of category code assignments,2:NO,167.89473684,1:YES,"B2.02.01.01: SV Physiologic Repair, Fontan, Atriopulmonary connection, w/ ASD closure",B2.02.01,B2,02,01,01,1,99,99:OTHER,,,,,Resection of subaortic stenosis,.,.,.,.,2:NO,-2,-2:N/A,2:NO,-2:N/A,-2,-2,,,-2:N/A,-2:N/A,-2,-2:N/A,-2:N/A,-2,-2:N/A,-2,-2:N/A,-2,-2:N/A,,,2:NO,1671,F001,A,C,18.7,4.26,,,,53,5
18.239561944,1:YES,2:FEMALE,1:White,-2,-2,2:NO,-2,A3,01,,,,"A3.01: Other functional SV, PA w/ intact ventr. septum",A3: Other functional SV not fitting any other categories,1:LV,2:NO,2:NO,2:NO,"-1:None, not reclassified",2:NO,134.93421053,1:YES,"B2.02.01.01: SV Physiologic Repair, Fontan, Atriopulmonary connection, w/ ASD closure",B2.02.01,B2,02,01,01,2,1 99,01:PATCH REPAIR OF PA STENOSIS,99:OTHER,,,,,Takedown of central (CVPS) and BT shunts,.,.,.,2:NO,-2,-2:N/A,1:YES,2:NO,-2,-2,5.7236842105,2,2:NO,2:NO,1:YES,2:NO,2:NO,3:NEVER,1:YES,2:NO,2:NO,2:NO,2:NO,,,1:YES,1672,F001,A,C,18.73,7.01,,17.76,11.47,510,5
18.031485284,1:YES,1:MALE,1:White,-2,-2,2:NO,-2,A1,04,03,03,,"A1.04.03.03: SV, TA, D-loop, TGA, Lg pulm. artery (Type 2c)","A1.04: SV, TA",1:LV,2:NO,2:NO,1:YES,4:Revision and expansion of category code assignments,2:NO,177.76315789,1:YES,"B2.02.01.01: SV Physiologic Repair, Fontan, Atriopulmonary connection, w/ ASD closure",B2.02.01,B2,02,01,01,1,99,99:OTHER,,,,,Patch repair to previous atrio-pulmon. anastomosis,.,.,.,.,2:NO,-2,-2:N/A,2:NO,-2:N/A,-2,-2,,,-2:N/A,-2:N/A,-2,-2:N/A,-2:N/A,-2,-2:N/A,-2,-2:N/A,-2,-2:N/A,,,2:NO,1673,F001,A,C,18.49,3.24,,,,109,5
17.960301164,1:YES,1:MALE,1:White,-2,-2,2:NO,-2,A1,04,03,03,,"A1.04.03.03: SV, TA, D-loop, TGA, Lg pulm. artery (Type 2c)","A1.04: SV, TA",1:LV,2:NO,2:NO,1:YES,4:Revision and expansion of category code assignments,2:NO,31.184210526,1:YES,"B2.02.06.02: SV Physiologic Repair, Fontan, extracardiac conduit, Nonfenestrated",B2.02.06,B2,02,06,02,4,1 11 99 99,01:PATCH REPAIR OF PA STENOSIS,99:OTHER,99:OTHER,11:PACEMAKER INSERTION,,,Creation of ASD,Bidirectional cavopulmonary shunt,-2,.,2:NO,-2,-2:N/A,1:YES,1:YES,"13.07:LISINOPRIL (PRINIVIL, ZESTRIL)",-2,1.5131578947,2,2:NO,1:YES,1:YES,1:YES,2:NO,1:CURRENT,1:YES,1:YES,1:YES,2:NO,1:YES,1.5131578947,2:NO,2:NO,1674,F001,A,C,18.41,15.36,,17.83,17.83,989,5
17.801505818,1:YES,1:MALE,1:White,-2,-2,2:NO,-2,A3,03,03,,,"A3.03.03: Other functional SV, TV anomaly, Ebstein's",A3: Other functional SV not fitting any other categories,1:LV,2:NO,2:NO,2:NO,"-1:None, not reclassified",2:NO,52.401315789,1:YES,"B2.02.06.02: SV Physiologic Repair, Fontan, extracardiac conduit, Nonfenestrated",B2.02.06,B2,02,06,02,3,99 99 99,99:OTHER,99:OTHER,99:OTHER,,,Pacemaker replacement,Cryoablation,Creation of ASD,.,.,2:NO,-2,-2:N/A,2:NO,-2:N/A,-2,-2,,,-2:N/A,-2:N/A,-2,-2:N/A,-2:N/A,-2,-2:N/A,-2,-2:N/A,-2,-2:N/A,,,2:NO,1675,F001,A,C,18.29,13.44,,,,1046,5
17.70568104,1:YES,1:MALE,1:White,-2,-2,-8:UNKNOWN,-2,A1,01,01,02,01,"A1.01.01.02.01: SV, DILV, {S,L,L/D/I} Outlet chamber, Small VSD, No PS/PA","A1.01: SV, DILV",1:LV,1:YES,2:NO,1:YES,3:Additional choices added to category level,2:NO,98.190789474,1:YES,"B2.02.01.02: SV Physiologic Repair, Fontan, Atriopulmonary connection, w/ lateral tunnel",B2.02.01,B2,02,01,02,0,,,,,,,,,,,,2:NO,-2,-2:N/A,1:YES,-8:UNKNOWN,-2,-2,98.190789474,1,-8:UNKNOWN,-8:UNKNOWN,-8:UNKNOWN,-8:UNKNOWN,-8:UNKNOWN,3:NEVER,-9:MISSING,-8:UNKNOWN,-8:UNKNOWN,-8:UNKNOWN,-8:UNKNOWN,,,1:YES,1676,F001,A,C,18.09,9.53,,9.53,9.53,812,5
17.593429158,1:YES,2:FEMALE,1:White,-2,-2,-8:UNKNOWN,-2,A1,01,01,02,02,"A1.01.01.02.02: SV, DILV, {S,L,L/D/I} Outlet chamber, Small VSD, PS","A1.01: SV, DILV",1:LV,1:YES,2:NO,1:YES,3:Additional choices added to category level,2:NO,180.42763158,1:YES,"B2.02.01.01: SV Physiologic Repair, Fontan, Atriopulmonary connection, w/ ASD closure",B2.02.01,B2,02,01,01,3,5  7 99,07:AV VALVE OVERSEWN,05:LIGATION OF MAIN PULMOMARY ARTERY,99:OTHER,,,,,Glenn anastomosis,.,.,2:NO,-2,-2:N/A,1:YES,2:NO,-2,-2,7.5328947368,1,2:NO,2:NO,2:NO,2:NO,2:NO,3:NEVER,2:NO,2:NO,2:NO,2:NO,2:NO,,,1:YES,1677,F001,A,C,17.98,2.58,,16.97,2.58,458,5
17.522245038,1:YES,2:FEMALE,1:White,-2,-2,2:NO,-2,A1,01,01,02,02,"A1.01.01.02.02: SV, DILV, {S,L,L/D/I} Outlet chamber, Small VSD, PS","A1.01: SV, DILV",1:LV,1:YES,2:NO,1:YES,3:Additional choices added to category level,2:NO,165.95394737,1:YES,"B2.02.01.02: SV Physiologic Repair, Fontan, Atriopulmonary connection, w/ lateral tunnel",B2.02.01,B2,02,01,02,2,99 99,99:OTHER,99:OTHER,,,,Creation of ASD,VSD enlarged,.,.,.,2:NO,-2,-2:N/A,1:YES,2:NO,-2,-2,4.6381578947,2,2:NO,2:NO,3:POSSIBLE,2:NO,2:NO,3:NEVER,2:NO,2:NO,2:NO,2:NO,2:NO,,,1:YES,1678,F001,A,C,17.95,3.71,,17.14,13.51,427,5
17.475701574,1:YES,1:MALE,4,-2,-2,2:NO,-2,A1,07,03,,,"A1.07.03: SV, Other SV, Indeterminate","A1.07: SV, Other SV",3:MIXED,2:NO,2:NO,2:NO,"-1:None, not reclassified",2:NO,170.88815789,1:YES,"B2.02.01.02: SV Physiologic Repair, Fontan, Atriopulmonary connection, w/ lateral tunnel",B2.02.01,B2,02,01,02,3,1 99 99,99:OTHER,01:PATCH REPAIR OF PA STENOSIS,99:OTHER,,,PDA,,Division of right BT shunt,.,.,2:NO,-2,-2:N/A,2:NO,-2:N/A,-2,-2,,,-2:N/A,-2:N/A,-2,-2:N/A,-2:N/A,-2,-2:N/A,-2,-2:N/A,-2,-2:N/A,,,2:NO,1679,F001,A,C,17.96,3.25,,,,374,5
17.379876797,1:YES,1:MALE,1:White,-2,-2,2:NO,-2,A1,01,06,02,02,"A1.01.06.02.02: SV, DILV, {I,D,D/L/I} Outlet chamber, Small VSD, PS","A1.01: SV, DILV",1:LV,2:NO,2:NO,1:YES,3:Additional choices added to category level,1:YES,155.29605263,1:YES,"B2.02.01.02: SV Physiologic Repair, Fontan, Atriopulmonary connection, w/ lateral tunnel",B2.02.01,B2,02,01,02,2,99 99,99:OTHER,99:OTHER,,,,Enlargement of VSD,Right bidirectional cavopulmonary shunt,.,.,.,2:NO,-2,-2:N/A,2:NO,-2:N/A,-2,-2,,,-2:N/A,-2:N/A,-2,-2:N/A,-2:N/A,-2,-2:N/A,-2,-2:N/A,-2,-2:N/A,,,2:NO,1680,F001,A,C,17.8,4.45,,,,553,5
17.242984257,1:YES,1:MALE,1:White,-2,-2,1:YES,-2,A1,03,03,03,,"A1.03.03.03: SV, MA, {S,L,L/D/I}, PS","A1.03: SV, MA",2:RV,1:YES,2:NO,2:NO,"-1:None, not reclassified",2:NO,167.00657895,1:YES,"B2.02.01.02: SV Physiologic Repair, Fontan, Atriopulmonary connection, w/ lateral tunnel",B2.02.01,B2,02,01,02,0,,,,,,,,,,,,2:NO,-2,-2:N/A,1:YES,1:YES,13.06:FOSINOPRIL (MONOPRIL),-2,8.4210526316,1,2:NO,2:NO,1:YES,2:NO,2:NO,3:NEVER,2:NO,2:NO,2:NO,2:NO,2:NO,,,1:YES,1681,F001,A,C,17.73,3.34,,16.54,12.79,314,5
17.256673511,1:YES,1:MALE,3:Other,-2,-2,2:NO,-2,A1,05,02,03,,"A1.05.02.03: SV, Unbalanced AVCD, Left dominant, PA","A1.05: SV, Unbalanced AVCD",1:LV,2:NO,2:NO,1:YES,2:Additional levels added to diagnosis category,1:YES,38.881578947,1:YES,"B2.02.05.01: SV Physiologic Repair, Fontan, TCPC extracardiac conduit, Fenestrated",B2.02.05,B2,02,05,01,2,1 99,01:PATCH REPAIR OF PA STENOSIS,99:OTHER,,,,,Takedown L BT shunt,.,.,.,2:NO,-2,-2:N/A,1:YES,2:NO,-2,-2,1.5131578947,2,2:NO,2:NO,2:NO,2:NO,2:NO,3:NEVER,2:NO,2:NO,2:NO,2:NO,2:NO,,,1:YES,1682,F001,A,C,17.55,14.02,,17.13,15.3,401,5
17.166324435,1:YES,2:FEMALE,1:White,-2,-2,-8:UNKNOWN,-2,A3,04,01,01,,"A3.04.01.01: Other functional SV, D-loop DORV w/ 2 ventricles, 2 AV valves, No Ao or PS",A3: Other functional SV not fitting any other categories,3:MIXED,2:NO,1:YES,1:YES,2:Additional levels added to diagnosis category,1:YES,172.89473684,1:YES,"B2.02.01.02: SV Physiologic Repair, Fontan, Atriopulmonary connection, w/ lateral tunnel",B2.02.01,B2,02,01,02,1,99,99:OTHER,,,,,Left Glenn anastomosis to L superior vena cava,.,.,.,.,2:NO,-2,-2:N/A,1:YES,1:YES,13.04:ENALAPRIL (VASOTEC),-2,3.1578947368,2,2:NO,1:YES,1:YES,1:YES,2:NO,1:CURRENT,2:NO,2:NO,2:NO,2:NO,2:NO,,,1:YES,1683,F001,A,C,17.46,2.78,,16.9,8.38,293,5
17.108829569,1:YES,1:MALE,1:White,-2,-2,-8:UNKNOWN,-2,A1,03,03,01,,"A1.03.03.01: SV, MA, {S,L,L/D/I}, No PS/PA","A1.03: SV, MA",2:RV,1:YES,2:NO,2:NO,"-1:None, not reclassified",2:NO,167.03947368,1:YES,"B2.02.01.02: SV Physiologic Repair, Fontan, Atriopulmonary connection, w/ lateral tunnel",B2.02.01,B2,02,01,02,3,5 99 99,99:OTHER,05:LIGATION OF MAIN PULMOMARY ARTERY,99:OTHER,,,bidirectional Glenn shunt,,Pulmonary artery debanding,.,.,2:NO,-2,-2:N/A,1:YES,-8:UNKNOWN,-2,-2,139.11184211,1,-8:UNKNOWN,-8:UNKNOWN,-8:UNKNOWN,-8:UNKNOWN,-8:UNKNOWN,-8:UNKNOWN,-9:MISSING,-8:UNKNOWN,-8:UNKNOWN,-8:UNKNOWN,-8:UNKNOWN,,,1:YES,1684,F001,A,C,17.56,3.21,,5.53,5.3,491,5
17.029431896,1:YES,2:FEMALE,1:White,-2,-2,2:NO,-2,A1,04,04,03,,"A1.04.04.03: SV, TA, L-loop, TGA, PA","A1.04: SV, TA",1:LV,1:YES,2:NO,1:YES,4:Revision and expansion of category code assignments,1:YES,154.34210526,1:YES,"B2.02.01.02: SV Physiologic Repair, Fontan, Atriopulmonary connection, w/ lateral tunnel",B2.02.01,B2,02,01,02,1,99,99:OTHER,,,,,Enlargement of VSD,.,.,.,.,2:NO,-2,-2:N/A,1:YES,2:NO,-2,-2,4.7039473684,2,2:NO,2:NO,2:NO,1:YES,-8:UNKNOWN,3:NEVER,2:NO,2:NO,2:NO,2:NO,2:NO,,,1:YES,1685,F001,A,C,17.36,4.18,,16.64,6.69,151,5
17.015742642,1:YES,1:MALE,1:White,-2,-2,-8:UNKNOWN,-2,A1,01,01,02,02,"A1.01.01.02.02: SV, DILV, {S,L,L/D/I} Outlet chamber, Small VSD, PS","A1.01: SV, DILV",1:LV,1:YES,2:NO,1:YES,3:Additional choices added to category level,2:NO,163.28947368,1:YES,"B2.02.01.01: SV Physiologic Repair, Fontan, Atriopulmonary connection, w/ ASD closure",B2.02.01,B2,02,01,01,2,7 99,99:OTHER,07:AV VALVE OVERSEWN,,,,Enlargement of ventricular septal defect,-2,.,.,.,2:NO,-2,-2:N/A,1:YES,-8:UNKNOWN,-2,-2,51.085526316,1,-8:UNKNOWN,-8:UNKNOWN,-8:UNKNOWN,-8:UNKNOWN,-8:UNKNOWN,2:PAST,2:NO,-8:UNKNOWN,-8:UNKNOWN,-8:UNKNOWN,2:NO,,,1:YES,1686,F001,A,C,17.43,3.43,,12.76,4.98,782,5
17.199178645,1:YES,1:MALE,1:White,-2,-2,-8:UNKNOWN,-2,A1,06,01,01,,"A1.06.01.01: SV, Heterotaxia syndrome, DORV w/ AVCD, Asplenia","A1.06: SV, Heterotaxia syndrome",2:RV,2:NO,1:YES,2:NO,"-1:None, not reclassified",2:NO,162.36842105,1:YES,"B2.02.01.02: SV Physiologic Repair, Fontan, Atriopulmonary connection, w/ lateral tunnel",B2.02.01,B2,02,01,02,2,99 99,99:OTHER,99:OTHER,,,,PA debanding,Takedown of R BT shunt,.,.,.,2:NO,-2,-2:N/A,1:YES,1:YES,13.04:ENALAPRIL (VASOTEC),-2,5.2960526316,2,1:YES,2:NO,2:NO,1:YES,2:NO,1:CURRENT,1:YES,2:NO,2:NO,2:NO,2:NO,,,1:YES,1687,F001,A,C,17.46,3.69,,16.76,6.01,3,5
17.01026694,1:YES,1:MALE,1:White,-2,-2,-8:UNKNOWN,-2,A1,03,04,02,,"A1.03.04.02: SV, MA, {S,D,D/L/I}, PA","A1.03: SV, MA",2:RV,2:NO,2:NO,1:YES,3:Additional choices added to category level,1:YES,161.61184211,1:YES,"B2.02.01.02: SV Physiologic Repair, Fontan, Atriopulmonary connection, w/ lateral tunnel",B2.02.01,B2,02,01,02,3,1 99 99,01:PATCH REPAIR OF PA STENOSIS,99:OTHER,99:OTHER,,,,Takedown R & L Blalock Taussig shunts,Double Glenn procedure,.,.,2:NO,-2,-2:N/A,1:YES,2:NO,-2,-2,8.0592105263,1,2:NO,2:NO,1:YES,2:NO,2:NO,3:NEVER,2:NO,2:NO,2:NO,2:NO,2:NO,,,1:YES,1688,F001,A,C,17.38,3.56,,16.34,3.56,551,5
16.996577687,1:YES,2:FEMALE,1:White,-2,-2,-8:UNKNOWN,-2,A1,05,01,01,,"A1.05.01.01: SV, Unbalanced AVCD, Right dominant, No PS/PA","A1.05: SV, Unbalanced AVCD",2:RV,2:NO,2:NO,1:YES,2:Additional levels added to diagnosis category,1:YES,157.43421053,1:YES,"B2.02.01.02: SV Physiologic Repair, Fontan, Atriopulmonary connection, w/ lateral tunnel",B2.02.01,B2,02,01,02,2,2 99,02:REPAIR OF AV VALVE FOR REGURGITATION,99:OTHER,,,,,Pulmonary artery debanding,.,.,.,2:NO,-2,-2:N/A,1:YES,-8:UNKNOWN,-2,-2,11.776315789,1,-8:UNKNOWN,1:YES,3:POSSIBLE,-8:UNKNOWN,-8:UNKNOWN,-8:UNKNOWN,-9:MISSING,-8:UNKNOWN,-8:UNKNOWN,-8:UNKNOWN,-8:UNKNOWN,,,1:YES,1689,F001,A,C,17.27,3.89,,16.02,3.89,988,5
16.947296372,1:YES,1:MALE,1:White,-2,-2,-8:UNKNOWN,-2,A1,01,02,01,01,"A1.01.02.01.01: SV, DILV, {S,D,D/L/I} Outlet chamber, Large VSD, No PS/PA","A1.01: SV, DILV",1:LV,2:NO,2:NO,1:YES,3:Additional choices added to category level,2:NO,160.98684211,1:YES,"B2.02.01.02: SV Physiologic Repair, Fontan, Atriopulmonary connection, w/ lateral tunnel",B2.02.01,B2,02,01,02,3,99 99 99,99:OTHER,99:OTHER,99:OTHER,,,Damus-Kaye-Stansel procedure,Pulmonary artery debanding,Glenn,.,.,2:NO,-2,-2:N/A,1:YES,1:YES,13.05:ENALAPRILAT (VASOTEC),-2,6.6447368421,1,2:NO,2:NO,2:NO,2:NO,2:NO,3:NEVER,2:NO,3:POSSIBLE,-8:UNKNOWN,2:NO,2:NO,,,1:YES,1690,F001,A,C,17.33,3.55,,16.39,6.55,268,5
16.774811773,1:YES,1:MALE,3:Other,-2,-2,2:NO,-2,A1,02,01,02,,"A1.02.01.02: SV, DIRV, DORV, PS","A1.02: SV, DIRV",2:RV,2:NO,2:NO,1:YES,3:Additional choices added to category level,2:NO,158.35526316,1:YES,"B2.02.01.02: SV Physiologic Repair, Fontan, Atriopulmonary connection, w/ lateral tunnel",B2.02.01,B2,02,01,02,3,6 99 99,99:OTHER,99:OTHER,06:DIVISION OF MAIN PA,,,Bicaval 'Glenn' connection,Subaortic resection,-2,.,.,2:NO,-2,-2:N/A,1:YES,2:NO,-2,-2,1.7434210526,2,2:NO,2:NO,2:NO,1:YES,2:NO,1:CURRENT,2:NO,2:NO,2:NO,2:NO,2:NO,,,1:YES,1691,F001,A,C,17.18,3.59,,16.63,4.96,869,5
16.687200548,1:YES,1:MALE,1:White,-2,-2,-8:UNKNOWN,-2,A1,04,01,01,,"A1.04.01.01: SV, TA, D-loop, no TGA, PA (Type 1a)","A1.04: SV, TA",1:LV,2:NO,2:NO,1:YES,4:Revision and expansion of category code assignments,1:YES,139.01315789,1:YES,"B2.02.01.01: SV Physiologic Repair, Fontan, Atriopulmonary connection, w/ ASD closure",B2.02.01,B2,02,01,01,2,1 99,01:PATCH REPAIR OF PA STENOSIS,99:OTHER,,,,,Ligation of right Blalock Taussig shunt,.,.,.,2:NO,-2,-2:N/A,1:YES,-8:UNKNOWN,-2,-2,9.9013157895,1,-8:UNKNOWN,-8:UNKNOWN,-8:UNKNOWN,-8:UNKNOWN,-8:UNKNOWN,-8:UNKNOWN,-9:MISSING,-8:UNKNOWN,-8:UNKNOWN,-8:UNKNOWN,-8:UNKNOWN,,,1:YES,1692,F001,A,C,17.01,5.12,,15.86,5.12,177,5
16.65982204,1:YES,2:FEMALE,1:White,-2,-2,-8:UNKNOWN,-2,A1,06,01,01,,"A1.06.01.01: SV, Heterotaxia syndrome, DORV w/ AVCD, Asplenia","A1.06: SV, Heterotaxia syndrome",2:RV,2:NO,1:YES,2:NO,"-1:None, not reclassified",2:NO,138.98026316,1:YES,"B2.02.03.01: SV Physiologic Repair, Fontan, TCPC intracardiac lateral tunnel, Fenestrated",B2.02.03,B2,02,03,01,5,6 99 99 99 99,06:DIVISION OF MAIN PA,99:OTHER,99:OTHER,99:OTHER,99:OTHER,,L SVC ligation,Bilateral Glenn procedures,Enlargement of pulmonary venous drainage,subaortic myotmy,2:NO,-2,-2:N/A,1:YES,2:NO,-2,-2,0.8223684211,2,2:NO,-8:UNKNOWN,-8:UNKNOWN,1:YES,2:NO,1:CURRENT,2:NO,2:NO,2:NO,2:NO,2:NO,,,1:YES,1693,F001,A,C,17.02,5.09,,16.59,6.72,142,5
16.700889802,1:YES,2:FEMALE,1:White,-2,-2,-8:UNKNOWN,-2,A3,06,01,03,,"A3.06.01.03: Other functional SV, D-loop TGA w/ 2 ventricles, Solitus atria, PS or atresia",A3: Other functional SV not fitting any other categories,3:MIXED,2:NO,1:YES,1:YES,2:Additional levels added to diagnosis category,2:NO,66.677631579,1:YES,"B2.02.03.01: SV Physiologic Repair, Fontan, TCPC intracardiac lateral tunnel, Fenestrated",B2.02.03,B2,02,03,01,0,,,,,,,,,,,,2:NO,-2,-2:N/A,1:YES,1:YES,13.02:CAPTOPRIL (CAPOTEN),-2,5.1644736842,2,2:NO,2:NO,2:NO,1:YES,2:NO,3:NEVER,2:NO,2:NO,2:NO,2:NO,2:NO,,,1:YES,1694,F001,A,C,17.03,11.15,,16.27,11.76,587,5
16.566735113,1:YES,1:MALE,1:White,-2,-2,-8:UNKNOWN,-2,A1,04,03,03,,"A1.04.03.03: SV, TA, D-loop, TGA, Lg pulm. artery (Type 2c)","A1.04: SV, TA",1:LV,2:NO,2:NO,1:YES,4:Revision and expansion of category code assignments,2:NO,169.90131579,1:YES,"B2.02.01.01: SV Physiologic Repair, Fontan, Atriopulmonary connection, w/ ASD closure",B2.02.01,B2,02,01,01,2,99 99,99:OTHER,99:OTHER,,,,Damus-Kaye-Stansel procedure,Debanding,.,.,.,2:NO,-2,-2:N/A,1:YES,1:YES,13.06:FOSINOPRIL (MONOPRIL),-2,9.9342105263,1,2:NO,2:NO,3:POSSIBLE,1:YES,1:YES,3:NEVER,1:YES,2:NO,2:NO,2:NO,2:NO,,,1:YES,1695,F001,A,C,16.95,2.43,,15.74,12.67,693,5
16.531143053,1:YES,1:MALE,1:White,-2,-2,-8:UNKNOWN,-2,A3,06,01,01,,"A3.06.01.01: Other functional SV, D-loop TGA w/ 2 ventricles, Solitus atria, No Ao or PS",A3: Other functional SV not fitting any other categories,3:MIXED,2:NO,1:YES,1:YES,2:Additional levels added to diagnosis category,1:YES,165.06578947,1:YES,"B2.02.01.02: SV Physiologic Repair, Fontan, Atriopulmonary connection, w/ lateral tunnel",B2.02.01,B2,02,01,02,2,1 99,01:PATCH REPAIR OF PA STENOSIS,99:OTHER,,,,,Debanding,.,.,.,2:NO,-2,-2:N/A,1:YES,2:NO,-2,-2,0.8881578947,2,2:NO,2:NO,2:NO,2:NO,2:NO,1:CURRENT,2:NO,2:NO,2:NO,2:NO,2:NO,,,1:YES,1696,F001,A,C,16.79,2.79,,16.46,2.87,843,5
16.479123888,1:YES,2:FEMALE,1:White,-2,-2,2:NO,-2,A1,04,01,03,,"A1.04.01.03: SV, TA, D-loop, no TGA, No pulm. hypoplaisa, Large VSD (Type 1c)","A1.04: SV, TA",1:LV,2:NO,2:NO,1:YES,4:Revision and expansion of category code assignments,2:NO,160.42763158,1:YES,"B2.02.01.02: SV Physiologic Repair, Fontan, Atriopulmonary connection, w/ lateral tunnel",B2.02.01,B2,02,01,02,2,1 99,99:OTHER,01:PATCH REPAIR OF PA STENOSIS,,,,Blalock-Taussig Ligation,-2,.,.,.,2:NO,-2,-2:N/A,1:YES,2:NO,-2,-2,63.947368421,1,2:NO,2:NO,2:NO,2:NO,2:NO,3:NEVER,2:NO,2:NO,2:NO,2:NO,2:NO,,,1:YES,1697,F001,A,C,16.87,3.13,,11.16,3.13,601,5
16.396988364,1:YES,2:FEMALE,1:White,-2,-2,-8:UNKNOWN,-2,A1,04,01,02,,"A1.04.01.02: SV, TA, D-loop, no TGA, Pulm. hypoplasia, Small VSD (Type 1b)","A1.04: SV, TA",1:LV,2:NO,2:NO,1:YES,4:Revision and expansion of category code assignments,2:NO,163.25657895,1:YES,"B2.02.01.01: SV Physiologic Repair, Fontan, Atriopulmonary connection, w/ ASD closure",B2.02.01,B2,02,01,01,1,99,99:OTHER,,,,,Takedown R Blalock-Taussig shunt,.,.,.,.,2:NO,-2,-2:N/A,1:YES,1:YES,13.05:ENALAPRILAT (VASOTEC),-2,10.164473684,1,2:NO,2:NO,2:NO,1:YES,2:NO,1:CURRENT,1:YES,2:NO,2:NO,2:NO,2:NO,,,1:YES,1698,F001,A,C,16.78,2.81,,15.55,5.33,1059,5