Subject_id,F11IVGID_age,F11IVGID_DRUG,F11BEN,F11BEN_D_age,F11BEN_D_DRUG,f11ben_24,F11BEN_T,F11BEN_HR,F11BENRT,F11BENDS,RETXREAS,RETX_D1_age,RETX_D1_DRUG,retx1_24,RETX_T1,RETX_HR1,RETXDOSE,RETXBRND,RETXMOD,RETXDOS2,RETXINTR,MDSTOP,IVIGREAC,DISLODIV,INTROTHR,RETXCOMP,RETX_D2_age,RETX_D2_DRUG,retx2_24,RETX_T2,RETX_HR2,retxhours,RETXSTER,STERNUM,steroid,STERCD1,STERCD2,STER_D_age,STER_D_DRUG,ster_24,STER_T,STER_HR,STER_RT,STERDOSE,VER_ID
10020,1.8,2,2:NO,,,-2:,-2,-2:SKIPPED,-2:SKIPPED,,2:RECRUDESCENT FEVER,1.8,3025,15:40,15:40,3:24-HOUR,22,99:OTHER,2:NO,,2:NO,-2:SKIPPED,-2:SKIPPED,-2:SKIPPED,-2:SKIPPED,1:YES,1.8,3505,23:40,23:40,3:24-HOUR,8,2:NO,,-2.-2,-2,-2,,,-2:,-2,-2:SKIPPED,-2:SKIPPED,,A
10021,4.9,2,1:YES,4.9,3600,18:15,18:15,3:24-HOUR,1:IV,19,1:PERSISTENT FEVER,4.9,3645,19:00,19:00,3:24-HOUR,39,7:POLYGAM,2:NO,,2:NO,-2:SKIPPED,-2:SKIPPED,-2:SKIPPED,-2:SKIPPED,1:YES,4.9,4305,06:00,06:00,3:24-HOUR,11,2:NO,,-2.-2,-2,-2,,,-2:,-2,-2:SKIPPED,-2:SKIPPED,,A
10032,4,2,2:NO,,,-2:,-2,-2:SKIPPED,-2:SKIPPED,,1:PERSISTENT FEVER,4,2865,17:30,17:30,3:24-HOUR,38,-8:UNKNOWN,2:NO,,2:NO,-2:SKIPPED,-2:SKIPPED,-2:SKIPPED,-2:SKIPPED,1:YES,4,3615,06:00,06:00,1:AM,12.5,2:NO,,-2.-2,-2,-2,,,-2:,-2,-2:SKIPPED,-2:SKIPPED,,A
10044,2.5,3,1:YES,2.5,5625,22:30,22:30,3:24-HOUR,2:ORAL,15,2:RECRUDESCENT FEVER,2.5,5675,23:20,23:20,3:24-HOUR,28,4:GAMMIMUNE,2:NO,,2:NO,-2:SKIPPED,-2:SKIPPED,-2:SKIPPED,-2:SKIPPED,1:YES,2.5,6085,06:10,06:10,3:24-HOUR,6.8333333333,2:NO,,-2.-2,-2,-2,,,-2:,-2,-2:SKIPPED,-2:SKIPPED,,A
10044,2.5,8,1:YES,2.5,12800,22:05,22:05,3:24-HOUR,1:IV,14,2:RECRUDESCENT FEVER,2.5,12840,22:45,22:45,3:24-HOUR,28,4:GAMMIMUNE,2:NO,,2:NO,-2:SKIPPED,-2:SKIPPED,-2:SKIPPED,-2:SKIPPED,1:YES,2.5,13170,04:15,04:15,3:24-HOUR,5.5,2:NO,,-2.-2,-2,-2,,,-2:,-2,-2:SKIPPED,-2:SKIPPED,,A
10054,6.7,7,2:NO,,,-2:,-2,-2:SKIPPED,-2:SKIPPED,,2:RECRUDESCENT FEVER,6.7,9000,00:45,00:45,3:24-HOUR,34,99:OTHER,2:NO,,2:NO,-2:SKIPPED,-2:SKIPPED,-2:SKIPPED,-2:SKIPPED,1:YES,6.7,9435,08:00,08:00,3:24-HOUR,7.25,1:YES,1,18.00-18.99: Hormonal Agents,18,10,6.7,11205,13:30,13:30,3:24-HOUR,2:ORAL,20,A
10100,2.3,4,1:YES,2.3,4828,06:50,06:50,3:24-HOUR,1:IV,13,2:RECRUDESCENT FEVER,2.3,4843,07:05,07:05,3:24-HOUR,25,5:IVEEGAM-EN,2:NO,,2:NO,-2:SKIPPED,-2:SKIPPED,-2:SKIPPED,-2:SKIPPED,1:YES,2.3,5513,18:15,18:15,3:24-HOUR,11.166666667,2:NO,,-2.-2,-2,-2,,,-2:,-2,-2:SKIPPED,-2:SKIPPED,,A
10100,2.3,8,1:YES,2.3,10208,00:30,00:30,3:24-HOUR,1:IV,13,2:RECRUDESCENT FEVER,2.3,10278,01:40,01:40,3:24-HOUR,25,5:IVEEGAM-EN,2:NO,,1:YES,1:YES,1:YES,2:NO,1:YES,1:YES,2.3,11988,06:10,06:10,3:24-HOUR,28.5,2:NO,,-2.-2,-2,-2,,,-2:,-2,-2:SKIPPED,-2:SKIPPED,,A
10103,3.2,1,1:YES,3.2,1905,11:15,11:15,3:24-HOUR,1:IV,14,2:RECRUDESCENT FEVER,3.2,1950,12:00,12:00,3:24-HOUR,28,8:VENOGLOBULIN S,2:NO,,2:NO,-2:SKIPPED,-2:SKIPPED,-2:SKIPPED,-2:SKIPPED,1:YES,3.2,2340,18:30,18:30,3:24-HOUR,6.5,2:NO,,-2.-2,-2,-2,,,-2:,-2,-2:SKIPPED,-2:SKIPPED,,A
10126,7.1,3,1:YES,7.1,4260,22:45,22:45,3:24-HOUR,1:IV,25,1:PERSISTENT FEVER,7.1,4290,23:15,23:15,3:24-HOUR,50,5:IVEEGAM-EN,2:NO,,1:YES,2:NO,2:NO,1:YES,2:NO,1:YES,7.1,4885,09:10,09:10,3:24-HOUR,9.9166666667,2:NO,,-2.-2,-2,-2,,,-2:,-2,-2:SKIPPED,-2:SKIPPED,,A
10126,7.1,8,2:NO,,,-2:,-2,-2:SKIPPED,-2:SKIPPED,,1:PERSISTENT FEVER,7.1,11505,23:30,23:30,3:24-HOUR,50,5:IVEEGAM-EN,2:NO,,2:NO,-2:SKIPPED,-2:SKIPPED,-2:SKIPPED,-2:SKIPPED,1:YES,7.1,12255,12:00,12:00,3:24-HOUR,12.5,2:NO,,-2.-2,-2,-2,,,-2:,-2,-2:SKIPPED,-2:SKIPPED,,A
10153,11.6,7,1:YES,11.6,8555,16:00,16:00,3:24-HOUR,2:ORAL,50,4:PATIENT AT VERY HIGH RISK,11.6,9120,01:25,01:25,3:24-HOUR,120,99:OTHER,2:NO,,2:NO,-2:SKIPPED,-2:SKIPPED,-2:SKIPPED,-2:SKIPPED,1:YES,11.6,10660,03:05,03:05,3:24-HOUR,25.666666667,1:YES,1,18.00-18.99: Hormonal Agents,18,09,11.6,8675,18:00,18:00,3:24-HOUR,1:IV,1000,A
10203,4.7,1,1:YES,4.7,2680,23:00,11:00,2:PM,1:IV,18,2:RECRUDESCENT FEVER,4.7,2710,23:30,11:30,2:PM,35,6:PANGLOBULIN,2:NO,,2:NO,-2:SKIPPED,-2:SKIPPED,-2:SKIPPED,-2:SKIPPED,1:YES,4.7,3250,08:30,08:30,1:AM,9,2:NO,,-2.-2,-2,-2,,,-2:,-2,-2:SKIPPED,-2:SKIPPED,,A
10206,6,2,1:YES,6,2775,17:40,05:40,2:PM,1:IV,26,1:PERSISTENT FEVER,6,2805,18:10,06:10,2:PM,52,6:PANGLOBULIN,2:NO,,2:NO,-2:SKIPPED,-2:SKIPPED,-2:SKIPPED,-2:SKIPPED,1:YES,6,3395,04:00,04:00,1:AM,9.8333333333,1:YES,4,18.00-18.99: Hormonal Agents,18,04,6,7085,17:30,17:30,3:24-HOUR,1:IV,147,A
10215,3.8,13,2:NO,,,-2:,-2,-2:SKIPPED,-2:SKIPPED,,2:RECRUDESCENT FEVER,3.8,19635,16:15,16:15,3:24-HOUR,35,99:OTHER,2:NO,,1:YES,2:NO,2:NO,1:YES,2:NO,1:YES,3.8,20270,02:50,02:50,3:24-HOUR,10.583333333,2:NO,,-2.-2,-2,-2,,,-2:,-2,-2:SKIPPED,-2:SKIPPED,,A
10262,6.8,4,1:YES,6.8,5460,17:00,17:00,3:24-HOUR,1:IV,25,2:RECRUDESCENT FEVER,6.8,5490,17:30,17:30,3:24-HOUR,50,7:POLYGAM,2:NO,,2:NO,-2:SKIPPED,-2:SKIPPED,-2:SKIPPED,-2:SKIPPED,1:YES,6.8,6540,11:00,11:00,3:24-HOUR,17.5,2:NO,,-2.-2,-2,-2,,,-2:,-2,-2:SKIPPED,-2:SKIPPED,,A
10265,1.2,,2:NO,,,-2:,-2,-2:SKIPPED,-2:SKIPPED,,2:RECRUDESCENT FEVER,1.2,,19:00,19:00,3:24-HOUR,20,-8:UNKNOWN,2:NO,,2:NO,-2:SKIPPED,-2:SKIPPED,-2:SKIPPED,-2:SKIPPED,1:YES,1.2,,07:00,07:00,3:24-HOUR,12,2:NO,,-2.-2,-2,-2,,,-2:,-2,-2:SKIPPED,-2:SKIPPED,,A
10293,3.2,5,1:YES,3.2,8245,17:30,17:30,3:24-HOUR,1:IV,12,3:CORONARY ARTERY ABNORMALITIES,3.2,8275,18:00,18:00,3:24-HOUR,25,3:GAMMAGUARD,2:NO,,2:NO,-2:SKIPPED,-2:SKIPPED,-2:SKIPPED,-2:SKIPPED,1:YES,3.2,8935,05:00,05:00,3:24-HOUR,11,2:NO,,-2.-2,-2,-2,,,-2:,-2,-2:SKIPPED,-2:SKIPPED,,A
10318,3.9,3,1:YES,3.9,4090,14:30,02:30,2:PM,1:IV,14,2:RECRUDESCENT FEVER,3.9,4205,16:25,04:25,2:PM,27,6:PANGLOBULIN,2:NO,,2:NO,-2:SKIPPED,-2:SKIPPED,-2:SKIPPED,-2:SKIPPED,1:YES,3.9,4420,20:00,08:00,2:PM,3.5833333333,2:NO,,-2.-2,-2,-2,,,-2:,-2,-2:SKIPPED,-2:SKIPPED,,A
10320,5,3,1:YES,5,,-9:,-9,-9:MISSING,1:IV,15,99:OTHER,5,3775,11:15,11:15,1:AM,19,7:POLYGAM,2:NO,,2:NO,-2:SKIPPED,-2:SKIPPED,-2:SKIPPED,-2:SKIPPED,1:YES,5,4495,23:15,23:15,3:24-HOUR,12,2:NO,,-2.-2,-2,-2,,,-2:,-2,-2:SKIPPED,-2:SKIPPED,,A
10332,3.5,3,1:YES,3.5,4260,23:00,23:00,3:24-HOUR,1:IV,14,2:RECRUDESCENT FEVER,3.5,4368,00:48,00:48,3:24-HOUR,28,6:PANGLOBULIN,2:NO,,2:NO,-2:SKIPPED,-2:SKIPPED,-2:SKIPPED,-2:SKIPPED,1:YES,3.5,6570,13:30,01:30,2:PM,36.7,2:NO,,-2.-2,-2,-2,,,-2:,-2,-2:SKIPPED,-2:SKIPPED,,A
10345,3.3,3,1:YES,3.3,4350,21:15,21:15,3:24-HOUR,1:IV,17,2:RECRUDESCENT FEVER,3.3,4395,22:00,22:00,3:24-HOUR,35,7:POLYGAM,2:NO,,2:NO,-2:SKIPPED,-2:SKIPPED,-2:SKIPPED,-2:SKIPPED,1:YES,3.3,5115,10:00,10:00,3:24-HOUR,12,2:NO,,-2.-2,-2,-2,,,-2:,-2,-2:SKIPPED,-2:SKIPPED,,A
10351,0.2,4,1:YES,0.2,5415,16:00,16:00,3:24-HOUR,1:IV,5,2:RECRUDESCENT FEVER,0.2,5435,16:20,16:20,3:24-HOUR,9,99:OTHER,2:NO,,2:NO,-2:SKIPPED,-2:SKIPPED,-2:SKIPPED,-2:SKIPPED,1:YES,0.2,5955,01:00,01:00,3:24-HOUR,8.6666666667,2:NO,,-2.-2,-2,-2,,,-2:,-2,-2:SKIPPED,-2:SKIPPED,,A
10351,0.2,6,1:YES,0.2,8540,20:05,20:05,3:24-HOUR,1:IV,5,2:RECRUDESCENT FEVER,0.2,8675,22:20,22:20,3:24-HOUR,9,99:OTHER,2:NO,,2:NO,-2:SKIPPED,-2:SKIPPED,-2:SKIPPED,-2:SKIPPED,1:YES,0.2,8945,02:50,02:50,3:24-HOUR,4.5,2:NO,,-2.-2,-2,-2,,,-2:,-2,-2:SKIPPED,-2:SKIPPED,,A
10419,2.1,3,1:YES,2.1,4755,08:15,08:15,3:24-HOUR,1:IV,15,2:RECRUDESCENT FEVER,2.1,4800,09:00,09:00,3:24-HOUR,30,7:POLYGAM,2:NO,,2:NO,-2:SKIPPED,-2:SKIPPED,-2:SKIPPED,-2:SKIPPED,1:YES,2.1,5760,01:00,01:00,3:24-HOUR,16,2:NO,,-2.-2,-2,-2,,,-2:,-2,-2:SKIPPED,-2:SKIPPED,,A
10449,1,6,2:NO,,,-2:,-2,-2:SKIPPED,-2:SKIPPED,,2:RECRUDESCENT FEVER,1,8710,01:40,01:40,1:AM,17,99:OTHER,2:NO,,1:YES,2:NO,2:NO,1:YES,2:NO,1:YES,1,9450,14:00,14:00,3:24-HOUR,12.333333333,2:NO,,-2.-2,-2,-2,,,-2:,-2,-2:SKIPPED,-2:SKIPPED,,A
10460,3.2,2,1:YES,3.2,4105,20:25,20:25,3:24-HOUR,1:IV,20,2:RECRUDESCENT FEVER,3.2,4140,21:00,21:00,3:24-HOUR,32,7:POLYGAM,2:NO,,2:NO,-2:SKIPPED,-2:SKIPPED,-2:SKIPPED,-2:SKIPPED,1:YES,3.2,4920,10:00,10:00,3:24-HOUR,13,2:NO,,-2.-2,-2,-2,,,-2:,-2,-2:SKIPPED,-2:SKIPPED,,A
10460,3.2,5,1:YES,3.2,8520,22:00,22:00,3:24-HOUR,1:IV,20,2:RECRUDESCENT FEVER,3.2,8520,22:00,22:00,3:24-HOUR,32,7:POLYGAM,2:NO,,2:NO,-2:SKIPPED,-2:SKIPPED,-2:SKIPPED,-2:SKIPPED,1:YES,3.2,9180,09:00,09:00,3:24-HOUR,11,2:NO,,-2.-2,-2,-2,,,-2:,-2,-2:SKIPPED,-2:SKIPPED,,A
10472,0.8,2,1:YES,0.8,2830,23:30,23:30,3:24-HOUR,1:IV,10,1:PERSISTENT FEVER,0.8,2880,00:20,00:20,3:24-HOUR,22,5:IVEEGAM-EN,2:NO,,2:NO,-2:SKIPPED,-2:SKIPPED,-2:SKIPPED,-2:SKIPPED,1:YES,0.8,3510,10:50,10:50,3:24-HOUR,10.5,2:NO,,-2.-2,-2,-2,,,-2:,-2,-2:SKIPPED,-2:SKIPPED,,A
10472,0.8,4,1:YES,0.8,5715,23:35,23:35,3:24-HOUR,1:IV,10,1:PERSISTENT FEVER,0.8,5741,00:01,00:01,3:24-HOUR,21,5:IVEEGAM-EN,2:NO,,2:NO,-2:SKIPPED,-2:SKIPPED,-2:SKIPPED,-2:SKIPPED,1:YES,0.8,6490,12:30,12:30,3:24-HOUR,12.483333333,2:NO,,-2.-2,-2,-2,,,-2:,-2,-2:SKIPPED,-2:SKIPPED,,A
10482,1.8,4,2:NO,,,-2:,-2,-2:SKIPPED,-2:SKIPPED,,2:RECRUDESCENT FEVER,1.8,5160,09:00,09:00,3:24-HOUR,25,7:POLYGAM,2:NO,,2:NO,-2:SKIPPED,-2:SKIPPED,-2:SKIPPED,-2:SKIPPED,1:YES,1.8,5760,19:00,19:00,3:24-HOUR,10,2:NO,,-2.-2,-2,-2,,,-2:,-2,-2:SKIPPED,-2:SKIPPED,,A
10561,1.6,1,1:YES,1.6,1440,18:00,18:00,3:24-HOUR,1:IV,12,99:OTHER,1.6,1510,19:10,19:10,3:24-HOUR,25,7:POLYGAM,2:NO,,2:NO,-2:SKIPPED,-2:SKIPPED,-2:SKIPPED,-2:SKIPPED,1:YES,1.6,2400,10:00,10:00,3:24-HOUR,14.833333333,1:YES,2,18.00-18.99: Hormonal Agents,18,09,1.6,1440,18:00,18:00,3:24-HOUR,1:IV,12,A
10562,4.8,4,1:YES,4.8,5750,23:00,23:00,3:24-HOUR,1:IV,20,2:RECRUDESCENT FEVER,4.8,5790,23:40,23:40,3:24-HOUR,40,5:IVEEGAM-EN,2:NO,,2:NO,-2:SKIPPED,-2:SKIPPED,-2:SKIPPED,-2:SKIPPED,1:YES,4.8,6495,11:25,11:25,3:24-HOUR,11.75,2:NO,,-2.-2,-2,-2,,,-2:,-2,-2:SKIPPED,-2:SKIPPED,,A
