Subject_id,VISIT,VISIT_D_age,VISIT_D_DRUG,ODAYA_D,ODAYB_D,ASATMPD1_0_age,ASATMPD1_0_DRUG,ASATMPD1_1_age,ASATMPD1_1_DRUG,ASATMPD1_2_age,ASATMPD1_2_DRUG,ASATMPD5_0_age,ASATMPD5_0_DRUG,ASATMPD5_1_age,ASATMPD5_1_DRUG,ASATMPD5_2_age,ASATMPD5_2_DRUG,ASATMPD5_3_age,ASATMPD5_3_DRUG,ASATMPD5_4_age,ASATMPD5_4_DRUG,ASATMPD5_5_age,ASATMPD5_5_DRUG,ASATMPD5_6_age,ASATMPD5_6_DRUG,ASATMPD5_7_age,ASATMPD5_7_DRUG,ASATMPD5_8_age,ASATMPD5_8_DRUG,ASATMPD5_9_age,ASATMPD5_9_DRUG,ASATMPD5_10_age,ASATMPD5_10_DRUG,ASATMPD5_11_age,ASATMPD5_11_DRUG,ASATMPD5_12_age,ASATMPD5_12_DRUG,ASATMPD5_13_age,ASATMPD5_13_DRUG,ASATMPD5_14_age,ASATMPD5_14_DRUG,ASATMPD5_15_age,ASATMPD5_15_DRUG,ASATMPD5_16_age,ASATMPD5_16_DRUG,ASATMPD5_17_age,ASATMPD5_17_DRUG,ASATMPD5_18_age,ASATMPD5_18_DRUG,ASATMPD5_19_age,ASATMPD5_19_DRUG,ASATMPD5_20_age,ASATMPD5_20_DRUG,ASATMPD5_21_age,ASATMPD5_21_DRUG,ASAGVE06_0,ASAGVE06_1,ASAGVE06_2,ASAGVE12_0,ASAGVE12_1,ASAGVE12_2,ASAGVE18_0,ASAGVE18_1,ASAGVE18_2,ASAGVE_18_0,ASAGVE_18_1,ASAGVE_18_2,ASAGVE_18_3,ASAGVE_18_4,ASAGVE_18_5,ASAGVE_18_6,ASAGVE_18_7,ASAGVE_18_8,ASAGVE_18_9,ASAGVE_18_10,ASAGVE_18_11,ASAGVE_18_12,ASAGVE_18_13,ASAGVE_18_14,ASAGVE_18_15,ASAGVE_18_16,ASAGVE_18_17,ASAGVE_18_18,ASAGVE_18_19,ASAGVE_18_20,ASAGVE_18_21,ASAGVE24_0,ASAGVE24_1,ASAGVE24_2,given06,given12,given18,given24,given,ASADOS06_0,ASADOS06_1,ASADOS06_2,ASADOS12_0,ASADOS12_1,ASADOS12_2,ASADOS18_0,ASADOS18_1,ASADOS18_2,ASADS_18_0,ASADS_18_1,ASADS_18_2,ASADS_18_3,ASADS_18_4,ASADS_18_5,ASADS_18_6,ASADS_18_7,ASADS_18_8,ASADS_18_9,ASADS_18_10,ASADS_18_11,ASADS_18_12,ASADS_18_13,ASADS_18_14,ASADS_18_15,ASADS_18_16,ASADS_18_17,ASADS_18_18,ASADS_18_19,ASADS_18_20,ASADS_18_21,ASADOS24_0,ASADOS24_1,ASADOS24_2,meandose06,meandose12,meandose18,meandose24,meandose,TMPVL_18_0,TMPVL_18_1,TMPVL_18_2,TMPVL_18_3,TMPVL_18_4,TMPVL_18_5,TMPVL_18_6,TMPVL_18_7,TMPVL_18_8,TMPVL_18_9,TMPVL_18_10,TMPVL_18_11,TMPVL_18_12,TMPVL_18_13,TMPVL_18_14,TMPVL_18_15,TMPVL_18_16,TMPVL_18_17,TMPVL_18_18,TMPVL_18_19,TMPVL_18_20,TMPVL_18_21,ctmpvl_18_0,ctmpvl_18_1,ctmpvl_18_2,ctmpvl_18_3,ctmpvl_18_4,ctmpvl_18_5,ctmpvl_18_6,ctmpvl_18_7,ctmpvl_18_8,ctmpvl_18_9,ctmpvl_18_10,ctmpvl_18_11,ctmpvl_18_12,ctmpvl_18_13,ctmpvl_18_14,ctmpvl_18_15,ctmpvl_18_16,ctmpvl_18_17,ctmpvl_18_18,ctmpvl_18_19,ctmpvl_18_20,ctmpvl_18_21,TMPVAL24_0,TMPVAL24_1,TMPVAL24_2,ctmpval24_0,ctmpval24_1,ctmpval24_2,meantemp18,meantemp24,meantemp,TMPM_18_0,TMPM_18_1,TMPM_18_2,TMPM_18_3,TMPM_18_4,TMPM_18_5,TMPM_18_6,TMPM_18_7,TMPM_18_8,TMPM_18_9,TMPM_18_10,TMPM_18_11,TMPM_18_12,TMPM_18_13,TMPM_18_14,TMPM_18_15,TMPM_18_16,TMPM_18_17,TMPM_18_18,TMPM_18_19,TMPM_18_20,TMPM_18_21,TMPM24_0,TMPM24_1,TMPM24_2,rectal18,rectal24,rectal,oral18,oral24,oral,ear18,ear24,ear,armpit18,armpit24,armpit,VER_ID
10007,1:BASELINE,1,9,3,3,1,3,1,4,1,5,1,6,1,7,1,8,,,,,,,,,,,,,,,,,,,,,,,,,,,,,,,,,,,,,,,-9:MISSING,-9:MISSING,-9:MISSING,-9:MISSING,-9:MISSING,-9:MISSING,1:GIVEN,1:GIVEN,1:GIVEN,1:GIVEN,1:GIVEN,1:GIVEN,-9:MISSING,-9:MISSING,-9:MISSING,-9:MISSING,-9:MISSING,-9:MISSING,-9:MISSING,-9:MISSING,-9:MISSING,-9:MISSING,-9:MISSING,-9:MISSING,-9:MISSING,-9:MISSING,-9:MISSING,-9:MISSING,-9:MISSING,-9:MISSING,-9:MISSING,-9:MISSING,-9:MISSING,-9:MISSING,0,0,6,0,6,,,,,,,41,41,41,41,41,41,,,,,,,,,,,,,,,,,,,,,,,,,41,,41,98.9,98.4,99.9,,,,,,,,,,,,,,,,,,,,36.166666667,35.888888889,36.722222222,,,,,,,,,,,,,,,,,,,,97.8,98.8,99.7,35.555555556,36.111111111,36.611111111,36.259259259,36.092592593,36.175925926,1:RECTUM,1:RECTUM,1:RECTUM,-9:MISSING,-9:MISSING,-9:MISSING,-9:MISSING,-9:MISSING,-9:MISSING,-9:MISSING,-9:MISSING,-9:MISSING,-9:MISSING,-9:MISSING,-9:MISSING,-9:MISSING,-9:MISSING,-9:MISSING,-9:MISSING,-9:MISSING,-9:MISSING,-9:MISSING,1:RECTUM,1:RECTUM,1:RECTUM,3,3,6,0,0,0,0,0,0,0,0,0,A
10009,1:BASELINE,8.6,8,3,3,8.6,2,8.6,3,8.6,4,8.6,5,8.6,6,8.6,7,,,,,,,,,,,,,,,,,,,,,,,,,,,,,,,,,,,,,,,1:GIVEN,1:GIVEN,1:GIVEN,-9:MISSING,-9:MISSING,-9:MISSING,1:GIVEN,1:GIVEN,1:GIVEN,1:GIVEN,1:GIVEN,1:GIVEN,-9:MISSING,-9:MISSING,-9:MISSING,-9:MISSING,-9:MISSING,-9:MISSING,-9:MISSING,-9:MISSING,-9:MISSING,-9:MISSING,-9:MISSING,-9:MISSING,-9:MISSING,-9:MISSING,-9:MISSING,-9:MISSING,-9:MISSING,-9:MISSING,-9:MISSING,-9:MISSING,-9:MISSING,-9:MISSING,3,0,6,0,9,,,,,,,81,81,81,81,81,81,,,,,,,,,,,,,,,,,,,,,,,,,81,,81,98,97.2,96.8,,,,,,,,,,,,,,,,,,,,36.666666667,36.222222222,36,,,,,,,,,,,,,,,,,,,,95.6,97.2,97.7,35.333333333,36.222222222,36.5,36.296296296,36.018518519,36.157407407,2:MOUTH,2:MOUTH,2:MOUTH,-9:MISSING,-9:MISSING,-9:MISSING,-9:MISSING,-9:MISSING,-9:MISSING,-9:MISSING,-9:MISSING,-9:MISSING,-9:MISSING,-9:MISSING,-9:MISSING,-9:MISSING,-9:MISSING,-9:MISSING,-9:MISSING,-9:MISSING,-9:MISSING,-9:MISSING,2:MOUTH,2:MOUTH,2:MOUTH,0,0,0,3,3,6,0,0,0,0,0,0,A
10017,1:BASELINE,2.9,8,3,3,2.8,2,2.8,3,2.9,4,2.9,5,2.9,6,2.9,7,,,,,,,,,,,,,,,,,,,,,,,,,,,,,,,,,,,,,,,-9:MISSING,-9:MISSING,-9:MISSING,-9:MISSING,-9:MISSING,-9:MISSING,-9:MISSING,-9:MISSING,-9:MISSING,-9:MISSING,-9:MISSING,-9:MISSING,-9:MISSING,-9:MISSING,-9:MISSING,-9:MISSING,-9:MISSING,-9:MISSING,-9:MISSING,-9:MISSING,-9:MISSING,-9:MISSING,-9:MISSING,-9:MISSING,-9:MISSING,-9:MISSING,-9:MISSING,-9:MISSING,-9:MISSING,-9:MISSING,-9:MISSING,-9:MISSING,-9:MISSING,-9:MISSING,0,0,0,0,0,,,,243,,,243,243,40,40,40,40,,,,,,,,,,,,,,,,,,,,243,243,,,243,107.66666667,243,197.88888889,97.4,99.1,97.2,,,,,,,,,,,,,,,,,,,,35.333333333,36.277777778,36.222222222,,,,,,,,,,,,,,,,,,,,,,,,,,35.944444444,,35.944444444,1:RECTUM,1:RECTUM,-9:MISSING,-9:MISSING,-9:MISSING,-9:MISSING,-9:MISSING,-9:MISSING,-9:MISSING,-9:MISSING,-9:MISSING,-9:MISSING,-9:MISSING,-9:MISSING,-9:MISSING,-9:MISSING,-9:MISSING,-9:MISSING,-9:MISSING,-9:MISSING,-9:MISSING,-9:MISSING,-9:MISSING,-9:MISSING,-9:MISSING,2,0,2,0,0,0,0,0,0,0,0,0,A
10018,1:BASELINE,0.5,15,2,,0.5,3,0.5,4,,,,,,,,,,,,,,,,,,,,,,,,,,,,,,,,,,,,,,,,,,,,,,,-9:MISSING,-9:MISSING,-9:MISSING,-9:MISSING,1:GIVEN,-9:MISSING,1:GIVEN,-9:MISSING,-9:MISSING,-9:MISSING,-9:MISSING,-9:MISSING,-9:MISSING,-9:MISSING,-9:MISSING,-9:MISSING,-9:MISSING,-9:MISSING,-9:MISSING,-9:MISSING,-9:MISSING,-9:MISSING,-9:MISSING,-9:MISSING,-9:MISSING,-9:MISSING,-9:MISSING,-9:MISSING,-9:MISSING,-9:MISSING,-9:MISSING,-9:MISSING,-9:MISSING,-9:MISSING,0,1,1,0,2,,,,,41,,41,,,,,,,,,,,,,,,,,,,,,,,,,,,,,41,41,,41,,,,,,,,,,,,,,,,,,,,,,,,,,,,,,,,,,,,,,,,,,,,,97.1,97.1,,36.166666667,36.166666667,,,36.166666667,36.166666667,-9:MISSING,-9:MISSING,-9:MISSING,-9:MISSING,-9:MISSING,-9:MISSING,-9:MISSING,-9:MISSING,-9:MISSING,-9:MISSING,-9:MISSING,-9:MISSING,-9:MISSING,-9:MISSING,-9:MISSING,-9:MISSING,-9:MISSING,-9:MISSING,-9:MISSING,-9:MISSING,-9:MISSING,-9:MISSING,4:ARMPIT,4:ARMPIT,-9:MISSING,0,0,0,0,0,0,0,0,0,0,2,2,A
10019,1:BASELINE,1.9,8,3,5,1.8,1,1.9,2,1.9,3,1.9,4,1.9,5,1.9,6,1.9,7,1.9,8,,,,,,,,,,,,,,,,,,,,,,,,,,,,,,,,,,,2:NOT GIVEN,1:GIVEN,2:NOT GIVEN,2:NOT GIVEN,1:GIVEN,2:NOT GIVEN,1:GIVEN,2:NOT GIVEN,1:GIVEN,1:GIVEN,1:GIVEN,1:GIVEN,1:GIVEN,-9:MISSING,-9:MISSING,-9:MISSING,-9:MISSING,-9:MISSING,-9:MISSING,-9:MISSING,-9:MISSING,-9:MISSING,-9:MISSING,-9:MISSING,-9:MISSING,-9:MISSING,-9:MISSING,-9:MISSING,-9:MISSING,-9:MISSING,-9:MISSING,1:GIVEN,2:NOT GIVEN,2:NOT GIVEN,1,1,6,1,9,,200,,,200,,200,,40,40,40,40,40,40,,,,,,,,,,,,,,,,,,200,,,200,200,62.857142857,200,165.71428571,97.6,98.4,99.1,98.4,,,,,,,,,,,,,,,,,,,35.444444444,35.888888889,36.277777778,35.888888889,,,,,,,,,,,,,,,,,,,98.2,97.7,99,36.777777778,35.5,36.222222222,35.875,36.166666667,36.020833333,1:RECTUM,1:RECTUM,1:RECTUM,1:RECTUM,-9:MISSING,-9:MISSING,-9:MISSING,-9:MISSING,-9:MISSING,-9:MISSING,-9:MISSING,-9:MISSING,-9:MISSING,-9:MISSING,-9:MISSING,-9:MISSING,-9:MISSING,-9:MISSING,-9:MISSING,-9:MISSING,-9:MISSING,-9:MISSING,4:ARMPIT,1:RECTUM,1:RECTUM,4,2,6,0,0,0,0,0,0,0,1,1,A
10020,1:BASELINE,1.8,8,3,1,1.8,4,1.8,5,1.8,6,1.8,7,,,,,,,,,,,,,,,,,,,,,,,,,,,,,,,,,,,,,,,,,,,2:NOT GIVEN,2:NOT GIVEN,2:NOT GIVEN,2:NOT GIVEN,2:NOT GIVEN,2:NOT GIVEN,1:GIVEN,1:GIVEN,1:GIVEN,1:GIVEN,-9:MISSING,-9:MISSING,-9:MISSING,-9:MISSING,-9:MISSING,-9:MISSING,-9:MISSING,-9:MISSING,-9:MISSING,-9:MISSING,-9:MISSING,-9:MISSING,-9:MISSING,-9:MISSING,-9:MISSING,-9:MISSING,-9:MISSING,-9:MISSING,-9:MISSING,-9:MISSING,-9:MISSING,2:NOT GIVEN,-9:MISSING,2:NOT GIVEN,0,0,4,0,4,,,,,,,41,41,41,41,,,,,,,,,,,,,,,,,,,,,,,,,,,41,,41,98.8,,,,,,,,,,,,,,,,,,,,,,37.111111111,,,,,,,,,,,,,,,,,,,,,,97.7,97.8,97.8,36.5,36.555555556,36.555555556,37.111111111,36.537037037,36.824074074,4:ARMPIT,-9:MISSING,-9:MISSING,-9:MISSING,-9:MISSING,-9:MISSING,-9:MISSING,-9:MISSING,-9:MISSING,-9:MISSING,-9:MISSING,-9:MISSING,-9:MISSING,-9:MISSING,-9:MISSING,-9:MISSING,-9:MISSING,-9:MISSING,-9:MISSING,-9:MISSING,-9:MISSING,-9:MISSING,4:ARMPIT,4:ARMPIT,-9:MISSING,0,0,0,0,0,0,0,0,0,1,2,3,A
10021,1:BASELINE,4.9,9,3,2,4.9,4,4.9,5,4.9,6,4.9,7,4.9,8,,,,,,,,,,,,,,,,,,,,,,,,,,,,,,,,,,,,,,,,,-9:MISSING,1:GIVEN,1:GIVEN,-9:MISSING,1:GIVEN,1:GIVEN,1:GIVEN,1:GIVEN,1:GIVEN,2:NOT GIVEN,1:GIVEN,-9:MISSING,-9:MISSING,-9:MISSING,-9:MISSING,-9:MISSING,-9:MISSING,-9:MISSING,-9:MISSING,-9:MISSING,-9:MISSING,-9:MISSING,-9:MISSING,-9:MISSING,-9:MISSING,-9:MISSING,-9:MISSING,-9:MISSING,-9:MISSING,-9:MISSING,-9:MISSING,1:GIVEN,1:GIVEN,1:GIVEN,2,2,4,3,11,,400,400,,400,400,400,400,400,,81,,,,,,,,,,,,,,,,,,,,,400,400,400,400,400,320.25,400,380.0625,97.7,98.1,,,,,,,,,,,,,,,,,,,,,36.5,36.722222222,,,,,,,,,,,,,,,,,,,,,98.8,98.4,97.5,37.111111111,36.888888889,36.388888889,36.611111111,36.796296296,36.703703704,4:ARMPIT,4:ARMPIT,-9:MISSING,-9:MISSING,-9:MISSING,-9:MISSING,-9:MISSING,-9:MISSING,-9:MISSING,-9:MISSING,-9:MISSING,-9:MISSING,-9:MISSING,-9:MISSING,-9:MISSING,-9:MISSING,-9:MISSING,-9:MISSING,-9:MISSING,-9:MISSING,-9:MISSING,-9:MISSING,4:ARMPIT,4:ARMPIT,4:ARMPIT,0,0,0,0,0,0,0,0,0,2,3,5,A
10029,1:BASELINE,3.7,8,3,3,3.7,2,3.7,3,3.7,4,3.7,5,3.7,6,3.7,7,,,,,,,,,,,,,,,,,,,,,,,,,,,,,,,,,,,,,,,2:NOT GIVEN,2:NOT GIVEN,2:NOT GIVEN,2:NOT GIVEN,2:NOT GIVEN,2:NOT GIVEN,1:GIVEN,1:GIVEN,1:GIVEN,1:GIVEN,1:GIVEN,1:GIVEN,-9:MISSING,-9:MISSING,-9:MISSING,-9:MISSING,-9:MISSING,-9:MISSING,-9:MISSING,-9:MISSING,-9:MISSING,-9:MISSING,-9:MISSING,-9:MISSING,-9:MISSING,-9:MISSING,-9:MISSING,-9:MISSING,-9:MISSING,-9:MISSING,-9:MISSING,2:NOT GIVEN,2:NOT GIVEN,2:NOT GIVEN,0,0,6,0,6,,,,,,,81,81,81,81,81,81,,,,,,,,,,,,,,,,,,,,,,,,,81,,81,98.6,99.1,99.3,,,,,,,,,,,,,,,,,,,,37,37.277777778,37.388888889,,,,,,,,,,,,,,,,,,,,98.1,99,98.8,36.722222222,37.222222222,37.111111111,37.222222222,37.018518519,37.12037037,3:EAR,3:EAR,3:EAR,-9:MISSING,-9:MISSING,-9:MISSING,-9:MISSING,-9:MISSING,-9:MISSING,-9:MISSING,-9:MISSING,-9:MISSING,-9:MISSING,-9:MISSING,-9:MISSING,-9:MISSING,-9:MISSING,-9:MISSING,-9:MISSING,-9:MISSING,-9:MISSING,-9:MISSING,3:EAR,3:EAR,3:EAR,0,0,0,0,0,0,3,3,6,0,0,0,A
10030,1:BASELINE,2.7,8,3,3,2.7,2,2.7,3,2.7,4,2.7,5,2.7,6,2.7,7,,,,,,,,,,,,,,,,,,,,,,,,,,,,,,,,,,,,,,,2:NOT GIVEN,2:NOT GIVEN,2:NOT GIVEN,1:GIVEN,2:NOT GIVEN,2:NOT GIVEN,1:GIVEN,1:GIVEN,1:GIVEN,1:GIVEN,1:GIVEN,1:GIVEN,-9:MISSING,-9:MISSING,-9:MISSING,-9:MISSING,-9:MISSING,-9:MISSING,-9:MISSING,-9:MISSING,-9:MISSING,-9:MISSING,-9:MISSING,-9:MISSING,-9:MISSING,-9:MISSING,-9:MISSING,-9:MISSING,-9:MISSING,-9:MISSING,-9:MISSING,1:GIVEN,2:NOT GIVEN,2:NOT GIVEN,0,1,6,1,8,,,,160,,,160,40,40,40,40,40,,,,,,,,,,,,,,,,,,,,160,,,,160,60,160,126.66666667,96.8,97.6,97.1,,,,,,,,,,,,,,,,,,,,36,36.444444444,36.166666667,,,,,,,,,,,,,,,,,,,,97,97,97.6,36.111111111,36.111111111,36.444444444,36.203703704,36.222222222,36.212962963,4:ARMPIT,4:ARMPIT,4:ARMPIT,-9:MISSING,-9:MISSING,-9:MISSING,-9:MISSING,-9:MISSING,-9:MISSING,-9:MISSING,-9:MISSING,-9:MISSING,-9:MISSING,-9:MISSING,-9:MISSING,-9:MISSING,-9:MISSING,-9:MISSING,-9:MISSING,-9:MISSING,-9:MISSING,-9:MISSING,4:ARMPIT,4:ARMPIT,4:ARMPIT,0,0,0,0,0,0,0,0,0,3,3,6,A
10031,1:BASELINE,2.9,7,3,2,2.9,2,2.9,3,2.9,4,2.9,5,2.9,6,,,,,,,,,,,,,,,,,,,,,,,,,,,,,,,,,,,,,,,,,1:GIVEN,-9:MISSING,-9:MISSING,1:GIVEN,-9:MISSING,-9:MISSING,1:GIVEN,1:GIVEN,1:GIVEN,1:GIVEN,1:GIVEN,-9:MISSING,-9:MISSING,-9:MISSING,-9:MISSING,-9:MISSING,-9:MISSING,-9:MISSING,-9:MISSING,-9:MISSING,-9:MISSING,-9:MISSING,-9:MISSING,-9:MISSING,-9:MISSING,-9:MISSING,-9:MISSING,-9:MISSING,-9:MISSING,-9:MISSING,-9:MISSING,1:GIVEN,-9:MISSING,-9:MISSING,1,1,5,1,8,243,,,243,,,243,81,81,81,81,,,,,,,,,,,,,,,,,,,,,243,,,243,243,113.4,243,210.6,97.7,96.8,,,,,,,,,,,,,,,,,,,,,36.5,36,,,,,,,,,,,,,,,,,,,,,97.3,97.3,98.2,36.277777778,36.277777778,36.777777778,36.25,36.444444444,36.347222222,4:ARMPIT,4:ARMPIT,-9:MISSING,-9:MISSING,-9:MISSING,-9:MISSING,-9:MISSING,-9:MISSING,-9:MISSING,-9:MISSING,-9:MISSING,-9:MISSING,-9:MISSING,-9:MISSING,-9:MISSING,-9:MISSING,-9:MISSING,-9:MISSING,-9:MISSING,-9:MISSING,-9:MISSING,-9:MISSING,4:ARMPIT,4:ARMPIT,4:ARMPIT,0,0,0,0,0,0,0,0,0,2,3,5,A
10038,1:BASELINE,1.7,6,2,,1.7,1,1.7,2,,,,,,,,,,,,,,,,,,,,,,,,,,,,,,,,,,,,,,,,,,,,,,,-9:MISSING,1:GIVEN,-9:MISSING,-9:MISSING,1:GIVEN,-9:MISSING,1:GIVEN,1:GIVEN,-9:MISSING,-9:MISSING,-9:MISSING,-9:MISSING,-9:MISSING,-9:MISSING,-9:MISSING,-9:MISSING,-9:MISSING,-9:MISSING,-9:MISSING,-9:MISSING,-9:MISSING,-9:MISSING,-9:MISSING,-9:MISSING,-9:MISSING,-9:MISSING,-9:MISSING,-9:MISSING,-9:MISSING,-9:MISSING,-9:MISSING,1:GIVEN,1:GIVEN,-9:MISSING,1,1,2,2,6,,324,,,324,,324,324,,,,,,,,,,,,,,,,,,,,,,,,324,324,,324,324,324,324,324,,,,,,,,,,,,,,,,,,,,,,,,,,,,,,,,,,,,,,,,,,,,,97.8,98.1,,36.555555556,36.722222222,,,36.638888889,36.638888889,-9:MISSING,-9:MISSING,-9:MISSING,-9:MISSING,-9:MISSING,-9:MISSING,-9:MISSING,-9:MISSING,-9:MISSING,-9:MISSING,-9:MISSING,-9:MISSING,-9:MISSING,-9:MISSING,-9:MISSING,-9:MISSING,-9:MISSING,-9:MISSING,-9:MISSING,-9:MISSING,-9:MISSING,-9:MISSING,2:MOUTH,2:MOUTH,-9:MISSING,0,0,0,0,2,2,0,0,0,0,0,0,A
10043,1:BASELINE,2.8,14,3,11,2.7,1,2.7,2,2.7,3,2.7,4,2.7,5,2.7,6,2.8,7,2.8,8,2.8,9,2.8,10,2.8,11,2.8,12,2.8,13,2.8,14,,,,,,,,,,,,,,,,,,,,,,,-9:MISSING,-9:MISSING,-9:MISSING,-9:MISSING,1:GIVEN,-9:MISSING,-9:MISSING,1:GIVEN,-9:MISSING,1:GIVEN,1:GIVEN,1:GIVEN,1:GIVEN,1:GIVEN,1:GIVEN,1:GIVEN,1:GIVEN,1:GIVEN,1:GIVEN,1:GIVEN,-9:MISSING,-9:MISSING,-9:MISSING,-9:MISSING,-9:MISSING,-9:MISSING,-9:MISSING,-9:MISSING,-9:MISSING,-9:MISSING,-9:MISSING,2:NOT GIVEN,1:GIVEN,-9:MISSING,0,1,12,1,14,,243,243,,,,,243,,81,,81,81,81,81,81,81,81,81,81,,,,,,,,,,,,,243,,243,,95.727272727,243,193.90909091,98.7,98.7,99.7,99.7,98.4,98.7,101,97.3,99.1,98.4,99.6,,,,,,,,,,,,37.055555556,37.055555556,37.611111111,37.611111111,36.888888889,37.055555556,38.333333333,36.277777778,37.277777778,36.888888889,37.555555556,,,,,,,,,,,,,101.2,100.7,,38.444444444,38.166666667,37.237373737,38.305555556,37.771464646,3:EAR,3:EAR,3:EAR,3:EAR,3:EAR,3:EAR,3:EAR,3:EAR,3:EAR,3:EAR,3:EAR,-9:MISSING,-9:MISSING,-9:MISSING,-9:MISSING,-9:MISSING,-9:MISSING,-9:MISSING,-9:MISSING,-9:MISSING,-9:MISSING,-9:MISSING,-9:MISSING,3:EAR,3:EAR,0,0,0,0,0,0,11,2,13,0,0,0,A
10044,1:BASELINE,2.5,8,1,,2.5,3,,,,,,,,,,,,,,,,,,,,,,,,,,,,,,,,,,,,,,,,,,,,,,,,,2:NOT GIVEN,-9:MISSING,-9:MISSING,2:NOT GIVEN,-9:MISSING,-9:MISSING,1:GIVEN,-9:MISSING,-9:MISSING,-9:MISSING,-9:MISSING,-9:MISSING,-9:MISSING,-9:MISSING,-9:MISSING,-9:MISSING,-9:MISSING,-9:MISSING,-9:MISSING,-9:MISSING,-9:MISSING,-9:MISSING,-9:MISSING,-9:MISSING,-9:MISSING,-9:MISSING,-9:MISSING,-9:MISSING,-9:MISSING,-9:MISSING,-9:MISSING,2:NOT GIVEN,-9:MISSING,-9:MISSING,0,0,1,0,1,,,,,,,40,,,,,,,,,,,,,,,,,,,,,,,,,,,,,,40,,40,,,,,,,,,,,,,,,,,,,,,,,,,,,,,,,,,,,,,,,,,,,,,101,,,38.333333333,,,,38.333333333,38.333333333,-9:MISSING,-9:MISSING,-9:MISSING,-9:MISSING,-9:MISSING,-9:MISSING,-9:MISSING,-9:MISSING,-9:MISSING,-9:MISSING,-9:MISSING,-9:MISSING,-9:MISSING,-9:MISSING,-9:MISSING,-9:MISSING,-9:MISSING,-9:MISSING,-9:MISSING,-9:MISSING,-9:MISSING,-9:MISSING,4:ARMPIT,-9:MISSING,-9:MISSING,0,0,0,0,0,0,0,0,0,0,1,1,A
10045,1:BASELINE,3.3,35,3,11,3.2,1,3.2,2,3.2,4,3.2,5,3.2,6,3.2,7,3.3,8,3.3,9,3.3,25,3.3,26,3.3,27,3.3,28,3.3,29,3.3,29,,,,,,,,,,,,,,,,,,,,,,,-9:MISSING,1:GIVEN,-9:MISSING,-9:MISSING,-9:MISSING,-9:MISSING,1:GIVEN,-9:MISSING,1:GIVEN,1:GIVEN,1:GIVEN,1:GIVEN,1:GIVEN,1:GIVEN,1:GIVEN,1:GIVEN,-9:MISSING,1:GIVEN,-9:MISSING,-9:MISSING,-9:MISSING,-9:MISSING,-9:MISSING,-9:MISSING,-9:MISSING,-9:MISSING,-9:MISSING,-9:MISSING,-9:MISSING,-9:MISSING,-9:MISSING,-9:MISSING,-9:MISSING,-9:MISSING,1,0,10,0,11,,50,,,,,50,,50,50,50,50,50,50,50,50,,50,,,,,,,,,,,,,,,,,50,,50,,50,97.1,97.3,97.7,97.1,97.7,98.8,99.5,100,98.8,100,100.2,,,,,,,,,,,,36.166666667,36.277777778,36.5,36.166666667,36.5,37.111111111,37.5,37.777777778,37.111111111,37.777777778,37.888888889,,,,,,,,,,,,96.6,97.1,96.6,35.888888889,36.166666667,35.888888889,36.97979798,35.981481481,36.480639731,4:ARMPIT,4:ARMPIT,4:ARMPIT,4:ARMPIT,4:ARMPIT,4:ARMPIT,4:ARMPIT,4:ARMPIT,4:ARMPIT,-9:MISSING,-9:MISSING,-9:MISSING,-9:MISSING,-9:MISSING,-9:MISSING,-9:MISSING,-9:MISSING,-9:MISSING,-9:MISSING,-9:MISSING,-9:MISSING,-9:MISSING,4:ARMPIT,4:ARMPIT,4:ARMPIT,0,0,0,0,0,0,0,0,0,9,3,12,A
10050,1:BASELINE,3.9,8,3,8,3.9,2,3.9,3,3.9,4,3.9,5,3.9,6,3.9,7,3.9,8,3.9,9,3.9,10,3.9,11,3.9,12,,,,,,,,,,,,,,,,,,,,,,,,,,,,,-9:MISSING,-9:MISSING,-9:MISSING,1:GIVEN,-9:MISSING,-9:MISSING,1:GIVEN,1:GIVEN,1:GIVEN,1:GIVEN,1:GIVEN,1:GIVEN,1:GIVEN,1:GIVEN,1:GIVEN,1:GIVEN,1:GIVEN,-9:MISSING,-9:MISSING,-9:MISSING,-9:MISSING,-9:MISSING,-9:MISSING,-9:MISSING,-9:MISSING,-9:MISSING,-9:MISSING,-9:MISSING,-9:MISSING,-9:MISSING,-9:MISSING,-9:MISSING,-9:MISSING,-9:MISSING,0,1,11,0,12,,,,320,,,320,40,40,40,40,40,40,40,40,40,40,,,,,,,,,,,,,,,,,,,320,65.454545455,,192.72727273,97.6,97.3,97.9,96.5,97.5,97.3,98.2,97.9,,,,,,,,,,,,,,,36.444444444,36.277777778,36.611111111,35.833333333,36.388888889,36.277777778,36.777777778,36.611111111,,,,,,,,,,,,,,,97.4,97.7,98,36.333333333,36.5,36.666666667,36.402777778,36.5,36.451388889,4:ARMPIT,4:ARMPIT,4:ARMPIT,4:ARMPIT,4:ARMPIT,4:ARMPIT,4:ARMPIT,4:ARMPIT,-9:MISSING,-9:MISSING,-9:MISSING,-9:MISSING,-9:MISSING,-9:MISSING,-9:MISSING,-9:MISSING,-9:MISSING,-9:MISSING,-9:MISSING,-9:MISSING,-9:MISSING,-9:MISSING,4:ARMPIT,4:ARMPIT,4:ARMPIT,0,0,0,0,0,0,0,0,0,8,3,11,A
10051,1:BASELINE,4.6,7,3,2,4.6,2,4.6,3,4.6,4,4.6,5,4.6,6,,,,,,,,,,,,,,,,,,,,,,,,,,,,,,,,,,,,,,,,,1:GIVEN,-9:MISSING,-9:MISSING,1:GIVEN,-9:MISSING,-9:MISSING,1:GIVEN,1:GIVEN,1:GIVEN,1:GIVEN,1:GIVEN,-9:MISSING,-9:MISSING,-9:MISSING,-9:MISSING,-9:MISSING,-9:MISSING,-9:MISSING,-9:MISSING,-9:MISSING,-9:MISSING,-9:MISSING,-9:MISSING,-9:MISSING,-9:MISSING,-9:MISSING,-9:MISSING,-9:MISSING,-9:MISSING,-9:MISSING,-9:MISSING,1:GIVEN,-9:MISSING,-9:MISSING,1,1,5,1,8,445,,,445,,,445,81,81,81,81,,,,,,,,,,,,,,,,,,,,,445,,,445,445,153.8,445,372.2,100.1,99.2,,,,,,,,,,,,,,,,,,,,,37.833333333,37.333333333,,,,,,,,,,,,,,,,,,,,,96.2,97.6,100,35.666666667,36.444444444,37.777777778,37.583333333,36.62962963,37.106481481,2:MOUTH,2:MOUTH,-9:MISSING,-9:MISSING,-9:MISSING,-9:MISSING,-9:MISSING,-9:MISSING,-9:MISSING,-9:MISSING,-9:MISSING,-9:MISSING,-9:MISSING,-9:MISSING,-9:MISSING,-9:MISSING,-9:MISSING,-9:MISSING,-9:MISSING,-9:MISSING,-9:MISSING,-9:MISSING,2:MOUTH,2:MOUTH,2:MOUTH,0,0,0,2,3,5,0,0,0,0,0,0,A
10053,1:BASELINE,1.9,12,3,5,1.9,4,1.9,5,1.9,6,1.9,7,1.9,8,1.9,9,1.9,10,1.9,11,,,,,,,,,,,,,,,,,,,,,,,,,,,,,,,,,,,-9:MISSING,-9:MISSING,-9:MISSING,-9:MISSING,-9:MISSING,-9:MISSING,1:GIVEN,1:GIVEN,1:GIVEN,1:GIVEN,1:GIVEN,1:GIVEN,1:GIVEN,1:GIVEN,-9:MISSING,-9:MISSING,-9:MISSING,-9:MISSING,-9:MISSING,-9:MISSING,-9:MISSING,-9:MISSING,-9:MISSING,-9:MISSING,-9:MISSING,-9:MISSING,-9:MISSING,-9:MISSING,-9:MISSING,-9:MISSING,-9:MISSING,-9:MISSING,-9:MISSING,-9:MISSING,0,0,8,0,8,,,,,,,,,,,,,,,,,,,,,,,,,,,,,,,,,,,,,,,,96.5,98.3,98.1,96.1,98.1,,,,,,,,,,,,,,,,,,35.833333333,36.833333333,36.722222222,35.611111111,36.722222222,,,,,,,,,,,,,,,,,,97.3,96.9,98.2,36.277777778,36.055555556,36.777777778,36.344444444,36.37037037,36.357407407,4:ARMPIT,4:ARMPIT,4:ARMPIT,4:ARMPIT,4:ARMPIT,-9:MISSING,-9:MISSING,-9:MISSING,-9:MISSING,-9:MISSING,-9:MISSING,-9:MISSING,-9:MISSING,-9:MISSING,-9:MISSING,-9:MISSING,-9:MISSING,-9:MISSING,-9:MISSING,-9:MISSING,-9:MISSING,-9:MISSING,4:ARMPIT,4:ARMPIT,4:ARMPIT,0,0,0,0,0,0,0,0,0,5,3,8,A
10054,1:BASELINE,6.7,9,2,,6.7,3,6.7,4,,,,,,,,,,,,,,,,,,,,,,,,,,,,,,,,,,,,,,,,,,,,,,,-9:MISSING,1:GIVEN,-9:MISSING,-9:MISSING,-9:MISSING,-9:MISSING,1:GIVEN,-9:MISSING,-9:MISSING,-9:MISSING,-9:MISSING,-9:MISSING,-9:MISSING,-9:MISSING,-9:MISSING,-9:MISSING,-9:MISSING,-9:MISSING,-9:MISSING,-9:MISSING,-9:MISSING,-9:MISSING,-9:MISSING,-9:MISSING,-9:MISSING,-9:MISSING,-9:MISSING,-9:MISSING,-9:MISSING,-9:MISSING,-9:MISSING,-9:MISSING,-9:MISSING,-9:MISSING,1,0,1,0,2,,122,,,,,122,,,,,,,,,,,,,,,,,,,,,,,,,,,,122,,122,,122,,,,,,,,,,,,,,,,,,,,,,,,,,,,,,,,,,,,,,,,,,,,,99.4,99.4,,37.444444444,37.444444444,,,37.444444444,37.444444444,-9:MISSING,-9:MISSING,-9:MISSING,-9:MISSING,-9:MISSING,-9:MISSING,-9:MISSING,-9:MISSING,-9:MISSING,-9:MISSING,-9:MISSING,-9:MISSING,-9:MISSING,-9:MISSING,-9:MISSING,-9:MISSING,-9:MISSING,-9:MISSING,-9:MISSING,-9:MISSING,-9:MISSING,-9:MISSING,2:MOUTH,2:MOUTH,-9:MISSING,0,0,0,0,2,2,0,0,0,0,0,0,A
10056,1:BASELINE,0.7,8,3,5,0.7,3,0.7,4,0.7,5,0.7,3,0.7,4,0.7,5,0.7,6,0.7,7,,,,,,,,,,,,,,,,,,,,,,,,,,,,,,,,,,,2:NOT GIVEN,2:NOT GIVEN,2:NOT GIVEN,2:NOT GIVEN,2:NOT GIVEN,2:NOT GIVEN,1:GIVEN,1:GIVEN,1:GIVEN,1:GIVEN,1:GIVEN,1:GIVEN,1:GIVEN,1:GIVEN,-9:MISSING,-9:MISSING,-9:MISSING,-9:MISSING,-9:MISSING,-9:MISSING,-9:MISSING,-9:MISSING,-9:MISSING,-9:MISSING,-9:MISSING,-9:MISSING,-9:MISSING,-9:MISSING,-9:MISSING,-9:MISSING,-9:MISSING,2:NOT GIVEN,2:NOT GIVEN,2:NOT GIVEN,0,0,8,0,8,,,,,,,40,40,40,40,40,40,40,40,,,,,,,,,,,,,,,,,,,,,,,40,,40,99.1,98.3,97.2,96.8,97.5,,,,,,,,,,,,,,,,,,37.277777778,36.833333333,36.222222222,36,36.388888889,,,,,,,,,,,,,,,,,,99.1,98.3,97.2,37.277777778,36.833333333,36.222222222,36.544444444,36.777777778,36.661111111,4:ARMPIT,4:ARMPIT,4:ARMPIT,4:ARMPIT,4:ARMPIT,-9:MISSING,-9:MISSING,-9:MISSING,-9:MISSING,-9:MISSING,-9:MISSING,-9:MISSING,-9:MISSING,-9:MISSING,-9:MISSING,-9:MISSING,-9:MISSING,-9:MISSING,-9:MISSING,-9:MISSING,-9:MISSING,-9:MISSING,4:ARMPIT,4:ARMPIT,4:ARMPIT,0,0,0,0,0,0,0,0,0,5,3,8,A
10057,1:BASELINE,6,7,3,1,6,3,6,4,6,5,6,6,,,,,,,,,,,,,,,,,,,,,,,,,,,,,,,,,,,,,,,,,,,1:GIVEN,1:GIVEN,1:GIVEN,2:NOT GIVEN,1:GIVEN,1:GIVEN,1:GIVEN,1:GIVEN,1:GIVEN,1:GIVEN,-9:MISSING,-9:MISSING,-9:MISSING,-9:MISSING,-9:MISSING,-9:MISSING,-9:MISSING,-9:MISSING,-9:MISSING,-9:MISSING,-9:MISSING,-9:MISSING,-9:MISSING,-9:MISSING,-9:MISSING,-9:MISSING,-9:MISSING,-9:MISSING,-9:MISSING,-9:MISSING,-9:MISSING,1:GIVEN,1:GIVEN,2:NOT GIVEN,3,2,4,2,11,486,486,486,,486,486,486,486,486,81,,,,,,,,,,,,,,,,,,,,,,486,486,,486,486,384.75,486,460.6875,100,,,,,,,,,,,,,,,,,,,,,,37.777777778,,,,,,,,,,,,,,,,,,,,,,99,98.4,99.8,36.222222222,36.888888889,37.666666667,37.777777778,36.925925926,37.351851852,2:MOUTH,-9:MISSING,-9:MISSING,-9:MISSING,-9:MISSING,-9:MISSING,-9:MISSING,-9:MISSING,-9:MISSING,-9:MISSING,-9:MISSING,-9:MISSING,-9:MISSING,-9:MISSING,-9:MISSING,-9:MISSING,-9:MISSING,-9:MISSING,-9:MISSING,-9:MISSING,-9:MISSING,-9:MISSING,1:RECTUM,2:MOUTH,2:MOUTH,0,1,1,1,2,3,0,0,0,0,0,0,A
10059,1:BASELINE,6.8,6,3,11,6.8,3,6.8,4,6.8,5,6.8,6,6.8,7,6.8,8,6.8,9,6.8,10,6.8,11,6.8,12,6.8,13,6.8,14,6.8,15,6.8,16,,,,,,,,,,,,,,,,,,,,,,,-9:MISSING,-9:MISSING,-9:MISSING,-9:MISSING,-9:MISSING,-9:MISSING,-9:MISSING,-9:MISSING,-9:MISSING,-9:MISSING,-9:MISSING,-9:MISSING,-9:MISSING,-9:MISSING,-9:MISSING,-9:MISSING,-9:MISSING,-9:MISSING,-9:MISSING,-9:MISSING,-9:MISSING,-9:MISSING,-9:MISSING,-9:MISSING,-9:MISSING,-9:MISSING,-9:MISSING,-9:MISSING,-9:MISSING,-9:MISSING,-9:MISSING,-9:MISSING,-9:MISSING,-9:MISSING,0,0,0,0,0,,,,,,,,81,81,81,81,81,81,81,81,81,81,81,81,81,,,,,,,,,,,,,,,,,81,,81,98.6,98.2,97.8,96.8,98.1,98.3,98.1,97.7,99.8,97.4,97.9,,,,,,,,,,,,37,36.777777778,36.555555556,36,36.722222222,36.833333333,36.722222222,36.5,37.666666667,36.333333333,36.611111111,,,,,,,,,,,,97.5,98,98.7,36.388888889,36.666666667,37.055555556,36.702020202,36.703703704,36.702861953,-9:MISSING,-9:MISSING,-9:MISSING,-9:MISSING,-9:MISSING,-9:MISSING,-9:MISSING,-9:MISSING,-9:MISSING,-9:MISSING,-9:MISSING,-9:MISSING,-9:MISSING,-9:MISSING,-9:MISSING,-9:MISSING,-9:MISSING,-9:MISSING,-9:MISSING,-9:MISSING,-9:MISSING,-9:MISSING,-9:MISSING,-9:MISSING,-9:MISSING,0,0,0,0,0,0,0,0,0,0,0,0,A