blind_id,VISIT,r105_age,CATHNO,cathcod,cath0,cath_age_0,CATHNAM_0,cath1,cath_age_1,CATHNAM_1,cath2,cath_age_2,CATHNAM_2,cath3,cath_age_3,CATHNAM_3,cath4,cath_age_4,CATHNAM_4,NUMSURG,surgcode,SURGCOD_0,SURG_S_0,SURGCOD_1,SURG_S_1,SURGCOD_2,SURG_S_2,SURGCOD_3,SURG_S_3,SURGCOD_4,SURG_S_4,SURGCOD_5,SURG_S_5,CPB,CPB_EV_0,CPB_MN_0,CPB_SPC_0,DHCA_MN_0,DHCA_YN_0,HCT_PCT_0,LOW_TEMP_0,RCPFLOW_0,RCP_MN_0,RCP_YN_0,CPB_EV_1,CPB_MN_1,CPB_SPC_1,DHCA_MN_1,DHCA_YN_1,HCT_PCT_1,LOW_TEMP_1,RCPFLOW_1,RCP_MN_1,RCP_YN_1,PACER,pacer_age,PACERTY,PACER_S,ARRHYTH,INTRATACH,SUPRATACH,ATRIALFLUT,ATRIALFIB,JUNCTACH,VENTTACH,VENTFIB,BRADYCAR,AVBLK2ND,AVBLK3RD,ARRHYOTH,ARRHYOTH_S
184,3,366,0,,,,,,,,,,,,,,,,,0,.,,,,,,,,,,,,,-2,,,,,,,,,,,,,,,,,,,,,-2:Skipped,,-2,-2,2:No,-2:Skipped,-2:Skipped,-2:Skipped,-2:Skipped,-2:Skipped,-2:Skipped,-2:Skipped,-2:Skipped,-2:Skipped,-2:Skipped,-2:Skipped,-2
508,3,367,0,,,,,,,,,,,,,,,,,0,.,,,,,,,,,,,,,-2,,,,,,,,,,,,,,,,,,,,,-2:Skipped,,-2,-2,2:No,-2:Skipped,-2:Skipped,-2:Skipped,-2:Skipped,-2:Skipped,-2:Skipped,-2:Skipped,-2:Skipped,-2:Skipped,-2:Skipped,-2:Skipped,-2
39,3,413,0,,,,,,,,,,,,,,,,,0,.,,,,,,,,,,,,,-2,,,,,,,,,,,,,,,,,,,,,-2:Skipped,,-2,-2,2:No,-2:Skipped,-2:Skipped,-2:Skipped,-2:Skipped,-2:Skipped,-2:Skipped,-2:Skipped,-2:Skipped,-2:Skipped,-2:Skipped,-2:Skipped,-2
74,3,366,0,,,,,,,,,,,,,,,,,0,.,,,,,,,,,,,,,-2,,,,,,,,,,,,,,,,,,,,,-2:Skipped,,-2,-2,2:No,-2:Skipped,-2:Skipped,-2:Skipped,-2:Skipped,-2:Skipped,-2:Skipped,-2:Skipped,-2:Skipped,-2:Skipped,-2:Skipped,-2:Skipped,-2
778,3,367,0,,,,,,,,,,,,,,,,,0,.,,,,,,,,,,,,,-2,,,,,,,,,,,,,,,,,,,,,-2:Skipped,,-2,-2,2:No,-2:Skipped,-2:Skipped,-2:Skipped,-2:Skipped,-2:Skipped,-2:Skipped,-2:Skipped,-2:Skipped,-2:Skipped,-2:Skipped,-2:Skipped,-2
772,3,382,0,,,,,,,,,,,,,,,,,0,.,,,,,,,,,,,,,-2,,,,,,,,,,,,,,,,,,,,,-2:Skipped,,-2,-2,2:No,-2:Skipped,-2:Skipped,-2:Skipped,-2:Skipped,-2:Skipped,-2:Skipped,-2:Skipped,-2:Skipped,-2:Skipped,-2:Skipped,-2:Skipped,-2
700,3,373,0,,,,,,,,,,,,,,,,,1,99,99,cleft lip repair,,.,,.,,.,,.,,.,0,,,,,,,,,,,,,,,,,,,,,2:No,,-2,-2,2:No,-2:Skipped,-2:Skipped,-2:Skipped,-2:Skipped,-2:Skipped,-2:Skipped,-2:Skipped,-2:Skipped,-2:Skipped,-2:Skipped,-2:Skipped,-2
375,3,421,2,F1.03.02.01.01|F7.03.02.01.01,F1.03.02.01.01,156,-2,F7.03.02.01.01,156,-2,,,.,,,.,,,.,2,19|10,19,-2,10,-2,,.,,.,,.,,.,0,,,,,,,,,,,,,,,,,,,,,2:No,,-2,-2,2:No,-2:Skipped,-2:Skipped,-2:Skipped,-2:Skipped,-2:Skipped,-2:Skipped,-2:Skipped,-2:Skipped,-2:Skipped,-2:Skipped,-2:Skipped,-2
292,3,371,0,,,,,,,,,,,,,,,,,0,.,,,,,,,,,,,,,-2,,,,,,,,,,,,,,,,,,,,,-2:Skipped,,-2,-2,2:No,-2:Skipped,-2:Skipped,-2:Skipped,-2:Skipped,-2:Skipped,-2:Skipped,-2:Skipped,-2:Skipped,-2:Skipped,-2:Skipped,-2:Skipped,-2
818,3,373,0,,,,,,,,,,,,,,,,,0,.,,,,,,,,,,,,,-2,,,,,,,,,,,,,,,,,,,,,-2:Skipped,,-2,-2,2:No,-2:Skipped,-2:Skipped,-2:Skipped,-2:Skipped,-2:Skipped,-2:Skipped,-2:Skipped,-2:Skipped,-2:Skipped,-2:Skipped,-2:Skipped,-2
78,3,366,0,,,,,,,,,,,,,,,,,0,.,,,,,,,,,,,,,-2,,,,,,,,,,,,,,,,,,,,,-2:Skipped,,-2,-2,2:No,-2:Skipped,-2:Skipped,-2:Skipped,-2:Skipped,-2:Skipped,-2:Skipped,-2:Skipped,-2:Skipped,-2:Skipped,-2:Skipped,-2:Skipped,-2
246,3,466,0,,,,,,,,,,,,,,,,,0,.,,,,,,,,,,,,,-2,,,,,,,,,,,,,,,,,,,,,-2:Skipped,,-2,-2,2:No,-2:Skipped,-2:Skipped,-2:Skipped,-2:Skipped,-2:Skipped,-2:Skipped,-2:Skipped,-2:Skipped,-2:Skipped,-2:Skipped,-2:Skipped,-2
83,3,438,0,,,,,,,,,,,,,,,,,0,.,,,,,,,,,,,,,-2,,,,,,,,,,,,,,,,,,,,,-2:Skipped,,-2,-2,2:No,-2:Skipped,-2:Skipped,-2:Skipped,-2:Skipped,-2:Skipped,-2:Skipped,-2:Skipped,-2:Skipped,-2:Skipped,-2:Skipped,-2:Skipped,-2
282,3,401,0,,,,,,,,,,,,,,,,,1,99,99,SCOPE REMOVAL OF FOREIGN OBJECT,,.,,.,,.,,.,,.,0,,,,,,,,,,,,,,,,,,,,,2:No,,-2,-2,2:No,-2:Skipped,-2:Skipped,-2:Skipped,-2:Skipped,-2:Skipped,-2:Skipped,-2:Skipped,-2:Skipped,-2:Skipped,-2:Skipped,-2:Skipped,-2
702,3,396,5,F8.03|F1.01.01|F1.01.03|F8.03|F9,F8.03,177,-2,F1.01.01,177,-2,F1.01.03,212,BALLOON ANGIOPLASTY (RIGHT INNOMINATE ARTERY),F8.03,212,-2,F9,212,PLEURACENTESIS,3,19|19|99,19,-2,19,-2,99,LIGATION OF LEAKING LYMPHATIC VESSELS,,.,,.,,.,0,,,,,,,,,,,,,,,,,,,,,2:No,,-2,-2,2:No,-2:Skipped,-2:Skipped,-2:Skipped,-2:Skipped,-2:Skipped,-2:Skipped,-2:Skipped,-2:Skipped,-2:Skipped,-2:Skipped,-2:Skipped,-2
54,3,354,0,,,,,,,,,,,,,,,,,0,.,,,,,,,,,,,,,-2,,,,,,,,,,,,,,,,,,,,,-2:Skipped,,-2,-2,2:No,-2:Skipped,-2:Skipped,-2:Skipped,-2:Skipped,-2:Skipped,-2:Skipped,-2:Skipped,-2:Skipped,-2:Skipped,-2:Skipped,-2:Skipped,-2
416,3,418,0,,,,,,,,,,,,,,,,,0,.,,,,,,,,,,,,,-2,,,,,,,,,,,,,,,,,,,,,-2:Skipped,,-2,-2,2:No,-2:Skipped,-2:Skipped,-2:Skipped,-2:Skipped,-2:Skipped,-2:Skipped,-2:Skipped,-2:Skipped,-2:Skipped,-2:Skipped,-2:Skipped,-2
92,3,394,0,,,,,,,,,,,,,,,,,0,.,,,,,,,,,,,,,-2,,,,,,,,,,,,,,,,,,,,,-2:Skipped,,-2,-2,2:No,-2:Skipped,-2:Skipped,-2:Skipped,-2:Skipped,-2:Skipped,-2:Skipped,-2:Skipped,-2:Skipped,-2:Skipped,-2:Skipped,-2:Skipped,-2
792,3,381,0,,,,,,,,,,,,,,,,,0,.,,,,,,,,,,,,,-2,,,,,,,,,,,,,,,,,,,,,-2:Skipped,,-2,-2,2:No,-2:Skipped,-2:Skipped,-2:Skipped,-2:Skipped,-2:Skipped,-2:Skipped,-2:Skipped,-2:Skipped,-2:Skipped,-2:Skipped,-2:Skipped,-2
87,3,423,0,,,,,,,,,,,,,,,,,0,.,,,,,,,,,,,,,-2,,,,,,,,,,,,,,,,,,,,,-2:Skipped,,-2,-2,2:No,-2:Skipped,-2:Skipped,-2:Skipped,-2:Skipped,-2:Skipped,-2:Skipped,-2:Skipped,-2:Skipped,-2:Skipped,-2:Skipped,-2:Skipped,-2
624,3,406,0,,,,,,,,,,,,,,,,,0,.,,,,,,,,,,,,,-2,,,,,,,,,,,,,,,,,,,,,-2:Skipped,,-2,-2,2:No,-2:Skipped,-2:Skipped,-2:Skipped,-2:Skipped,-2:Skipped,-2:Skipped,-2:Skipped,-2:Skipped,-2:Skipped,-2:Skipped,-2:Skipped,-2
113,3,386,0,,,,,,,,,,,,,,,,,0,.,,,,,,,,,,,,,-2,,,,,,,,,,,,,,,,,,,,,-2:Skipped,,-2,-2,2:No,-2:Skipped,-2:Skipped,-2:Skipped,-2:Skipped,-2:Skipped,-2:Skipped,-2:Skipped,-2:Skipped,-2:Skipped,-2:Skipped,-2:Skipped,-2
619,3,380,2,F8.03|F8.03,F8.03,151,-2,F8.03,151,-2,,,.,,,.,,,.,0,.,,,,,,,,,,,,,-2,,,,,,,,,,,,,,,,,,,,,-2:Skipped,,-2,-2,2:No,-2:Skipped,-2:Skipped,-2:Skipped,-2:Skipped,-2:Skipped,-2:Skipped,-2:Skipped,-2:Skipped,-2:Skipped,-2:Skipped,-2:Skipped,-2
598,3,368,0,,,,,,,,,,,,,,,,,0,.,,,,,,,,,,,,,-2,,,,,,,,,,,,,,,,,,,,,-2:Skipped,,-2,-2,2:No,-2:Skipped,-2:Skipped,-2:Skipped,-2:Skipped,-2:Skipped,-2:Skipped,-2:Skipped,-2:Skipped,-2:Skipped,-2:Skipped,-2:Skipped,-2
344,3,379,0,,,,,,,,,,,,,,,,,1,19,19,-2,,.,,.,,.,,.,,.,0,,,,,,,,,,,,,,,,,,,,,2:No,,-2,-2,2:No,-2:Skipped,-2:Skipped,-2:Skipped,-2:Skipped,-2:Skipped,-2:Skipped,-2:Skipped,-2:Skipped,-2:Skipped,-2:Skipped,-2:Skipped,-2
589,3,392,3,F7.07|F3.01|F8.01,F7.07,390,-2,F3.01,390,-2,F8.01,390,-2,,,.,,,.,0,.,,,,,,,,,,,,,-2,,,,,,,,,,,,,,,,,,,,,-2:Skipped,,-2,-2,1:Yes,2:No,2:No,2:No,2:No,2:No,2:No,2:No,2:No,1:Yes,2:No,2:No,-2
801,3,366,0,,,,,,,,,,,,,,,,,0,.,,,,,,,,,,,,,-2,,,,,,,,,,,,,,,,,,,,,-2:Skipped,,-2,-2,2:No,-2:Skipped,-2:Skipped,-2:Skipped,-2:Skipped,-2:Skipped,-2:Skipped,-2:Skipped,-2:Skipped,-2:Skipped,-2:Skipped,-2:Skipped,-2
206,3,422,3,F1.01.01|F1.01.03|F8.03,F1.01.01,252,-2,F1.01.03,252,DILATION OF ORIGIN OF RIGHT SCA,F8.03,252,-2,,,.,,,.,0,.,,,,,,,,,,,,,-2,,,,,,,,,,,,,,,,,,,,,-2:Skipped,,-2,-2,2:No,-2:Skipped,-2:Skipped,-2:Skipped,-2:Skipped,-2:Skipped,-2:Skipped,-2:Skipped,-2:Skipped,-2:Skipped,-2:Skipped,-2:Skipped,-2
286,3,411,0,,,,,,,,,,,,,,,,,0,.,,,,,,,,,,,,,-2,,,,,,,,,,,,,,,,,,,,,-2:Skipped,,-2,-2,2:No,-2:Skipped,-2:Skipped,-2:Skipped,-2:Skipped,-2:Skipped,-2:Skipped,-2:Skipped,-2:Skipped,-2:Skipped,-2:Skipped,-2:Skipped,-2
5,3,443,0,,,,,,,,,,,,,,,,,1,99,99,FIRST STAGE FOWLER-STEPHENS PROCEDURE (ORCHIOPEXY),,.,,.,,.,,.,,.,0,,,,,,,,,,,,,,,,,,,,,2:No,,-2,-2,2:No,-2:Skipped,-2:Skipped,-2:Skipped,-2:Skipped,-2:Skipped,-2:Skipped,-2:Skipped,-2:Skipped,-2:Skipped,-2:Skipped,-2:Skipped,-2
771,3,69,0,,,,,,,,,,,,,,,,,0,.,,,,,,,,,,,,,-2,,,,,,,,,,,,,,,,,,,,,-2:Skipped,,-2,-2,2:No,-2:Skipped,-2:Skipped,-2:Skipped,-2:Skipped,-2:Skipped,-2:Skipped,-2:Skipped,-2:Skipped,-2:Skipped,-2:Skipped,-2:Skipped,-2
366,3,374,0,,,,,,,,,,,,,,,,,0,.,,,,,,,,,,,,,-2,,,,,,,,,,,,,,,,,,,,,-2:Skipped,,-2,-2,2:No,-2:Skipped,-2:Skipped,-2:Skipped,-2:Skipped,-2:Skipped,-2:Skipped,-2:Skipped,-2:Skipped,-2:Skipped,-2:Skipped,-2:Skipped,-2
879,3,424,0,,,,,,,,,,,,,,,,,0,.,,,,,,,,,,,,,-2,,,,,,,,,,,,,,,,,,,,,-2:Skipped,,-2,-2,2:No,-2:Skipped,-2:Skipped,-2:Skipped,-2:Skipped,-2:Skipped,-2:Skipped,-2:Skipped,-2:Skipped,-2:Skipped,-2:Skipped,-2:Skipped,-2
488,3,369,0,,,,,,,,,,,,,,,,,0,.,,,,,,,,,,,,,-2,,,,,,,,,,,,,,,,,,,,,-2:Skipped,,-2,-2,2:No,-2:Skipped,-2:Skipped,-2:Skipped,-2:Skipped,-2:Skipped,-2:Skipped,-2:Skipped,-2:Skipped,-2:Skipped,-2:Skipped,-2:Skipped,-2
628,3,315,4,F3.01|F8.01|F8.01|F8.03,F3.01,288,-2,F8.01,288,-2,F8.01,288,-2,F8.03,288,-2,,,.,0,.,,,,,,,,,,,,,-2,,,,,,,,,,,,,,,,,,,,,-2:Skipped,,-2,-2,2:No,-2:Skipped,-2:Skipped,-2:Skipped,-2:Skipped,-2:Skipped,-2:Skipped,-2:Skipped,-2:Skipped,-2:Skipped,-2:Skipped,-2:Skipped,-2
56,3,369,0,,,,,,,,,,,,,,,,,0,.,,,,,,,,,,,,,-2,,,,,,,,,,,,,,,,,,,,,-2:Skipped,,-2,-2,2:No,-2:Skipped,-2:Skipped,-2:Skipped,-2:Skipped,-2:Skipped,-2:Skipped,-2:Skipped,-2:Skipped,-2:Skipped,-2:Skipped,-2:Skipped,-2
365,3,369,0,,,,,,,,,,,,,,,,,0,.,,,,,,,,,,,,,-2,,,,,,,,,,,,,,,,,,,,,-2:Skipped,,-2,-2,2:No,-2:Skipped,-2:Skipped,-2:Skipped,-2:Skipped,-2:Skipped,-2:Skipped,-2:Skipped,-2:Skipped,-2:Skipped,-2:Skipped,-2:Skipped,-2
141,3,416,3,F3.01|F1.01.01|F2.02,F3.01,287,-2,F1.01.01,287,-2,F2.02,287,-2,,,.,,,.,0,.,,,,,,,,,,,,,-2,,,,,,,,,,,,,,,,,,,,,-2:Skipped,,-2,-2,2:No,-2:Skipped,-2:Skipped,-2:Skipped,-2:Skipped,-2:Skipped,-2:Skipped,-2:Skipped,-2:Skipped,-2:Skipped,-2:Skipped,-2:Skipped,-2
707,3,368,0,,,,,,,,,,,,,,,,,0,.,,,,,,,,,,,,,-2,,,,,,,,,,,,,,,,,,,,,-2:Skipped,,-2,-2,2:No,-2:Skipped,-2:Skipped,-2:Skipped,-2:Skipped,-2:Skipped,-2:Skipped,-2:Skipped,-2:Skipped,-2:Skipped,-2:Skipped,-2:Skipped,-2
646,3,364,0,,,,,,,,,,,,,,,,,1,99,99,REMOVAL OF STERAL WIRE,,.,,.,,.,,.,,.,0,,,,,,,,,,,,,,,,,,,,,2:No,,-2,-2,2:No,-2:Skipped,-2:Skipped,-2:Skipped,-2:Skipped,-2:Skipped,-2:Skipped,-2:Skipped,-2:Skipped,-2:Skipped,-2:Skipped,-2:Skipped,-2
4,3,384,0,,,,,,,,,,,,,,,,,2,1|8,1,-2,8,-2,,.,,.,,.,,.,0,,,,,,,,,,,,,,,,,,,,,2:No,,-2,-2,1:Yes,2:No,1:Yes,2:No,2:No,2:No,2:No,2:No,2:No,2:No,2:No,2:No,-2
777,3,427,0,,,,,,,,,,,,,,,,,0,.,,,,,,,,,,,,,-2,,,,,,,,,,,,,,,,,,,,,-2:Skipped,,-2,-2,2:No,-2:Skipped,-2:Skipped,-2:Skipped,-2:Skipped,-2:Skipped,-2:Skipped,-2:Skipped,-2:Skipped,-2:Skipped,-2:Skipped,-2:Skipped,-2
623,3,412,0,,,,,,,,,,,,,,,,,0,.,,,,,,,,,,,,,-2,,,,,,,,,,,,,,,,,,,,,-2:Skipped,,-2,-2,2:No,-2:Skipped,-2:Skipped,-2:Skipped,-2:Skipped,-2:Skipped,-2:Skipped,-2:Skipped,-2:Skipped,-2:Skipped,-2:Skipped,-2:Skipped,-2
318,3,393,0,,,,,,,,,,,,,,,,,0,.,,,,,,,,,,,,,-2,,,,,,,,,,,,,,,,,,,,,-2:Skipped,,-2,-2,2:No,-2:Skipped,-2:Skipped,-2:Skipped,-2:Skipped,-2:Skipped,-2:Skipped,-2:Skipped,-2:Skipped,-2:Skipped,-2:Skipped,-2:Skipped,-2
62,3,411,0,,,,,,,,,,,,,,,,,1,8,8,-2,,.,,.,,.,,.,,.,0,,,,,,,,,,,,,,,,,,,,,2:No,,-2,-2,2:No,-2:Skipped,-2:Skipped,-2:Skipped,-2:Skipped,-2:Skipped,-2:Skipped,-2:Skipped,-2:Skipped,-2:Skipped,-2:Skipped,-2:Skipped,-2
732,3,481,0,,,,,,,,,,,,,,,,,0,.,,,,,,,,,,,,,-2,,,,,,,,,,,,,,,,,,,,,-2:Skipped,,-2,-2,2:No,-2:Skipped,-2:Skipped,-2:Skipped,-2:Skipped,-2:Skipped,-2:Skipped,-2:Skipped,-2:Skipped,-2:Skipped,-2:Skipped,-2:Skipped,-2
2,3,433,0,,,,,,,,,,,,,,,,,0,.,,,,,,,,,,,,,-2,,,,,,,,,,,,,,,,,,,,,-2:Skipped,,-2,-2,2:No,-2:Skipped,-2:Skipped,-2:Skipped,-2:Skipped,-2:Skipped,-2:Skipped,-2:Skipped,-2:Skipped,-2:Skipped,-2:Skipped,-2:Skipped,-2
409,3,407,0,,,,,,,,,,,,,,,,,1,8,8,-2,,.,,.,,.,,.,,.,0,,,,,,,,,,,,,,,,,,,,,2:No,,-2,-2,2:No,-2:Skipped,-2:Skipped,-2:Skipped,-2:Skipped,-2:Skipped,-2:Skipped,-2:Skipped,-2:Skipped,-2:Skipped,-2:Skipped,-2:Skipped,-2
634,3,978,0,,,,,,,,,,,,,,,,,1,22,22,-2,,.,,.,,.,,.,,.,1,22,164,-2,-2,2,43,28,-2,-2,2,,,.,,,,,,,,2:No,,-2,-2,2:No,-2:Skipped,-2:Skipped,-2:Skipped,-2:Skipped,-2:Skipped,-2:Skipped,-2:Skipped,-2:Skipped,-2:Skipped,-2:Skipped,-2:Skipped,-2
154,3,343,0,,,,,,,,,,,,,,,,,0,.,,,,,,,,,,,,,-2,,,,,,,,,,,,,,,,,,,,,-2:Skipped,,-2,-2,2:No,-2:Skipped,-2:Skipped,-2:Skipped,-2:Skipped,-2:Skipped,-2:Skipped,-2:Skipped,-2:Skipped,-2:Skipped,-2:Skipped,-2:Skipped,-2
377,3,372,1,F1.02.01,F1.02.01,320,-2,,,.,,,.,,,.,,,.,0,.,,,,,,,,,,,,,-2,,,,,,,,,,,,,,,,,,,,,-2:Skipped,,-2,-2,2:No,-2:Skipped,-2:Skipped,-2:Skipped,-2:Skipped,-2:Skipped,-2:Skipped,-2:Skipped,-2:Skipped,-2:Skipped,-2:Skipped,-2:Skipped,-2
560,3,358,0,,,,,,,,,,,,,,,,,0,.,,,,,,,,,,,,,-2,,,,,,,,,,,,,,,,,,,,,-2:Skipped,,-2,-2,2:No,-2:Skipped,-2:Skipped,-2:Skipped,-2:Skipped,-2:Skipped,-2:Skipped,-2:Skipped,-2:Skipped,-2:Skipped,-2:Skipped,-2:Skipped,-2
541,3,366,0,,,,,,,,,,,,,,,,,0,.,,,,,,,,,,,,,-2,,,,,,,,,,,,,,,,,,,,,-2:Skipped,,-2,-2,2:No,-2:Skipped,-2:Skipped,-2:Skipped,-2:Skipped,-2:Skipped,-2:Skipped,-2:Skipped,-2:Skipped,-2:Skipped,-2:Skipped,-2:Skipped,-2
218,3,371,0,,,,,,,,,,,,,,,,,1,99,99,removal of gastrostomy tube,,.,,.,,.,,.,,.,0,,,,,,,,,,,,,,,,,,,,,2:No,,-2,-2,2:No,-2:Skipped,-2:Skipped,-2:Skipped,-2:Skipped,-2:Skipped,-2:Skipped,-2:Skipped,-2:Skipped,-2:Skipped,-2:Skipped,-2:Skipped,-2
836,3,366,0,,,,,,,,,,,,,,,,,0,.,,,,,,,,,,,,,-2,,,,,,,,,,,,,,,,,,,,,-2:Skipped,,-2,-2,2:No,-2:Skipped,-2:Skipped,-2:Skipped,-2:Skipped,-2:Skipped,-2:Skipped,-2:Skipped,-2:Skipped,-2:Skipped,-2:Skipped,-2:Skipped,-2
148,3,366,0,,,,,,,,,,,,,,,,,0,.,,,,,,,,,,,,,-2,,,,,,,,,,,,,,,,,,,,,-2:Skipped,,-2,-2,2:No,-2:Skipped,-2:Skipped,-2:Skipped,-2:Skipped,-2:Skipped,-2:Skipped,-2:Skipped,-2:Skipped,-2:Skipped,-2:Skipped,-2:Skipped,-2
27,3,370,0,,,,,,,,,,,,,,,,,0,.,,,,,,,,,,,,,-2,,,,,,,,,,,,,,,,,,,,,-2:Skipped,,-2,-2,1:Yes,2:No,1:Yes,2:No,2:No,2:No,2:No,2:No,2:No,2:No,2:No,2:No,-2
678,3,367,0,,,,,,,,,,,,,,,,,2,10|10,10,-2,10,-2,,.,,.,,.,,.,0,,,,,,,,,,,,,,,,,,,,,2:No,,-2,-2,2:No,-2:Skipped,-2:Skipped,-2:Skipped,-2:Skipped,-2:Skipped,-2:Skipped,-2:Skipped,-2:Skipped,-2:Skipped,-2:Skipped,-2:Skipped,-2
280,3,367,0,,,,,,,,,,,,,,,,,0,.,,,,,,,,,,,,,-2,,,,,,,,,,,,,,,,,,,,,-2:Skipped,,-2,-2,2:No,-2:Skipped,-2:Skipped,-2:Skipped,-2:Skipped,-2:Skipped,-2:Skipped,-2:Skipped,-2:Skipped,-2:Skipped,-2:Skipped,-2:Skipped,-2
356,3,371,0,,,,,,,,,,,,,,,,,1,1,1,-2,,.,,.,,.,,.,,.,0,,,,,,,,,,,,,,,,,,,,,2:No,,-2,-2,2:No,-2:Skipped,-2:Skipped,-2:Skipped,-2:Skipped,-2:Skipped,-2:Skipped,-2:Skipped,-2:Skipped,-2:Skipped,-2:Skipped,-2:Skipped,-2
608,3,370,0,,,,,,,,,,,,,,,,,0,.,,,,,,,,,,,,,-2,,,,,,,,,,,,,,,,,,,,,-2:Skipped,,-2,-2,2:No,-2:Skipped,-2:Skipped,-2:Skipped,-2:Skipped,-2:Skipped,-2:Skipped,-2:Skipped,-2:Skipped,-2:Skipped,-2:Skipped,-2:Skipped,-2
652,3,375,0,,,,,,,,,,,,,,,,,0,.,,,,,,,,,,,,,-2,,,,,,,,,,,,,,,,,,,,,-2:Skipped,,-2,-2,2:No,-2:Skipped,-2:Skipped,-2:Skipped,-2:Skipped,-2:Skipped,-2:Skipped,-2:Skipped,-2:Skipped,-2:Skipped,-2:Skipped,-2:Skipped,-2
253,3,372,0,,,,,,,,,,,,,,,,,0,.,,,,,,,,,,,,,-2,,,,,,,,,,,,,,,,,,,,,-2:Skipped,,-2,-2,2:No,-2:Skipped,-2:Skipped,-2:Skipped,-2:Skipped,-2:Skipped,-2:Skipped,-2:Skipped,-2:Skipped,-2:Skipped,-2:Skipped,-2:Skipped,-2
446,3,389,0,,,,,,,,,,,,,,,,,0,.,,,,,,,,,,,,,-2,,,,,,,,,,,,,,,,,,,,,-2:Skipped,,-2,-2,2:No,-2:Skipped,-2:Skipped,-2:Skipped,-2:Skipped,-2:Skipped,-2:Skipped,-2:Skipped,-2:Skipped,-2:Skipped,-2:Skipped,-2:Skipped,-2
814,3,399,0,,,,,,,,,,,,,,,,,0,.,,,,,,,,,,,,,-2,,,,,,,,,,,,,,,,,,,,,-2:Skipped,,-2,-2,2:No,-2:Skipped,-2:Skipped,-2:Skipped,-2:Skipped,-2:Skipped,-2:Skipped,-2:Skipped,-2:Skipped,-2:Skipped,-2:Skipped,-2:Skipped,-2
125,3,387,0,,,,,,,,,,,,,,,,,0,.,,,,,,,,,,,,,-2,,,,,,,,,,,,,,,,,,,,,-2:Skipped,,-2,-2,2:No,-2:Skipped,-2:Skipped,-2:Skipped,-2:Skipped,-2:Skipped,-2:Skipped,-2:Skipped,-2:Skipped,-2:Skipped,-2:Skipped,-2:Skipped,-2
565,3,371,0,,,,,,,,,,,,,,,,,0,.,,,,,,,,,,,,,-2,,,,,,,,,,,,,,,,,,,,,-2:Skipped,,-2,-2,2:No,-2:Skipped,-2:Skipped,-2:Skipped,-2:Skipped,-2:Skipped,-2:Skipped,-2:Skipped,-2:Skipped,-2:Skipped,-2:Skipped,-2:Skipped,-2
661,3,370,2,F8.03|F1.01.01,F8.03,294,-2,F1.01.01,294,-2,,,.,,,.,,,.,0,.,,,,,,,,,,,,,-2,,,,,,,,,,,,,,,,,,,,,-2:Skipped,,-2,-2,2:No,-2:Skipped,-2:Skipped,-2:Skipped,-2:Skipped,-2:Skipped,-2:Skipped,-2:Skipped,-2:Skipped,-2:Skipped,-2:Skipped,-2:Skipped,-2
358,3,366,0,,,,,,,,,,,,,,,,,0,.,,,,,,,,,,,,,-2,,,,,,,,,,,,,,,,,,,,,-2:Skipped,,-2,-2,2:No,-2:Skipped,-2:Skipped,-2:Skipped,-2:Skipped,-2:Skipped,-2:Skipped,-2:Skipped,-2:Skipped,-2:Skipped,-2:Skipped,-2:Skipped,-2
849,3,446,0,,,,,,,,,,,,,,,,,0,.,,,,,,,,,,,,,-2,,,,,,,,,,,,,,,,,,,,,-2:Skipped,,-2,-2,2:No,-2:Skipped,-2:Skipped,-2:Skipped,-2:Skipped,-2:Skipped,-2:Skipped,-2:Skipped,-2:Skipped,-2:Skipped,-2:Skipped,-2:Skipped,-2
784,3,296,0,,,,,,,,,,,,,,,,,0,.,,,,,,,,,,,,,-2,,,,,,,,,,,,,,,,,,,,,-2:Skipped,,-2,-2,1:Yes,2:No,2:No,2:No,2:No,2:No,2:No,2:No,2:No,2:No,2:No,2:No,-2
275,3,379,0,,,,,,,,,,,,,,,,,0,.,,,,,,,,,,,,,-2,,,,,,,,,,,,,,,,,,,,,-2:Skipped,,-2,-2,2:No,-2:Skipped,-2:Skipped,-2:Skipped,-2:Skipped,-2:Skipped,-2:Skipped,-2:Skipped,-2:Skipped,-2:Skipped,-2:Skipped,-2:Skipped,-2
476,3,379,0,,,,,,,,,,,,,,,,,6,99|99|1|99|99|99,99,rectoanal pull through for Hirschspring's disease,99,broviac insertion for ileus **/**/**,1,-2,99,rectoanal dilatation under anesthesia **/**/**,99,rectoanal dilatation under anesthesia **/**/**,99,rectoanal dilatation under anesthesia **/**/**,0,,,,,,,,,,,,,,,,,,,,,2:No,,-2,-2,2:No,-2:Skipped,-2:Skipped,-2:Skipped,-2:Skipped,-2:Skipped,-2:Skipped,-2:Skipped,-2:Skipped,-2:Skipped,-2:Skipped,-2:Skipped,-2
91,3,386,0,,,,,,,,,,,,,,,,,0,.,,,,,,,,,,,,,-2,,,,,,,,,,,,,,,,,,,,,-2:Skipped,,-2,-2,2:No,-2:Skipped,-2:Skipped,-2:Skipped,-2:Skipped,-2:Skipped,-2:Skipped,-2:Skipped,-2:Skipped,-2:Skipped,-2:Skipped,-2:Skipped,-2
843,3,370,0,,,,,,,,,,,,,,,,,0,.,,,,,,,,,,,,,-2,,,,,,,,,,,,,,,,,,,,,-2:Skipped,,-2,-2,2:No,-2:Skipped,-2:Skipped,-2:Skipped,-2:Skipped,-2:Skipped,-2:Skipped,-2:Skipped,-2:Skipped,-2:Skipped,-2:Skipped,-2:Skipped,-2
610,3,466,0,,,,,,,,,,,,,,,,,1,99,99,bilateral myringotomy with tubes,,.,,.,,.,,.,,.,0,,,,,,,,,,,,,,,,,,,,,2:No,,-2,-2,2:No,-2:Skipped,-2:Skipped,-2:Skipped,-2:Skipped,-2:Skipped,-2:Skipped,-2:Skipped,-2:Skipped,-2:Skipped,-2:Skipped,-2:Skipped,-2
829,3,390,0,,,,,,,,,,,,,,,,,0,.,,,,,,,,,,,,,-2,,,,,,,,,,,,,,,,,,,,,-2:Skipped,,-2,-2,2:No,-2:Skipped,-2:Skipped,-2:Skipped,-2:Skipped,-2:Skipped,-2:Skipped,-2:Skipped,-2:Skipped,-2:Skipped,-2:Skipped,-2:Skipped,-2
168,3,375,0,,,,,,,,,,,,,,,,,0,.,,,,,,,,,,,,,-2,,,,,,,,,,,,,,,,,,,,,-2:Skipped,,-2,-2,2:No,-2:Skipped,-2:Skipped,-2:Skipped,-2:Skipped,-2:Skipped,-2:Skipped,-2:Skipped,-2:Skipped,-2:Skipped,-2:Skipped,-2:Skipped,-2
61,3,396,0,,,,,,,,,,,,,,,,,0,.,,,,,,,,,,,,,-2,,,,,,,,,,,,,,,,,,,,,-2:Skipped,,-2,-2,2:No,-2:Skipped,-2:Skipped,-2:Skipped,-2:Skipped,-2:Skipped,-2:Skipped,-2:Skipped,-2:Skipped,-2:Skipped,-2:Skipped,-2:Skipped,-2
176,3,378,0,,,,,,,,,,,,,,,,,0,.,,,,,,,,,,,,,-2,,,,,,,,,,,,,,,,,,,,,-2:Skipped,,-2,-2,2:No,-2:Skipped,-2:Skipped,-2:Skipped,-2:Skipped,-2:Skipped,-2:Skipped,-2:Skipped,-2:Skipped,-2:Skipped,-2:Skipped,-2:Skipped,-2
761,3,375,0,,,,,,,,,,,,,,,,,1,8,8,-2,,.,,.,,.,,.,,.,0,,,,,,,,,,,,,,,,,,,,,2:No,,-2,-2,2:No,-2:Skipped,-2:Skipped,-2:Skipped,-2:Skipped,-2:Skipped,-2:Skipped,-2:Skipped,-2:Skipped,-2:Skipped,-2:Skipped,-2:Skipped,-2
708,3,449,0,,,,,,,,,,,,,,,,,0,.,,,,,,,,,,,,,-2,,,,,,,,,,,,,,,,,,,,,-2:Skipped,,-2,-2,2:No,-2:Skipped,-2:Skipped,-2:Skipped,-2:Skipped,-2:Skipped,-2:Skipped,-2:Skipped,-2:Skipped,-2:Skipped,-2:Skipped,-2:Skipped,-2
216,3,394,0,,,,,,,,,,,,,,,,,0,.,,,,,,,,,,,,,-2,,,,,,,,,,,,,,,,,,,,,-2:Skipped,,-2,-2,2:No,-2:Skipped,-2:Skipped,-2:Skipped,-2:Skipped,-2:Skipped,-2:Skipped,-2:Skipped,-2:Skipped,-2:Skipped,-2:Skipped,-2:Skipped,-2
514,3,376,0,,,,,,,,,,,,,,,,,0,.,,,,,,,,,,,,,-2,,,,,,,,,,,,,,,,,,,,,-2:Skipped,,-2,-2,2:No,-2:Skipped,-2:Skipped,-2:Skipped,-2:Skipped,-2:Skipped,-2:Skipped,-2:Skipped,-2:Skipped,-2:Skipped,-2:Skipped,-2:Skipped,-2
314,3,383,0,,,,,,,,,,,,,,,,,0,.,,,,,,,,,,,,,-2,,,,,,,,,,,,,,,,,,,,,-2:Skipped,,-2,-2,2:No,-2:Skipped,-2:Skipped,-2:Skipped,-2:Skipped,-2:Skipped,-2:Skipped,-2:Skipped,-2:Skipped,-2:Skipped,-2:Skipped,-2:Skipped,-2
58,3,385,0,,,,,,,,,,,,,,,,,0,.,,,,,,,,,,,,,-2,,,,,,,,,,,,,,,,,,,,,-2:Skipped,,-2,-2,2:No,-2:Skipped,-2:Skipped,-2:Skipped,-2:Skipped,-2:Skipped,-2:Skipped,-2:Skipped,-2:Skipped,-2:Skipped,-2:Skipped,-2:Skipped,-2
6,3,384,0,,,,,,,,,,,,,,,,,1,8,8,-2,,.,,.,,.,,.,,.,0,,,,,,,,,,,,,,,,,,,,,2:No,,-2,-2,2:No,-2:Skipped,-2:Skipped,-2:Skipped,-2:Skipped,-2:Skipped,-2:Skipped,-2:Skipped,-2:Skipped,-2:Skipped,-2:Skipped,-2:Skipped,-2
789,3,410,0,,,,,,,,,,,,,,,,,1,99,99,G-tube removal **-**-**,,.,,.,,.,,.,,.,0,,,,,,,,,,,,,,,,,,,,,2:No,,-2,-2,2:No,-2:Skipped,-2:Skipped,-2:Skipped,-2:Skipped,-2:Skipped,-2:Skipped,-2:Skipped,-2:Skipped,-2:Skipped,-2:Skipped,-2:Skipped,-2
142,3,381,0,,,,,,,,,,,,,,,,,0,.,,,,,,,,,,,,,-2,,,,,,,,,,,,,,,,,,,,,-2:Skipped,,-2,-2,2:No,-2:Skipped,-2:Skipped,-2:Skipped,-2:Skipped,-2:Skipped,-2:Skipped,-2:Skipped,-2:Skipped,-2:Skipped,-2:Skipped,-2:Skipped,-2
343,3,379,2,F1.01.01|F9,F1.01.01,332,-2,F9,332,vascular plug of decompressing vein,,,.,,,.,,,.,0,.,,,,,,,,,,,,,-2,,,,,,,,,,,,,,,,,,,,,-2:Skipped,,-2,-2,2:No,-2:Skipped,-2:Skipped,-2:Skipped,-2:Skipped,-2:Skipped,-2:Skipped,-2:Skipped,-2:Skipped,-2:Skipped,-2:Skipped,-2:Skipped,-2
540,3,1237,0,,,,,,,,,,,,,,,,,1,7,7,-2,,.,,.,,.,,.,,.,0,,,,,,,,,,,,,,,,,,,,,2:No,,-2,-2,2:No,-2:Skipped,-2:Skipped,-2:Skipped,-2:Skipped,-2:Skipped,-2:Skipped,-2:Skipped,-2:Skipped,-2:Skipped,-2:Skipped,-2:Skipped,-2
463,3,377,0,,,,,,,,,,,,,,,,,0,.,,,,,,,,,,,,,-2,,,,,,,,,,,,,,,,,,,,,-2:Skipped,,-2,-2,2:No,-2:Skipped,-2:Skipped,-2:Skipped,-2:Skipped,-2:Skipped,-2:Skipped,-2:Skipped,-2:Skipped,-2:Skipped,-2:Skipped,-2:Skipped,-2
17,3,370,0,,,,,,,,,,,,,,,,,0,.,,,,,,,,,,,,,-2,,,,,,,,,,,,,,,,,,,,,-2:Skipped,,-2,-2,2:No,-2:Skipped,-2:Skipped,-2:Skipped,-2:Skipped,-2:Skipped,-2:Skipped,-2:Skipped,-2:Skipped,-2:Skipped,-2:Skipped,-2:Skipped,-2
656,3,401,0,,,,,,,,,,,,,,,,,0,.,,,,,,,,,,,,,-2,,,,,,,,,,,,,,,,,,,,,-2:Skipped,,-2,-2,2:No,-2:Skipped,-2:Skipped,-2:Skipped,-2:Skipped,-2:Skipped,-2:Skipped,-2:Skipped,-2:Skipped,-2:Skipped,-2:Skipped,-2:Skipped,-2
526,3,397,0,,,,,,,,,,,,,,,,,0,.,,,,,,,,,,,,,-2,,,,,,,,,,,,,,,,,,,,,-2:Skipped,,-2,-2,2:No,-2:Skipped,-2:Skipped,-2:Skipped,-2:Skipped,-2:Skipped,-2:Skipped,-2:Skipped,-2:Skipped,-2:Skipped,-2:Skipped,-2:Skipped,-2
350,3,368,0,,,,,,,,,,,,,,,,,0,.,,,,,,,,,,,,,-2,,,,,,,,,,,,,,,,,,,,,-2:Skipped,,-2,-2,2:No,-2:Skipped,-2:Skipped,-2:Skipped,-2:Skipped,-2:Skipped,-2:Skipped,-2:Skipped,-2:Skipped,-2:Skipped,-2:Skipped,-2:Skipped,-2
308,3,381,0,,,,,,,,,,,,,,,,,0,.,,,,,,,,,,,,,-2,,,,,,,,,,,,,,,,,,,,,-2:Skipped,,-2,-2,2:No,-2:Skipped,-2:Skipped,-2:Skipped,-2:Skipped,-2:Skipped,-2:Skipped,-2:Skipped,-2:Skipped,-2:Skipped,-2:Skipped,-2:Skipped,-2
152,3,435,0,,,,,,,,,,,,,,,,,0,.,,,,,,,,,,,,,-2,,,,,,,,,,,,,,,,,,,,,-2:Skipped,,-2,-2,2:No,-2:Skipped,-2:Skipped,-2:Skipped,-2:Skipped,-2:Skipped,-2:Skipped,-2:Skipped,-2:Skipped,-2:Skipped,-2:Skipped,-2:Skipped,-2
112,3,366,0,,,,,,,,,,,,,,,,,0,.,,,,,,,,,,,,,-2,,,,,,,,,,,,,,,,,,,,,-2:Skipped,,-2,-2,2:No,-2:Skipped,-2:Skipped,-2:Skipped,-2:Skipped,-2:Skipped,-2:Skipped,-2:Skipped,-2:Skipped,-2:Skipped,-2:Skipped,-2:Skipped,-2
616,3,1322,0,,,,,,,,,,,,,,,,,0,.,,,,,,,,,,,,,-2,,,,,,,,,,,,,,,,,,,,,-2:Skipped,,-2,-2,2:No,-2:Skipped,-2:Skipped,-2:Skipped,-2:Skipped,-2:Skipped,-2:Skipped,-2:Skipped,-2:Skipped,-2:Skipped,-2:Skipped,-2:Skipped,-2
323,3,353,0,,,,,,,,,,,,,,,,,0,.,,,,,,,,,,,,,-2,,,,,,,,,,,,,,,,,,,,,-2:Skipped,,-2,-2,2:No,-2:Skipped,-2:Skipped,-2:Skipped,-2:Skipped,-2:Skipped,-2:Skipped,-2:Skipped,-2:Skipped,-2:Skipped,-2:Skipped,-2:Skipped,-2
367,3,1271,0,,,,,,,,,,,,,,,,,0,.,,,,,,,,,,,,,-2,,,,,,,,,,,,,,,,,,,,,-2:Skipped,,-2,-2,2:No,-2:Skipped,-2:Skipped,-2:Skipped,-2:Skipped,-2:Skipped,-2:Skipped,-2:Skipped,-2:Skipped,-2:Skipped,-2:Skipped,-2:Skipped,-2
258,3,380,0,,,,,,,,,,,,,,,,,0,.,,,,,,,,,,,,,-2,,,,,,,,,,,,,,,,,,,,,-2:Skipped,,-2,-2,2:No,-2:Skipped,-2:Skipped,-2:Skipped,-2:Skipped,-2:Skipped,-2:Skipped,-2:Skipped,-2:Skipped,-2:Skipped,-2:Skipped,-2:Skipped,-2
638,3,412,0,,,,,,,,,,,,,,,,,0,.,,,,,,,,,,,,,-2,,,,,,,,,,,,,,,,,,,,,-2:Skipped,,-2,-2,2:No,-2:Skipped,-2:Skipped,-2:Skipped,-2:Skipped,-2:Skipped,-2:Skipped,-2:Skipped,-2:Skipped,-2:Skipped,-2:Skipped,-2:Skipped,-2