blind_id,VISIT,r106_age,geval_age,HT_GEVAL,GEVAL_haz_who,WT_GEVAL,GEVAL_waz_who,HC_GEVAL,GEVAL_hcaz_who,NORM_GEVAL,KARYOYN,KARYOTYP,KARYO_S,SYNDROM,SYNDCODE,SYNDRM_S,ABNORM,abnorcod,ABNORCOD_0,ABNORM_S_0,ABNORCOD_1,ABNORM_S_1,ABNORCOD_2,ABNORM_S_2,ABNORCOD_3,ABNORM_S_3,ABNORCOD_4,ABNORM_S_4,ABNORCOD_5,ABNORM_S_5,ABNORCOD_6,ABNORM_S_6,ABNORCOD_7,ABNORM_S_7,ABNORCOD_8,ABNORM_S_8,syndrom_ever,abnorm_ever
184,1:visit 1(Norwood),187,32,52.5,-1.18,4.35,-0.24,38.0,0.58,1:Yes,-2:Skipped,-2,-2,-2,-2,-2,-2,,,,,,,,,,,,,,,,,,,,2,2
184,4:visit 4 (14 months),478,425,79.0,0.42,11.20,0.96,47.0,0.33,1:Yes,1:Yes,-2,-2,2,-2,-2,2,,,,,,,,,,,,,,,,,,,,2,2
481,1:visit 1(Norwood),101,14,51.5,-0.35,2.80,-1.91,36.0,0.2,1:Yes,-2:Skipped,-2,-2,-2,-2,-2,-2,,,,,,,,,,,,,,,,,,,,2,2
508,1:visit 1(Norwood),92,21,52.7,-0.28,3.78,-0.43,36.5,0.06,1:Yes,-2:Skipped,-2,-2,-2,-2,-2,-2,,,,,,,,,,,,,,,,,,,,2,2
508,4:visit 4 (14 months),507,420,78.8,0.41,12.03,1.65,49.6,2.37,1:Yes,-2:Skipped,-2,-2,-2,-2,-2,-2,,,,,,,,,,,,,,,,,,,,2,2
189,1:visit 1(Norwood),185,,-9.0,,-9.00,,-9.0,,-9,2:No,2:46xx,-2,-9,-9,-2,-9,,,-2,.,.,.,.,.,.,.,.,.,.,.,.,.,.,.,.,-9,-9
398,1:visit 1(Norwood),45,18,52.0,-0.42,3.90,0.03,36.5,0.29,1:Yes,-2:Skipped,-2,-2,-2,-2,-2,-2,,,,,,,,,,,,,,,,,,,,2,2
39,2:visit 2 (stage II),1294,,-9.0,,-9.00,,-9.0,,-9,2:No,1:46xy,-2,2,-2,-2,-9,,,-2,.,.,.,.,.,.,.,.,.,.,.,.,.,.,.,.,2,2
778,1:visit 1(Norwood),1117,,-9.0,,-9.00,,-9.0,,-9,2:No,1:46xy,-2,-9,-9,-2,-9,,,-2,.,.,.,.,.,.,.,.,.,.,.,.,.,.,.,.,-9,-9
772,1:visit 1(Norwood),67,44,51.8,-2.31,3.59,-2.43,36.5,-1.39,1:Yes,1:Yes,-2,-2,2,-2,-2,2,,,,,,,,,,,,,,,,,,,,2,2
772,4:visit 4 (14 months),437,429,76.0,-0.85,10.17,0.06,47.5,0.69,1:Yes,1:Yes,-2,-2,2,-2,-2,2,,,,,,,,,,,,,,,,,,,,2,2
700,4:visit 4 (14 months),848,,-9.0,,-9.00,,-9.0,,-9,2:No,1:46xy,-2,-9,-9,-2,-9,,,-2,.,.,.,.,.,.,.,.,.,.,.,.,.,.,.,.,-9,-9
223,1:visit 1(Norwood),602,,-9.0,,-9.00,,-9.0,,-9,2:No,1:46xy,-2,-9,-9,-2,-9,,,-2,.,.,.,.,.,.,.,.,.,.,.,.,.,.,.,.,-9,-9
375,1:visit 1(Norwood),15,15,49.5,-1.06,2.70,-1.89,33.0,-1.94,1:Yes,-2:Skipped,-2,-2,-2,-2,-2,-2,,,,,,,,,,,,,,,,,,,,2,2
375,4:visit 4 (14 months),454,454,75.0,-0.87,8.10,-1.39,44.8,-0.6,1:Yes,2:No,-9,-2,2,-2,-2,2,,,,,,,,,,,,,,,,,,,,2,2
292,1:visit 1(Norwood),21,21,53.5,0.13,3.60,-0.78,36.0,-0.37,1:Yes,-2:Skipped,-2,-2,-2,-2,-2,-2,,,,,,,,,,,,,,,,,,,,2,2
292,4:visit 4 (14 months),427,427,73.7,-1.75,8.09,-2.01,48.5,1.47,1:Yes,-2:Skipped,-2,-2,-2,-2,-2,-2,,,,,,,,,,,,,,,,,,,,2,2
818,1:visit 1(Norwood),19,11,45.0,-3.08,2.67,-1.68,33.0,-1.59,1:Yes,-2:Skipped,-2,-2,-2,-2,-2,-2,,,,,,,,,,,,,,,,,,,,2,2
818,4:visit 4 (14 months),438,438,69.7,-2.62,7.90,-1.5,44.5,-0.74,2:No,1:Yes,-2,-2,2,-2,-2,2,,,,,,,,,,,,,,,,,,,,2,2
759,1:visit 1(Norwood),77,73,53.0,-3.27,3.60,-3.8,36.0,-3.13,1:Yes,-2:Skipped,-2,-2,-2,-2,-2,-2,,,,,,,,,,,,,,,,,,,,2,2
78,1:visit 1(Norwood),33,30,47.0,-3.87,3.11,-2.49,33.0,-3.57,1:Yes,-2:Skipped,-2,-2,-2,-2,-2,-2,,,,,,,,,,,,,,,,,,,,2,2
78,4:visit 4 (14 months),401,401,72.5,-1.88,7.83,-2.13,45.5,-0.68,1:Yes,2:No,-9,-2,2,-2,-2,2,,,,,,,,,,,,,,,,,,,,2,2
246,1:visit 1(Norwood),26,26,52.5,-0.26,3.36,-1.21,32.0,-3.57,1:Yes,-2:Skipped,-2,-2,-2,-2,-2,-2,,,,,,,,,,,,,,,,,,,,2,2
83,1:visit 1(Norwood),19,19,51.0,-0.56,3.32,-0.79,35.5,-0.08,1:Yes,-2:Skipped,-2,-2,-2,-2,-2,-2,,,,,,,,,,,,,,,,,,,,2,2
83,4:visit 4 (14 months),436,436,69.5,-2.67,10.71,1,47.6,1.54,1:Yes,2:No,-9,-2,2,-2,-2,2,,,,,,,,,,,,,,,,,,,,2,2
282,1:visit 1(Norwood),37,37,54.5,-0.49,3.01,-3.2,35.0,-2.29,1:Yes,-2:Skipped,-2,-2,-2,-2,-2,-2,,,,,,,,,,,,,,,,,,,,1,2
282,4:visit 4 (14 months),401,401,73.0,-1.68,8.80,-1.08,46.0,-0.29,1:Yes,1:Yes,-2,-2,1,2,-2,2,,,,,,,,,,,,,,,,,,,,1,2
702,1:visit 1(Norwood),31,31,53.5,-0.07,2.78,-2.85,34.0,-2.15,1:Yes,-2:Skipped,-2,-2,-2,-2,-2,-2,,,,,,,,,,,,,,,,,,,,2,1
702,4:visit 4 (14 months),438,438,74.2,-0.96,8.40,-0.98,47.3,1.31,2:No,2:No,-9,-2,2,-2,-2,1,L0005 L9999 L9999,L0005,-2,L9999,DEVELOPMENTAL DELAY,L9999,GROWTH DELAY,.,.,.,.,.,.,.,.,.,.,.,.,2,1
54,1:visit 1(Norwood),18,18,48.3,-2.35,3.06,-1.65,32.0,-3.56,1:Yes,-2:Skipped,-2,-2,-2,-2,-2,-2,,,,,,,,,,,,,,,,,,,,2,1
54,4:visit 4 (14 months),432,432,78.2,-0.01,9.91,-0.2,47.0,0.29,2:No,1:Yes,-2,-2,2,-2,-2,1,L0199 L0099 L0199,L0199,PECTUS EXCAVATUM,L0099,"HIGHLY ARCHED, NARROW PALATE",L0199,BILATERAL 5TH FINGER CLINODACTYLY (MILD).,.,.,.,.,.,.,.,.,.,.,.,.,2,1
416,1:visit 1(Norwood),27,27,50.0,-2.12,2.80,-2.97,32.8,-3.54,1:Yes,-2:Skipped,-2,-2,-2,-2,-2,-2,,,,,,,,,,,,,,,,,,,,2,2
416,4:visit 4 (14 months),429,421,71.5,-2.56,6.91,-3.36,44.5,-1.57,1:Yes,2:No,-9,-2,2,-2,-2,2,,,,,,,,,,,,,,,,,,,,2,2
81,1:visit 1(Norwood),16,16,49.5,-1.13,3.30,-0.61,35.0,-0.28,2:No,1:Yes,-2,-2,2,-2,-2,1,L0099 L0099 L0199,L0099,LOW POSTERIOR HAIRLINE,L0099,REDUNDANT SKIN POSTERIOR NECK,L0199,SACRAL HAIR TUFT,.,.,.,.,.,.,.,.,.,.,.,.,2,1
92,1:visit 1(Norwood),26,26,49.0,-2.57,2.94,-2.57,35.5,-1.16,1:Yes,-2:Skipped,-2,-2,-2,-2,-2,-2,,,,,,,,,,,,,,,,,,,,2,2
92,4:visit 4 (14 months),400,400,70.5,-2.69,7.09,-3.02,44.9,-1.13,1:Yes,2:No,-9,-2,2,-2,-2,2,,,,,,,,,,,,,,,,,,,,2,2
792,1:visit 1(Norwood),19,19,50.8,-0.66,2.98,-1.53,33.0,-2.25,1:Yes,-2:Skipped,-2,-2,-2,-2,-2,-2,,,,,,,,,,,,,,,,,,,,2,2
792,4:visit 4 (14 months),447,447,78.0,0.32,9.47,-0.05,45.3,-0.2,1:Yes,1:Yes,-2,-2,2,-2,-2,2,,,,,,,,,,,,,,,,,,,,2,2
167,1:visit 1(Norwood),18,17,48.3,-1.83,3.62,-0.05,35.0,-0.36,2:No,1:Yes,-2,-2,1,12,-2,2,,,,,,,,,,,,,,,,,,,,1,2
87,1:visit 1(Norwood),41,41,50.5,-2.19,3.30,-2.28,34.5,-2.24,1:Yes,-2:Skipped,-2,-2,-2,-2,-2,-2,,,,,,,,,,,,,,,,,,,,2,2
87,4:visit 4 (14 months),423,423,72.5,-1.39,8.23,-1.06,44.5,-0.65,1:Yes,1:Yes,-2,-2,2,-2,-2,2,,,,,,,,,,,,,,,,,,,,2,2
624,1:visit 1(Norwood),13,13,53.5,0.79,3.30,-0.74,35.5,-0.14,1:Yes,-2:Skipped,-2,-2,-2,-2,-2,-2,,,,,,,,,,,,,,,,,,,,2,2
624,4:visit 4 (14 months),406,406,76.2,-0.44,11.34,1.2,48.5,1.61,1:Yes,-2:Skipped,-2,-2,-2,-2,-2,-2,,,,,,,,,,,,,,,,,,,,2,2
113,1:visit 1(Norwood),19,19,48.3,-2.42,3.28,-1.26,32.0,-3.64,1:Yes,-2:Skipped,-2,-2,-2,-2,-2,-2,,,,,,,,,,,,,,,,,,,,2,2
113,4:visit 4 (14 months),390,390,74.5,-0.9,8.64,-1.17,45.6,-0.53,1:Yes,1:Yes,-2,-2,2,-2,-2,2,,,,,,,,,,,,,,,,,,,,2,2
619,1:visit 1(Norwood),25,24,49.5,-2.17,3.01,-2.25,34.5,-1.88,1:Yes,-2:Skipped,-2,-2,-2,-2,-2,-2,,,,,,,,,,,,,,,,,,,,2,2
619,4:visit 4 (14 months),396,396,71.6,-2.18,8.38,-1.49,45.6,-0.57,1:Yes,-2:Skipped,-2,-2,-2,-2,-2,-2,,,,,,,,,,,,,,,,,,,,2,2
524,1:visit 1(Norwood),21,21,49.5,-1.95,2.70,-2.73,33.5,-2.51,1:Yes,2:No,-9,-2,2,-2,-2,2,,,,,,,,,,,,,,,,,,,,2,2
598,1:visit 1(Norwood),18,18,50.0,-1.46,3.08,-1.61,34.0,-1.85,1:Yes,2:No,-9,-2,2,-2,-2,2,,,,,,,,,,,,,,,,,,,,2,2
598,4:visit 4 (14 months),431,431,78.0,-0.08,10.50,0.33,46.0,-0.47,1:Yes,2:No,-9,-2,2,-2,-2,2,,,,,,,,,,,,,,,,,,,,2,2
344,1:visit 1(Norwood),14,14,49.0,-1.23,3.60,0.13,34.5,-0.55,1:Yes,1:Yes,-2,-2,2,-2,-2,1,L0099,L0099,TALL SLOPING FOREHEAD,.,.,.,.,.,.,.,.,.,.,.,.,.,.,.,.,2,1
344,4:visit 4 (14 months),401,401,73.5,-0.71,9.03,-0.15,47.0,1.31,1:Yes,1:Yes,-2,-2,2,-2,-2,2,,,,,,,,,,,,,,,,,,,,2,1
589,1:visit 1(Norwood),73062,14,50.8,-0.72,2.97,-1.53,34.1,-1.42,1:Yes,1:Yes,-2,-2,2,-2,-2,2,,,,,,,,,,,,,,,,,,,,2,2
589,4:visit 4 (14 months),459,459,74.0,-2.05,9.70,-0.56,51.0,3.2,1:Yes,-2:Skipped,-2,-2,-2,-2,-2,-2,,,,,,,,,,,,,,,,,,,,2,2
801,1:visit 1(Norwood),18,18,51.0,-0.94,3.75,-0.25,37.0,0.72,1:Yes,2:No,-9,-2,2,-2,-2,2,,,,,,,,,,,,,,,,,,,,2,2
801,4:visit 4 (14 months),414,414,78.0,0.18,8.57,-1.4,48.2,1.32,1:Yes,-2:Skipped,-2,-2,-2,-2,-2,-2,,,,,,,,,,,,,,,,,,,,2,2
206,1:visit 1(Norwood),14,14,47.7,-2.34,2.75,-2.03,35.1,-0.57,1:Yes,1:Yes,-2,-2,2,-2,-2,2,,,,,,,,,,,,,,,,,,,,2,2
206,4:visit 4 (14 months),432,432,73.6,-1.86,9.30,-0.78,47.9,0.98,1:Yes,-2:Skipped,-2,-2,-2,-2,-2,-2,,,,,,,,,,,,,,,,,,,,2,2
286,1:visit 1(Norwood),29,29,46.3,-4.17,2.05,-4.79,31.0,-5.22,2:No,2:No,-9,-2,2,-2,-2,1,L0099,L0099,MICROGNATHIA,.,.,.,.,.,.,.,.,.,.,.,.,.,.,.,.,2,1
286,4:visit 4 (14 months),435,435,72.5,-2.34,8.29,-1.84,44.9,-1.34,1:Yes,-2:Skipped,-2,-2,-2,-2,-2,-2,,,,,,,,,,,,,,,,,,,,2,1
575,1:visit 1(Norwood),13,13,51.2,0.01,3.30,-0.4,34.2,-0.72,1:Yes,2:No,-9,-2,2,-2,-2,2,,,,,,,,,,,,,,,,,,,,2,2
5,1:visit 1(Norwood),16,16,51.0,-0.78,3.70,-0.18,36.2,0.2,1:Yes,-2:Skipped,-2,-2,-2,-2,-2,-2,,,,,,,,,,,,,,,,,,,,2,2
5,4:visit 4 (14 months),454,443,76.6,-0.81,10.89,0.59,47.7,0.77,1:Yes,-2:Skipped,-2,-2,-2,-2,-2,-2,,,,,,,,,,,,,,,,,,,,2,2
55,1:visit 1(Norwood),107,56,45.0,-6.42,3.03,-4.17,37.0,-1.55,2:No,1:Yes,-2,-2,1,99,CONGENITAL CENTRONUCLEAR MYOPATHY,2,,,,,,,,,,,,,,,,,,,,1,2
366,4:visit 4 (14 months),447,447,76.3,-0.3,9.74,0.18,47.0,1.04,1:Yes,-2:Skipped,-2,-2,-2,-2,-2,-2,,,,,,,,,,,,,,,,,,,,2,2
879,1:visit 1(Norwood),27,27,50.2,-2.02,2.90,-2.74,32.0,-4.23,1:Yes,2:No,-9,-2,2,-2,-2,1,L0099,L0099,BLUE SCLERA,.,.,.,.,.,.,.,.,.,.,.,.,.,.,.,.,2,1
879,4:visit 4 (14 months),424,424,72.0,-2.4,9.06,-0.96,43.2,-2.59,1:Yes,2:No,-9,-2,2,-2,-2,2,,,,,,,,,,,,,,,,,,,,2,1
70,1:visit 1(Norwood),12,11,51.5,0.35,3.15,-0.58,34.0,-0.73,1:Yes,2:No,-9,-2,2,-2,-2,1,L0099 L0099,L0099,MICROGNATHIA,L0099,TENTED UPPER LIP,.,.,.,.,.,.,.,.,.,.,.,.,.,.,2,1
488,1:visit 1(Norwood),19,18,47.5,-2.76,2.50,-2.98,34.5,-1.42,1:Yes,2:No,-9,-2,2,-2,-2,2,,,,,,,,,,,,,,,,,,,,2,2
488,4:visit 4 (14 months),437,437,76.0,-0.97,8.45,-1.68,47.9,0.95,1:Yes,2:No,-9,-2,2,-2,-2,2,,,,,,,,,,,,,,,,,,,,2,2
628,1:visit 1(Norwood),15,15,47.5,-2.11,3.16,-0.84,34.3,-0.81,1:Yes,2:No,-9,-2,2,-2,-2,2,,,,,,,,,,,,,,,,,,,,2,2
628,4:visit 4 (14 months),449,447,72.3,-1.77,8.63,-0.81,47.7,1.55,1:Yes,2:No,-9,-2,2,-2,-2,2,,,,,,,,,,,,,,,,,,,,2,2
56,1:visit 1(Norwood),46,20,52.0,-0.1,3.37,-0.76,33.5,-1.89,1:Yes,2:No,2:46xx,-2,2,-2,-2,2,,,,,,,,,,,,,,,,,,,,2,2
56,4:visit 4 (14 months),398,398,67.0,-3.14,5.77,-3.85,43.2,-1.46,1:Yes,1:Yes,-2,-2,2,-2,-2,2,,,,,,,,,,,,,,,,,,,,2,2
365,1:visit 1(Norwood),19,19,50.0,-1.54,3.23,-1.37,35.0,-1.07,1:Yes,-9,-9,-2,2,-2,-2,2,,,,,,,,,,,,,,,,,,,,2,1
365,4:visit 4 (14 months),434,434,80.7,0.96,12.00,1.54,48.9,1.74,1:Yes,2:No,-9,-2,2,-2,-2,1,L9999,L9999,EPISPADIUS,.,.,.,.,.,.,.,.,.,.,.,.,.,.,.,.,2,1
141,1:visit 1(Norwood),39,22,47.3,-3.16,2.69,-2.84,32.2,-3.7,1:Yes,-2:Skipped,-2,-2,-2,-2,-2,-2,,,,,,,,,,,,,,,,,,,,2,2
141,4:visit 4 (14 months),415,415,68.5,-3.71,8.15,-1.86,45.8,-0.53,1:Yes,1:Yes,-2,-2,2,-2,-2,2,,,,,,,,,,,,,,,,,,,,2,2
707,1:visit 1(Norwood),24,24,52.7,-0.51,3.78,-0.67,37.0,0.26,1:Yes,-2:Skipped,-2,-2,-2,-2,-2,-2,,,,,,,,,,,,,,,,,,,,2,2
707,4:visit 4 (14 months),402,402,75.0,-0.87,10.30,0.35,47.2,0.63,1:Yes,1:Yes,-2,-2,2,-2,-2,2,,,,,,,,,,,,,,,,,,,,2,2
646,4:visit 4 (14 months),401,401,73.0,-0.9,8.50,-0.65,43.0,-1.62,1:Yes,-2:Skipped,-2,-2,-2,-2,-2,-2,,,,,,,,,,,,,,,,,,,,2,2
4,1:visit 1(Norwood),29,29,50.0,-1.74,3.25,-1.65,34.5,-1.6,1:Yes,-2:Skipped,-2,-2,-2,-2,-2,-2,,,,,,,,,,,,,,,,,,,,2,2
4,4:visit 4 (14 months),415,415,72.5,-1.29,11.25,1.52,47.4,1.52,1:Yes,-2:Skipped,-2,-2,-2,-2,-2,-2,,,,,,,,,,,,,,,,,,,,2,2
777,1:visit 1(Norwood),16,16,51.5,-0.08,3.18,-0.87,33.0,-2.02,1:Yes,-2:Skipped,-2,-2,-2,-2,-2,-2,,,,,,,,,,,,,,,,,,,,2,2
623,1:visit 1(Norwood),19,19,48.6,-2.26,3.39,-1.04,35.5,-0.64,1:Yes,-2:Skipped,-2,-2,-2,-2,-2,-2,,,,,,,,,,,,,,,,,,,,2,2
623,4:visit 4 (14 months),471,471,72.0,-2.98,7.90,-2.49,45.8,-0.84,1:Yes,-2:Skipped,-2,-2,-2,-2,-2,-2,,,,,,,,,,,,,,,,,,,,2,2
878,1:visit 1(Norwood),16,16,51.0,-0.78,3.20,-1.19,35.5,-0.4,1:Yes,-2:Skipped,-2,-2,-2,-2,-2,-2,,,,,,,,,,,,,,,,,,,,2,2
318,1:visit 1(Norwood),18,18,50.4,-0.8,3.17,-1.04,33.6,-1.65,1:Yes,-2:Skipped,-2,-2,-2,-2,-2,-2,,,,,,,,,,,,,,,,,,,,2,2
318,4:visit 4 (14 months),414,414,72.5,-1.27,7.76,-1.5,45.0,-0.24,1:Yes,-2:Skipped,-2,-2,-2,-2,-2,-2,,,,,,,,,,,,,,,,,,,,2,2
62,1:visit 1(Norwood),44,43,48.3,-4.03,3.04,-3.5,35.0,-2.62,2:No,2:No,-9,-2,1,1,-2,2,,,,,,,,,,,,,,,,,,,,1,2
62,4:visit 4 (14 months),414,406,78.0,0.3,10.10,0.14,45.5,-0.71,1:Yes,-2:Skipped,-2,-2,-2,-2,-2,-2,,,,,,,,,,,,,,,,,,,,1,2
2,1:visit 1(Norwood),16,16,44.5,-4.18,2.41,-3.04,31.6,-3.74,1:Yes,2:No,-9,-2,2,-2,-2,1,L0005,L0005,-2,.,.,.,.,.,.,.,.,.,.,.,.,.,.,.,.,2,1
2,4:visit 4 (14 months),433,433,67.5,-4.33,7.50,-2.72,44.6,-1.56,1:Yes,-2:Skipped,-2,-2,-2,-2,-2,-2,,,,,,,,,,,,,,,,,,,,2,1
409,1:visit 1(Norwood),23,23,42.0,-5.5,2.70,-2.48,33.0,-2.52,1:Yes,1:Yes,-2,-2,2,-2,-2,2,,,,,,,,,,,,,,,,,,,,2,1
409,4:visit 4 (14 months),404,404,69.5,-2.27,9.40,0.15,45.5,0.19,2:No,1:Yes,-2,-2,2,-2,-2,1,L0099 L0099,L0099,SMALL LOW SET EARS,L0099,LOW POSTERIOR HAIRLINE,.,.,.,.,.,.,.,.,.,.,.,.,.,.,2,1
625,1:visit 1(Norwood),29,26,48.0,-3.08,3.10,-2.21,38.0,0.98,-9,2:No,-9,-2,-9,-9,-2,-9,,,-2,.,.,.,.,.,.,.,.,.,.,.,.,.,.,.,.,-9,-9
401,1:visit 1(Norwood),325,7,50.0,-0.09,3.26,-0.1,35.5,0.89,2:No,2:No,2:46xx,-2,2,-2,-2,1,L0005 L0099 L9999,L0005,-2,L0099,short neck,L9999,wide spaced nipples,.,.,.,.,.,.,.,.,.,.,.,.,2,1
634,1:visit 1(Norwood),20,20,46.0,-3.69,2.40,-3.37,31.0,-4.58,2:No,1:Yes,-2,-2,2,-2,-2,1,L0099,L0099,"lowset, posteriorly rotated ears",.,.,.,.,.,.,.,.,.,.,.,.,.,.,.,.,2,1
634,4:visit 4 (14 months),542,542,74.9,-2.66,8.82,-1.89,46.0,-1.01,2:No,1:Yes,-2,-2,2,-2,-2,1,L9999,L9999,proportionately small,.,.,.,.,.,.,.,.,.,.,.,.,.,.,.,.,2,1
154,1:visit 1(Norwood),15,15,49.0,-1.75,3.43,-0.63,35.0,-0.74,2:No,1:Yes,-2,-2,2,-2,-2,1,L0103,L0103,-2,.,.,.,.,.,.,.,.,.,.,.,.,.,.,.,.,2,1
377,1:visit 1(Norwood),8,8,48.0,-1.64,2.55,-2.07,33.0,-1.77,2:No,1:Yes,-2,-2,2,-2,-2,1,L0005 L0103,L0005,-2,L0103,-2,.,.,.,.,.,.,.,.,.,.,.,.,.,.,2,1
560,1:visit 1(Norwood),36,3,51.0,0.81,3.77,1.13,37.0,2.48,1:Yes,-2:Skipped,-2,-2,-2,-2,-2,-2,,,,,,,,,,,,,,,,,,,,2,1
560,4:visit 4 (14 months),478,478,74.0,-1.53,9.10,-0.56,48.0,1.6,2:No,1:Yes,-2,-2,2,-2,-2,1,L0005,L0005,-2,.,.,.,.,.,.,.,.,.,.,.,.,.,.,.,.,2,1
541,1:visit 1(Norwood),36,36,48.5,-3.5,3.40,-2.3,32.0,-4.79,2:No,1:Yes,-2,-2,2,-2,-2,1,L0199,L0199,unilateral simean crease,.,.,.,.,.,.,.,.,.,.,.,.,.,.,.,.,2,1
541,4:visit 4 (14 months),402,402,77.0,-0.05,9.54,-0.35,44.0,-1.84,2:No,1:Yes,-2,-2,2,-2,-2,1,L0203,L0203,-2,.,.,.,.,.,.,.,.,.,.,.,.,.,.,.,.,2,1
218,1:visit 1(Norwood),22,3,49.0,-0.65,2.88,-0.98,32.5,-1.72,2:No,1:Yes,-2,-2,2,-2,-2,1,L0203 L0005,L0203,-2,L0005,-2,.,.,.,.,.,.,.,.,.,.,.,.,.,.,2,1
836,1:visit 1(Norwood),19,5,48.0,-1.36,2.63,-1.68,31.5,-2.71,2:No,1:Yes,-2,-2,2,-2,-2,1,L0005,L0005,-2,.,.,.,.,.,.,.,.,.,.,.,.,.,.,.,.,2,1
836,4:visit 4 (14 months),462,462,77.0,-0.91,8.65,-1.62,45.0,-1.4,1:Yes,-2:Skipped,-2,-2,-2,-2,-2,-2,,,,,,,,,,,,,,,,,,,,2,1
148,1:visit 1(Norwood),22,2,56.0,3.13,4.04,1.38,33.5,-0.84,2:No,1:Yes,-2,-2,2,-2,-2,1,L0005,L0005,-2,.,.,.,.,.,.,.,.,.,.,.,.,.,.,.,.,2,1
675,1:visit 1(Norwood),29,9,48.0,-1.73,3.23,-0.59,36.0,0.61,1:Yes,-2:Skipped,-2,-2,-2,-2,-2,-2,,,,,,,,,,,,,,,,,,,,2,2
678,1:visit 1(Norwood),43,2,50.5,0.23,2.96,-0.76,31.5,-2.42,2:No,2:No,1:46xy,-2,2,-2,-2,1,L0099 L0099 L9999 L0499,L0099,low set ears,L0099,short neck,L9999,wide spaced nipples,L0499,mildly hypotonic,.,.,.,.,.,.,.,.,.,.,2,1
280,2:visit 2 (stage II),148,148,61.0,-2.18,6.60,-1.06,42.0,-0.34,2:No,1:Yes,-2,-2,2,-2,-2,1,L0099,L0099,brachycephalic,.,.,.,.,.,.,.,.,.,.,.,.,.,.,.,.,2,1
280,4:visit 4 (14 months),501,501,79.0,-0.64,10.20,-0.36,47.0,-0.07,1:Yes,-2:Skipped,-2,-2,-2,-2,-2,-2,,,,,,,,,,,,,,,,,,,,2,1
356,1:visit 1(Norwood),23,23,49.0,-1.87,2.79,-2.27,34.0,-1.66,1:Yes,-2:Skipped,-2,-2,-2,-2,-2,-2,,,,,,,,,,,,,,,,,,,,2,2
356,4:visit 4 (14 months),724,724,77.5,-2.71,11.11,-0.23,46.2,-0.68,1:Yes,-2:Skipped,-2,-2,-2,-2,-2,-2,,,,,,,,,,,,,,,,,,,,2,2
608,1:visit 1(Norwood),22,22,50.0,-1.76,3.08,-1.94,32.0,-3.87,1:Yes,-2:Skipped,-2,-2,-2,-2,-2,-2,,,,,,,,,,,,,,,,,,,,2,2
608,4:visit 4 (14 months),723,723,77.5,-3.31,11.11,-0.75,46.2,-1.48,1:Yes,-2:Skipped,-2,-2,-2,-2,-2,-2,,,,,,,,,,,,,,,,,,,,2,2
652,1:visit 1(Norwood),15,15,50.0,-1.23,4.21,0.82,37.0,0.97,1:Yes,-2:Skipped,-2,-2,-2,-2,-2,-2,,,,,,,,,,,,,,,,,,,,2,2
652,4:visit 4 (14 months),488,488,75.0,-2.02,8.05,-2.42,47.0,-0.01,1:Yes,-2:Skipped,-2,-2,-2,-2,-2,-2,,,,,,,,,,,,,,,,,,,,2,2
253,1:visit 1(Norwood),16,16,52.0,-0.26,3.37,-0.83,35.0,-0.83,1:Yes,-2:Skipped,-2,-2,-2,-2,-2,-2,,,,,,,,,,,,,,,,,,,,2,2
446,1:visit 1(Norwood),9,9,49.0,-0.79,2.75,-1.36,32.0,-2.28,1:Yes,-2:Skipped,-2,-2,-2,-2,-2,-2,,,,,,,,,,,,,,,,,,,,2,2
446,4:visit 4 (14 months),577,577,79.0,-0.89,10.50,0.06,44.0,-1.74,1:Yes,-2:Skipped,-2,-2,-2,-2,-2,-2,,,,,,,,,,,,,,,,,,,,2,2
125,1:visit 1(Norwood),30,11,52.0,0.61,3.21,-0.46,32.0,-2.46,2:No,2:No,2:46xx,-2,2,-2,-2,1,L0005,L0005,-2,.,.,.,.,.,.,.,.,.,.,.,.,.,.,.,.,2,1
125,4:visit 4 (14 months),508,508,80.0,0.24,12.03,1.51,46.0,0,2:No,1:Yes,-2,-2,2,-2,-2,1,L0005 L9999,L0005,-2,L9999,wide-spaced nipples,.,.,.,.,.,.,.,.,.,.,.,.,.,.,2,1
565,1:visit 1(Norwood),15,3,51.0,0.4,3.09,-0.52,33.0,-1.32,1:Yes,-2:Skipped,-2,-2,-2,-2,-2,-2,,,,,,,,,,,,,,,,,,,,2,2
661,1:visit 1(Norwood),9,2,48.0,-1.09,2.98,-0.72,34.0,-0.44,2:No,1:Yes,-2,-2,2,-2,-2,1,L0005,L0005,-2,.,.,.,.,.,.,.,.,.,.,.,.,.,.,.,.,1,1
661,4:visit 4 (14 months),437,437,75.0,-1.37,7.94,-2.24,46.0,-0.51,2:No,1:Yes,-2,-2,1,2,-2,1,L0005,L0005,-2,.,.,.,.,.,.,.,.,.,.,.,.,.,.,.,.,1,1
358,1:visit 1(Norwood),102,2,49.0,-0.17,2.48,-1.67,31.5,-2.09,1:Yes,-2:Skipped,-2,-2,-2,-2,-2,-2,,,,,,,,,,,,,,,,,,,,2,2
358,4:visit 4 (14 months),510,510,75.5,-1.37,10.00,0.03,45.0,-0.73,1:Yes,-2:Skipped,-2,-2,-2,-2,-2,-2,,,,,,,,,,,,,,,,,,,,2,2
849,4:visit 4 (14 months),514,545,82.0,-0.05,9.44,-1.3,45.5,-1.39,1:Yes,-2:Skipped,-2,-2,-2,-2,-2,-2,,,,,,,,,,,,,,,,,,,,2,2
275,1:visit 1(Norwood),10,10,47.0,-2.34,2.32,-2.81,31.0,-3.62,1:Yes,-2:Skipped,-2,-2,-2,-2,-2,-2,,,,,,,,,,,,,,,,,,,,2,2
275,4:visit 4 (14 months),409,409,73.0,-1.79,10.85,0.78,47.0,0.43,1:Yes,-2:Skipped,-2,-2,-2,-2,-2,-2,,,,,,,,,,,,,,,,,,,,2,2
476,1:visit 1(Norwood),9,2,50.0,-0.03,3.36,0.09,33.0,-1.24,2:No,2:No,1:46xy,-2,2,-2,-2,1,L0005 L9999,L0005,-2,L9999,penis fused to scrotum,.,.,.,.,.,.,.,.,.,.,.,.,.,.,1,1
476,4:visit 4 (14 months),399,399,64.0,-5.35,6.60,-3.6,43.0,-2.6,2:No,1:Yes,-2,-2,1,2,-2,1,L0499 L9999 L9999 L9999,L0499,Hirschsprung,L9999,hypospadias,L9999,hyperteloric,L9999,Thin nasal tip,.,.,.,.,.,.,.,.,.,.,1,1
91,1:visit 1(Norwood),14,14,50.0,-0.71,2.99,-1.14,34.0,-0.98,1:Yes,-2:Skipped,-2,-2,-2,-2,-2,-2,,,,,,,,,,,,,,,,,,,,2,2
91,4:visit 4 (14 months),504,504,79.0,-0.06,10.44,0.41,49.0,2.2,1:Yes,-2:Skipped,-2,-2,-2,-2,-2,-2,,,,,,,,,,,,,,,,,,,,2,2
843,1:visit 1(Norwood),15,8,48.0,-1.24,3.03,-0.66,32.5,-1.76,1:Yes,-2:Skipped,-2,-2,-2,-2,-2,-2,,,,,,,,,,,,,,,,,,,,2,2
843,4:visit 4 (14 months),446,446,75.0,-0.77,8.60,-0.84,44.5,-0.78,1:Yes,-2:Skipped,-2,-2,-2,-2,-2,-2,,,,,,,,,,,,,,,,,,,,2,2
610,2:visit 2 (stage II),120,120,62.0,-0.81,6.30,-0.86,39.0,-2.13,1:Yes,-2:Skipped,-2,-2,-2,-2,-2,-2,,,,,,,,,,,,,,,,,,,,2,2
610,4:visit 4 (14 months),455,455,85.0,2.35,10.57,0.24,46.0,-0.6,2:No,1:Yes,-2,-2,2,-2,-2,2,,,,,,,,,,,,,,,,,,,,2,2
276,1:visit 1(Norwood),14,3,47.5,-1.44,2.74,-1.3,34.0,-0.53,2:No,1:Yes,-2,-2,1,2,-2,1,L0005,L0005,-2,.,.,.,.,.,.,.,.,.,.,.,.,.,.,.,.,1,1
829,1:visit 1(Norwood),12,9,45.5,-2.65,2.56,-1.82,33.0,-1.42,1:Yes,-2:Skipped,-2,-2,-2,-2,-2,-2,,,,,,,,,,,,,,,,,,,,2,2
898,1:visit 1(Norwood),16,14,49.0,-1.66,3.12,-1.2,34.0,-1.5,1:Yes,-2:Skipped,-2,-2,-2,-2,-2,-2,,,,,,,,,,,,,,,,,,,,2,2
168,1:visit 1(Norwood),10,10,50.0,-0.77,3.82,0.5,33.0,-1.96,1:Yes,-2:Skipped,-2,-2,-2,-2,-2,-2,,,,,,,,,,,,,,,,,,,,2,2
61,1:visit 1(Norwood),17,17,43.0,-4.6,2.34,-2.96,30.0,-4.71,1:Yes,-2:Skipped,-2,-2,-2,-2,-2,-2,,,,,,,,,,,,,,,,,,,,2,2
708,1:visit 1(Norwood),13,13,50.5,-0.78,3.50,-0.33,35.0,-0.56,1:Yes,-2:Skipped,-2,-2,-2,-2,-2,-2,,,,,,,,,,,,,,,,,,,,2,2
216,1:visit 1(Norwood),16,16,51.0,-0.78,3.33,-0.91,34.5,-1.25,1:Yes,-2:Skipped,-2,-2,-2,-2,-2,-2,,,,,,,,,,,,,,,,,,,,2,2
216,4:visit 4 (14 months),438,438,75.0,-1.38,9.20,-0.91,46.0,-0.51,1:Yes,-2:Skipped,-2,-2,-2,-2,-2,-2,,,,,,,,,,,,,,,,,,,,2,2
122,1:visit 1(Norwood),17,17,46.0,-3.47,3.26,-1.14,33.5,-2.19,1:Yes,-2:Skipped,-2,-2,-2,-2,-2,-2,,,,,,,,,,,,,,,,,,,,2,2
514,4:visit 4 (14 months),421,421,79.0,0.48,9.25,-0.76,47.5,0.74,1:Yes,-2:Skipped,-2,-2,-2,-2,-2,-2,,,,,,,,,,,,,,,,,,,,2,2
314,1:visit 1(Norwood),9,9,52.0,0.37,2.95,-1.2,33.5,-1.45,1:Yes,-2:Skipped,-2,-2,-2,-2,-2,-2,,,,,,,,,,,,,,,,,,,,2,2
314,4:visit 4 (14 months),421,421,78.0,0.07,8.62,-1.39,47.0,0.36,1:Yes,-2:Skipped,-2,-2,-2,-2,-2,-2,,,,,,,,,,,,,,,,,,,,2,2
6,1:visit 1(Norwood),14,4,48.0,-1.27,3.03,-0.7,35.0,0.19,2:No,2:No,1:46xy,-2,2,-2,-2,1,L0199,L0199,Ear tag,.,.,.,.,.,.,.,.,.,.,.,.,.,.,.,.,2,1
6,4:visit 4 (14 months),428,405,76.0,-0.5,10.00,0.06,47.0,0.46,2:No,1:Yes,-2,-2,2,-2,-2,1,L0099 L0099,L0099,Left ear Tag,L0099,deep/broad philtrum,.,.,.,.,.,.,.,.,.,.,.,.,.,.,2,1
431,1:visit 1(Norwood),133,2,41.5,-4.52,2.04,-3.07,31.5,-2.42,2:No,2:No,1:46xy,-2,2,-2,-2,1,L0199 L0199 L0199 L0104,L0199,Nasal tags bilaterally,L0199,open metopic suture,L0199,frontal skull protruberance,L0104,-2,.,.,.,.,.,.,.,.,.,.,2,1
343,4:visit 4 (14 months),464,457,76.0,-0.54,9.18,-0.36,44.0,-1.2,1:Yes,2:No,2:46xx,-2,2,-2,-2,2,,,,,,,,,,,,,,,,,,,,2,2
540,1:visit 1(Norwood),38,1,49.0,-0.47,3.23,-0.24,36.0,1.21,2:No,2:No,1:46xy,-2,1,2,-2,2,,,,,,,,,,,,,,,,,,,,1,2
463,2:visit 2 (stage II),248,239,71.0,0.3,8.35,-0.23,45.5,0.85,1:Yes,-2:Skipped,-2,-2,-2,-2,-2,-2,,,,,,,,,,,,,,,,,,,,2,2
17,2:visit 2 (stage II),168,168,69.0,1.05,7.50,-0.27,43.0,0.04,1:Yes,-2:Skipped,-2,-2,-2,-2,-2,-2,,,,,,,,,,,,,,,,,,,,2,2
17,4:visit 4 (14 months),493,450,76.5,-0.94,10.68,0.37,46.0,-0.58,1:Yes,-2:Skipped,-2,-2,-2,-2,-2,-2,,,,,,,,,,,,,,,,,,,,2,2
656,2:visit 2 (stage II),135,133,61.5,-0.59,5.66,-1.24,39.3,-1.25,1:Yes,-2:Skipped,-2,-2,-2,-2,-2,-2,,,,,,,,,,,,,,,,,,,,2,2
656,4:visit 4 (14 months),440,432,78.0,0.53,9.39,-0.03,46.0,0.39,1:Yes,2:No,2:46xx,-2,2,-2,-2,2,,,,,,,,,,,,,,,,,,,,2,2
526,2:visit 2 (stage II),213,187,59.0,-4.11,4.78,-4.35,40.5,-2.38,2:No,2:No,-9,-2,2,-2,-2,1,L0099 L0099,L0099,Right small periauricular tag,L0099,epicanthal folds,.,.,.,.,.,.,.,.,.,.,.,.,.,.,2,1
526,4:visit 4 (14 months),416,410,65.0,-5.07,7.51,-2.57,47.5,0.81,2:No,2:No,-9,-2,2,-2,-2,1,L0099 L0099 L0199,L0099,epicanthal folds,L0099,prearicular tag,L0199,short stature,.,.,.,.,.,.,.,.,.,.,.,.,2,1
308,2:visit 2 (stage II),200,171,64.0,-0.47,6.33,-0.99,40.5,-1.09,2:No,2:No,2:46xx,-2,2,-2,-2,1,L0099,L0099,left ear pointed helix,.,.,.,.,.,.,.,.,.,.,.,.,.,.,.,.,2,1
308,4:visit 4 (14 months),414,404,71.0,-1.7,8.40,-0.77,44.5,-0.54,1:Yes,-2:Skipped,-2,-2,-2,-2,-2,-2,,,,,,,,,,,,,,,,,,,,2,1
112,2:visit 2 (stage II),224,136,60.0,-1.36,5.68,-1.27,37.5,-2.73,2:No,2:No,-9,-2,2,-2,-2,1,L9999,L9999,Labs requested for 22Q11 deletion but not obtained,.,.,.,.,.,.,.,.,.,.,.,.,.,.,.,.,2,1
112,4:visit 4 (14 months),421,407,70.0,-2.12,8.22,-0.97,44.0,-0.93,2:No,2:No,-9,-2,2,-2,-2,1,L0099 L0099,L0099,thick nose,L0099,thick ears,.,.,.,.,.,.,.,.,.,.,.,.,.,.,2,1
323,1:visit 1(Norwood),127,127,54.5,-3.63,4.12,-3.62,36.0,-3.71,1:Yes,-2:Skipped,-2,-2,-2,-2,-2,-2,,,,,,,,,,,,,,,,,,,,2,1
323,4:visit 4 (14 months),458,451,73.0,-1.57,9.71,0.13,45.0,-0.44,2:No,1:Yes,-2,-2,2,-2,-2,1,L0099 L0099 L0099,L0099,depressed nasal root,L0099,"broat, short forehead",L0099,bilateral preauricular pits,.,.,.,.,.,.,.,.,.,.,.,.,2,1
367,1:visit 1(Norwood),65,5,48.0,-1.36,2.64,-1.65,35.5,0.51,2:No,2:No,1:46xy,-2,1,2,-2,1,L0599 L0599 L0599 L0599,L0599,Absent Septum pellucidum,L0599,interior vermis and brainstem hypoplasia,L0599,hypoplastic frontal lobes,L0599,Ventriculomegaly,.,.,.,.,.,.,.,.,.,.,1,1
638,2:visit 2 (stage II),258,202,65.2,-1.56,6.40,-2.19,41.8,-1.58,1:Yes,-2:Skipped,-2,-2,-2,-2,-2,-2,,,,,,,,,,,,,,,,,,,,2,2
638,4:visit 4 (14 months),495,478,75.5,-1.7,8.87,-1.48,46.0,-0.72,1:Yes,-2:Skipped,-2,-2,-2,-2,-2,-2,,,,,,,,,,,,,,,,,,,,2,2
621,4:visit 4 (14 months),423,416,70.5,-2.05,8.47,-0.78,46.5,0.85,1:Yes,-2:Skipped,-2,-2,-2,-2,-2,-2,,,,,,,,,,,,,,,,,,,,2,2
433,2:visit 2 (stage II),209,5,46.0,-2.04,2.90,-0.78,33.0,-1.08,2:No,2:No,99:other,45X,1,12,-2,2,,,,,,,,,,,,,,,,,,,,1,2
298,2:visit 2 (stage II),142,137,62.0,-0.47,5.10,-2.17,39.0,-1.58,1:Yes,-2:Skipped,-2,-2,-2,-2,-2,-2,,,,,,,,,,,,,,,,,,,,2,2
298,4:visit 4 (14 months),430,397,73.0,-0.85,8.81,-0.33,44.0,-0.86,1:Yes,-2:Skipped,-2,-2,-2,-2,-2,-2,,,,,,,,,,,,,,,,,,,,2,2