blind_id,VISITINT,r206_age,BNUMCOMP,bcompcode,BCOMPCOD_0,BCOMP_S_0,bcomp_age_0,BCOMPCOD_1,BCOMP_S_1,bcomp_age_1,BCOMPCOD_2,BCOMP_S_2,bcomp_age_2,BCOMPCOD_3,BCOMP_S_3,bcomp_age_3,BCOMPCOD_4,BCOMP_S_4,bcomp_age_4,BCOMPCOD_5,BCOMP_S_5,bcomp_age_5,BCOMPCOD_6,BCOMP_S_6,bcomp_age_6,BCOMPCOD_7,BCOMP_S_7,bcomp_age_7
184,2,1177,0,,,,,,,,,,,,,,,,,,,,,,,,,
184,1,2038,0,,,,,,,,,,,,,,,,,,,,,,,,,
481,1,1455,0,,,,,,,,,,,,,,,,,,,,,,,,,
508,2,1084,0,M0031,M0031,-2,419,,.,,,.,,,.,,,.,,,.,,.,.,,.,.,
508,1,1554,4,"M0407,M0206,M0603,M0111",M0407,-2,28,M0206,-2,30,M0603,-2,84,M0111,-2,109,,.,,,.,,.,.,,.,.,
398,1,579,0,,,,,,,,,,,,,,,,,,,,,,,,,
39,1,455,0,,,,,,,,,,,,,,,,,,,,,,,,,
39,2,455,0,,,,,,,,,,,,,,,,,,,,,,,,,
74,1,177,1,M0199,M0199,Dry persistant cough,171,,.,,,.,,,.,,,.,,,.,,.,.,,.,.,
74,2,366,3,"M0199,M0499,M0414",M0199,COUGH,266,M0499,OTITIS MEDIA,301,M0414,-2,326,,.,,,.,,,.,,.,.,,.,.,
778,1,278,3,"M0305,M0305,M0599",M0305,-2,66,M0305,-2,33,M0599,Renal artery stneosis of R kidney,38,,.,,,.,,,.,,.,.,,.,.,
778,2,367,0,,,,,,,,,,,,,,,,,,,,,,,,,
772,1,129,1,M0111,M0111,-2,116,,.,,,.,,,.,,,.,,,.,,.,.,,.,.,
772,2,428,0,,,,,,,,,,,,,,,,,,,,,,,,,
700,1,182,1,M0414,M0414,-2,122,,.,,,.,,,.,,,.,,,.,,.,.,,.,.,
700,2,374,2,"M0407,M0099",M0407,-2,314,M0099,fluid overload,312,,.,,,.,,,.,,,.,,.,.,,.,.,
375,1,1631,1,M0310,M0310,-2,30,,.,,,.,,,.,,,.,,,.,,.,.,,.,.,
375,2,1631,4,"M0102,M0410,M0399,M0299",M0102,-2,153,M0410,-2,169,M0399,GE Reflux,169,M0299,Dystonia reaction to Reglan,179,,.,,,.,,.,.,,.,.,
292,1,1624,1,M0111,M0111,-2,178,,.,,,.,,,.,,,.,,,.,,.,.,,.,.,
292,2,1624,3,"M0399,M0411,M0411",M0399,Vomiting,293,M0411,-2,334,M0411,-2,356,,.,,,.,,,.,,.,.,,.,.,
818,2,1584,1,M0410,M0410,-2,261,,.,,,.,,,.,,,.,,,.,,.,.,,.,.,
818,1,1584,1,M0099,M0099,Aortic arch stenosis,86,,.,,,.,,,.,,,.,,,.,,.,.,,.,.,
759,1,1974,0,,,,,,,,,,,,,,,,,,,,,,,,,
78,1,1574,1,M0412,M0412,-2,175,,.,,,.,,,.,,,.,,,.,,.,.,,.,.,
78,2,1966,0,,,,,,,,,,,,,,,,,,,,,,,,,
246,1,1556,2,"M0407,M0099",M0407,-2,34,M0099,Ascending aortic obstruction,146,,.,,,.,,,.,,,.,,.,.,,.,.,
246,2,1947,0,,,,,,,,,,,,,,,,,,,,,,,,,
83,1,1933,0,,,,,,,,,,,,,,,,,,,,,,,,,
282,1,1905,0,,,,,,,,,,,,,,,,,,,,,,,,,
282,2,1514,1,M0032,M0032,-2,168,,.,,,.,,,.,,,.,,,.,,.,.,,.,.,
702,1,1472,1,M0412,M0412,-2,102,,.,,,.,,,.,,,.,,,.,,.,.,,.,.,
702,2,1472,6,"M0102,M0413,M0206,M0109,M0408,M0412",M0102,-2,169,M0413,-2,171,M0206,-2,181,M0109,-2,203,M0408,-2,214,M0412,-2,270,.,.,,.,.,
54,1,1821,0,,,,,,,,,,,,,,,,,,,,,,,,,
54,2,1430,2,"M0411,M0110",M0411,-2,301,M0110,-2,328,,.,,,.,,,.,,,.,,.,.,,.,.,
416,1,1790,0,,,,,,,,,,,,,,,,,,,,,,,,,
416,2,1399,1,M0106,M0106,-2,249,,.,,,.,,,.,,,.,,,.,,.,.,,.,.,
81,1,1779,0,,,,,,,,,,,,,,,,,,,,,,,,,
92,1,1398,1,M0599,M0599,Hematuria,112,,.,,,.,,,.,,,.,,,.,,.,.,,.,.,
92,2,396,0,,,,,,,,,,,,,,,,,,,,,,,,,
792,1,1775,0,,,,,,,,,,,,,,,,,,,,,,,,,
792,2,447,0,,,,,,,,,,,,,,,,,,,,,,,,,
167,1,1771,0,,,,,,,,,,,,,,,,,,,,,,,,,
87,1,1763,0,,,,,,,,,,,,,,,,,,,,,,,,,
87,2,436,0,,,,,,,,,,,,,,,,,,,,,,,,,
624,1,447,1,M0412,M0412,-2,77,,.,,,.,,,.,,,.,,,.,,.,.,,.,.,
624,2,392,0,,,,,,,,,,,,,,,,,,,,,,,,,
113,1,1335,1,M0111,M0111,-2,119,,.,,,.,,,.,,,.,,,.,,.,.,,.,.,
113,2,1726,0,,,,,,,,,,,,,,,,,,,,,,,,,
619,1,1248,2,"M0411,M0111",M0411,-2,37,M0111,-2,113,,.,,,.,,,.,,,.,,.,.,,.,.,
619,2,1248,1,M0106,M0106,-2,133,,.,,,.,,,.,,,.,,,.,,.,.,,.,.,
524,1,424,1,M0605,M0605,-2,37,,.,,,.,,,.,,,.,,,.,,.,.,,.,.,
598,1,1586,0,,,,,,,,,,,,,,,,,,,,,,,,,
598,2,1586,0,,,,,,,,,,,,,,,,,,,,,,,,,
344,1,1582,0,,,,,,,,,,,,,,,,,,,,,,,,,
344,2,379,1,M0102,M0102,-2,139,,.,,,.,,,.,,,.,,,.,,.,.,,.,.,
72,1,1559,0,,,,,,,,,,,,,,,,,,,,,,,,,
589,1,1551,0,,,,,,,,,,,,,,,,,,,,,,,,,
589,2,392,0,,,,,,,,,,,,,,,,,,,,,,,,,
801,1,1545,0,,,,,,,,,,,,,,,,,,,,,,,,,
801,2,1545,0,,,,,,,,,,,,,,,,,,,,,,,,,
206,1,1150,2,"M0111,M0412",M0111,-2,17,M0412,-2,130,,.,,,.,,,.,,,.,,.,.,,.,.,
206,2,422,3,"M0099,M0099,M0099",M0099,AORTIC ARCH NARROWING,252,M0099,NARROWING OF RSCA,252,M0099,AORTOPULMONARY COLLATERALS,252,,.,,,.,,,.,,.,.,,.,.,
286,1,1530,0,,,,,,,,,,,,,,,,,,,,,,,,,
286,2,439,0,,,,,,,,,,,,,,,,,,,,,,,,,
575,1,1514,0,,,,,,,,,,,,,,,,,,,,,,,,,
5,1,190,1,M0099,M0099,Coarctation of the aorta,57,,.,,,.,,,.,,,.,,,.,,.,.,,.,.,
5,2,1517,0,,,,,,,,,,,,,,,,,,,,,,,,,
771,1,1477,0,,,,,,,,,,,,,,,,,,,,,,,,,
771,2,1477,0,,,,,,,,,,,,,,,,,,,,,,,,,
366,1,1420,0,,,,,,,,,,,,,,,,,,,,,,,,,
366,2,1420,0,,,,,,,,,,,,,,,,,,,,,,,,,
879,1,916,0,,,,,,,,,,,,,,,,,,,,,,,,,
879,2,916,2,"M0399,M0310",M0399,GASTRIC PARESIS,254,M0310,-2,254,,.,,,.,,,.,,,.,,.,.,,.,.,
70,1,198,1,M0032,M0032,-2,42,,.,,,.,,,.,,,.,,,.,,.,.,,.,.,
488,1,873,0,,,,,,,,,,,,,,,,,,,,,,,,,
488,2,873,1,M9999,M9999,PHIMOSIS,333,,.,,,.,,,.,,,.,,,.,,.,.,,.,.,
628,1,858,0,,,,,,,,,,,,,,,,,,,,,,,,,
628,2,294,2,"M0699,M0099",M0699,POLYCYTHEMIA HCT =67,287,M0099,BALLOON DILATION OF ATRIAL SEPTUM,289,,.,,,.,,,.,,,.,,.,.,,.,.,
56,1,132,1,M0399,M0399,VOMITING AND DIARRHEA,39,,.,,,.,,,.,,,.,,,.,,.,.,,.,.,
56,2,836,0,,,,,,,,,,,,,,,,,,,,,,,,,
365,1,809,0,,,,,,,,,,,,,,,,,,,,,,,,,
365,2,373,0,,,,,,,,,,,,,,,,,,,,,,,,,
141,1,771,1,M0111,M0111,-2,109,,.,,,.,,,.,,,.,,,.,,.,.,,.,.,
141,2,771,4,"M0499,M0310,M9999,M0411",M0499,FEVER,143,M0310,-2,174,M9999,TRAUMA (FACIAL),255,M0411,-2,282,,.,,,.,,.,.,,.,.,
707,1,716,0,,,,,,,,,,,,,,,,,,,,,,,,,
707,2,368,0,,,,,,,,,,,,,,,,,,,,,,,,,
646,1,685,0,,,,,,,,,,,,,,,,,,,,,,,,,
646,2,401,1,M9999,M9999,STERNAL MASS REQUIRING SURGICAL REMOVAL INCLUDING,296,,.,,,.,,,.,,,.,,,.,,.,.,,.,.,
4,1,184,5,"M0003,M0003,M0032,M0299,M0207",M0003,-2,169,M0003,-2,154,M0032,-2,154,M0299,DYSTONIC REACTION TO REGLAN,165,M0207,-2,168,,.,,.,.,,.,.,
4,2,384,1,M0399,M0399,GERD REQUIRING SURGERY,209,,.,,,.,,,.,,,.,,,.,,.,.,,.,.,
777,1,155,2,"M0414,M0032",M0414,-2,98,M0032,-2,139,,.,,,.,,,.,,,.,,.,.,,.,.,
777,2,671,0,,,,,,,,,,,,,,,,,,,,,,,,,
623,1,669,0,,,,,,,,,,,,,,,,,,,,,,,,,
623,2,669,0,,,,,,,,,,,,,,,,,,,,,,,,,
878,1,656,0,,,,,,,,,,,,,,,,,,,,,,,,,
892,1,585,0,,,,,,,,,,,,,,,,,,,,,,,,,
318,1,567,0,,,,,,,,,,,,,,,,,,,,,,,,,
318,2,567,0,,,,,,,,,,,,,,,,,,,,,,,,,
62,1,411,0,,,,,,,,,,,,,,,,,,,,,,,,,
62,2,411,0,,,,,,,,,,,,,,,,,,,,,,,,,
732,1,87,5,"M0099,M0305,M0407,M0112,M0112",M0099,LOW CARDIAC OUTPUT - PULMONARY OVERCIRCULATION,42,M0305,-2,43,M0407,-2,43,M0112,-2,60,M0112,-2,68,,.,,.,.,,.,.,
732,2,518,1,M0299,M0299,IRRITABILITY (HOSPITALIZED),107,,.,,,.,,,.,,,.,,,.,,.,.,,.,.,
2,1,516,1,M0411,M0411,-2,132,,.,,,.,,,.,,,.,,,.,,.,.,,.,.,
2,2,516,0,,,,,,,,,,,,,,,,,,,,,,,,,
409,1,88,1,M0099,M0099,COARCTATION OF THE AORTA,58,,.,,,.,,,.,,,.,,,.,,.,.,,.,.,
409,2,512,1,M0399,M0399,FEEDING INTOLERANCE-HOSPITALIZED,263,,.,,,.,,,.,,,.,,,.,,.,.,,.,.,
634,1,1600,1,M0032,M0032,-2,76,,.,,,.,,,.,,,.,,,.,,.,.,,.,.,
634,2,1600,1,M0399,M0399,"Diarrhea, NOS",135,,.,,,.,,,.,,,.,,,.,,.,.,,.,.,
154,1,1568,1,M0111,M0111,-2,159,,.,,,.,,,.,,,.,,,.,,.,.,,.,.,
154,2,1958,0,,,,,,,,,,,,,,,,,,,,,,,,,
377,2,766,2,"M0036,M0036",M0036,-2,320,M0036,-2,259,,.,,,.,,,.,,,.,,.,.,,.,.,
377,1,765,8,"M0405,M0402,M0399,M0412,M0411,M0111",M0405,-2,56,M0402,-2,65,M0399,Reflux- fundoplication and placement of GT,146,M0412,-2,178,M0411,-2,214,M0111,-2,236,M0412,-2,56,M0399,GE Reflux,110
560,1,1515,1,M0099,M0099,LPA stenosis and venovenous collataral,99,,.,,,.,,,.,,,.,,,.,,.,.,,.,.,
560,2,1905,0,,,,,,,,,,,,,,,,,,,,,,,,,
541,2,1344,1,M0410,M0410,-2,186,,.,,,.,,,.,,,.,,,.,,.,.,,.,.,
541,1,1486,3,"M0111,M0499,M0407",M0111,-2,69,M0499,Rotavirus,97,M0407,-2,46,,.,,,.,,,.,,.,.,,.,.,
218,2,1862,0,,,,,,,,,,,,,,,,,,,,,,,,,
218,1,1472,2,"M0407,M0410",M0407,-2,35,M0410,-2,87,,.,,,.,,,.,,,.,,.,.,,.,.,
836,1,590,0,,,,,,,,,,,,,,,,,,,,,,,,,
836,2,1321,1,M0412,M0412,-2,240,,.,,,.,,,.,,,.,,,.,,.,.,,.,.,
148,1,1149,0,,,,,,,,,,,,,,,,,,,,,,,,,
148,2,1840,0,,,,,,,,,,,,,,,,,,,,,,,,,
675,1,589,3,"M0405,M0499,M0399",M0405,-2,35,M0499,Cellulitis,101,M0399,Vomiting,36,,.,,,.,,,.,,.,.,,.,.,
27,1,1352,1,M0399,M0399,Gallbladder obstruction,46,,.,,,.,,,.,,,.,,,.,,.,.,,.,.,
27,2,370,3,"M0003,M0399,M0003",M0003,-2,355,M0399,"Vomitting, diarrhea",184,M0003,-2,275,,.,,,.,,,.,,.,.,,.,.,
678,1,557,2,"M0411,M0299",M0411,-2,41,M0299,Hypertonia,86,,.,,,.,,,.,,,.,,.,.,,.,.,
678,2,393,2,"M0021,M0412",M0021,-2,116,M0412,-2,314,,.,,,.,,,.,,,.,,.,.,,.,.,
280,1,557,0,,,,,,,,,,,,,,,,,,,,,,,,,
280,2,393,0,,,,,,,,,,,,,,,,,,,,,,,,,
356,1,451,0,,,,,,,,,,,,,,,,,,,,,,,,,
356,2,371,2,"M0399,M0411",M0399,abdominal situs inversus,358,M0411,-2,180,,.,,,.,,,.,,,.,,.,.,,.,.,
608,1,450,1,M0111,M0111,-2,62,,.,,,.,,,.,,,.,,,.,,.,.,,.,.,
608,2,370,0,,,,,,,,,,,,,,,,,,,,,,,,,
652,1,218,0,,,,,,,,,,,,,,,,,,,,,,,,,
652,2,375,0,,,,,,,,,,,,,,,,,,,,,,,,,
253,1,230,1,M0411,M0411,-2,197,,.,,,.,,,.,,,.,,,.,,.,.,,.,.,
253,2,372,0,,,,,,,,,,,,,,,,,,,,,,,,,
446,1,374,0,,,,,,,,,,,,,,,,,,,,,,,,,
446,2,402,0,,,,,,,,,,,,,,,,,,,,,,,,,
814,1,769,0,,,,,,,,,,,,,,,,,,,,,,,,,
814,2,769,0,,,,,,,,,,,,,,,,,,,,,,,,,
125,1,163,7,"M0099,M0411,M0413,M0101,M0032,M0410",M0099,aortic coarct,87,M0411,-2,88,M0413,-2,102,M0101,-2,102,M0032,-2,128,M0410,-2,101,M0099,aortic obstruction,135,.,.,
125,2,758,0,,,,,,,,,,,,,,,,,,,,,,,,,
565,1,245,1,M0603,M0603,-2,181,,.,,,.,,,.,,,.,,,.,,.,.,,.,.,
565,2,442,0,,,,,,,,,,,,,,,,,,,,,,,,,
661,1,728,0,,,,,,,,,,,,,,,,,,,,,,,,,
661,2,372,4,"M0099,M0111,M0106,M0106",M0099,pulmonary edema leading to  hospital admission,155,M0111,-2,214,M0106,-2,214,M0106,-2,294,,.,,,.,,.,.,,.,.,
358,1,100,3,"M0111,M0099,M0111",M0111,-2,72,M0099,RPA stenosis,74,M0111,-2,89,,.,,,.,,,.,,.,.,,.,.,
358,2,366,0,,,,,,,,,,,,,,,,,,,,,,,,,
849,1,145,1,M0111,M0111,-2,130,,.,,,.,,,.,,,.,,,.,,.,.,,.,.,
849,2,676,2,"M0032,M0034",M0032,-2,234,M0034,-2,234,,.,,,.,,,.,,,.,,.,.,,.,.,
784,1,253,1,M0099,M0099,recurrent coarctation,89,,.,,,.,,,.,,,.,,,.,,.,.,,.,.,
275,1,610,4,"M0412,M0699,M9999,M9999",M0412,-2,64,M0699,disseminated intravascular coagulation,64,M9999,acidosis,64,M9999,hypothyroidism,108,,.,,,.,,.,.,,.,.,
275,2,610,0,,,,,,,,,,,,,,,,,,,,,,,,,
476,1,609,1,M0111,M0111,-2,169,,.,,,.,,,.,,,.,,,.,,.,.,,.,.,
476,2,609,1,M9999,M9999,orchiopexy,320,,.,,,.,,,.,,,.,,,.,,.,.,,.,.,
91,1,196,0,,,,,,,,,,,,,,,,,,,,,,,,,
91,2,537,0,,,,,,,,,,,,,,,,,,,,,,,,,
843,1,270,7,"M0412,M0603,M0405,M0405,M0032,M0413",M0412,-2,27,M0603,-2,28,M0405,-2,55,M0405,-2,101,M0032,-2,36,M0413,-2,146,M0599,grade 3 VUR,165,.,.,
843,2,476,2,"M0105,M0414",M0105,-2,265,M0414,-2,363,,.,,,.,,,.,,,.,,.,.,,.,.,
610,1,455,0,,,,,,,,,,,,,,,,,,,,,,,,,
610,2,455,0,,,,,,,,,,,,,,,,,,,,,,,,,
276,1,242,6,"M0111,M0206,M0412,M0112,M0411,M0499",M0111,-2,142,M0206,-2,144,M0412,-2,143,M0112,-2,171,M0411,-2,194,M0499,arm cellulitis at IV site,212,.,.,,.,.,
829,1,412,0,,,,,,,,,,,,,,,,,,,,,,,,,
829,2,412,0,,,,,,,,,,,,,,,,,,,,,,,,,
898,1,407,0,,,,,,,,,,,,,,,,,,,,,,,,,
168,1,127,0,,,,,,,,,,,,,,,,,,,,,,,,,
168,2,761,0,,,,,,,,,,,,,,,,,,,,,,,,,
61,1,337,1,M0411,M0411,-2,66,,.,,,.,,,.,,,.,,,.,,.,.,,.,.,
61,2,396,0,,,,,,,,,,,,,,,,,,,,,,,,,
176,1,329,0,,,,,,,,,,,,,,,,,,,,,,,,,
176,2,378,0,,,,,,,,,,,,,,,,,,,,,,,,,
761,1,300,1,M0111,M0111,-2,112,,.,,,.,,,.,,,.,,,.,,.,.,,.,.,
761,2,375,2,"M0399,M0499",M0399,Oropharayngeal dysphagia,201,M0499,c-diff positive,293,,.,,,.,,,.,,,.,,.,.,,.,.,
708,1,244,2,"M9999,M0411",M9999,orchidopexy and hernia repair,108,M0411,-2,109,,.,,,.,,,.,,,.,,.,.,,.,.,
708,2,473,0,,,,,,,,,,,,,,,,,,,,,,,,,
216,1,227,1,M0111,M0111,-2,123,,.,,,.,,,.,,,.,,,.,,.,.,,.,.,
216,2,642,0,,,,,,,,,,,,,,,,,,,,,,,,,
122,1,106,1,M0006,M0006,-2,79,,.,,,.,,,.,,,.,,,.,,.,.,,.,.,
514,1,153,1,M0111,M0111,-2,27,,.,,,.,,,.,,,.,,,.,,.,.,,.,.,
514,2,562,0,,,,,,,,,,,,,,,,,,,,,,,,,
314,1,146,0,,,,,,,,,,,,,,,,,,,,,,,,,
314,2,562,0,,,,,,,,,,,,,,,,,,,,,,,,,
58,1,1669,0,,,,,,,,,,,,,,,,,,,,,,,,,
58,2,1669,0,,,,,,,,,,,,,,,,,,,,,,,,,
6,1,1603,4,"M0111,M9999,M0603,M0399",M0111,-2,102,M9999,Hypoglycemia,102,M0603,-2,110,M0399,GE Reflux,112,,.,,,.,,.,.,,.,.,
6,2,1603,1,M0309,M0309,-2,294,,.,,,.,,,.,,,.,,,.,,.,.,,.,.,
789,1,1660,0,,,,,,,,,,,,,,,,,,,,,,,,,
789,2,2007,0,,,,,,,,,,,,,,,,,,,,,,,,,
142,1,1644,0,,,,,,,,,,,,,,,,,,,,,,,,,
142,2,1644,0,,,,,,,,,,,,,,,,,,,,,,,,,
343,2,1356,1,M0199,M0199,increasing cyanosis,332,,.,,,.,,,.,,,.,,,.,,.,.,,.,.,
343,1,1592,1,M0405,M0405,-2,44,,.,,,.,,,.,,,.,,,.,,.,.,,.,.,
540,1,1594,2,"M0309,M0111",M0309,-2,56,M0111,-2,125,,.,,,.,,,.,,,.,,.,.,,.,.,
540,2,1594,3,"M0411,M0410,M0206",M0411,-2,208,M0410,-2,222,M0206,-2,223,,.,,,.,,,.,,.,.,,.,.,
463,2,1576,3,"M0106,M0404,M0205",M0106,-2,244,M0404,-2,247,M0205,-2,259,,.,,,.,,,.,,.,.,,.,.,
463,1,1620,0,,,,,,,,,,,,,,,,,,,,,,,,,
17,1,1613,0,,,,,,,,,,,,,,,,,,,,,,,,,
17,2,1613,0,,,,,,,,,,,,,,,,,,,,,,,,,
656,1,1331,3,"M0499,M0032,M0111",M0499,pustule at sternal wound,59,M0032,-2,57,M0111,-2,127,,.,,,.,,,.,,.,.,,.,.,
656,2,1551,0,,,,,,,,,,,,,,,,,,,,,,,,,
526,2,1334,4,"M0199,M0199,M0499,M0099",M0199,shortness of breath,259,M0199,Atelectasis,267,M0499,Rotavirus,270,M0099,Coarctation of the aorta,313,,.,,,.,,.,.,,.,.,
526,1,1956,0,,,,,,,,,,,,,,,,,,,,,,,,,
350,1,1564,2,"M0006,M0032",M0006,-2,95,M0032,-2,96,,.,,,.,,,.,,,.,,.,.,,.,.,
350,2,1608,0,,,,,,,,,,,,,,,,,,,,,,,,,
308,1,1341,1,M0404,M0404,-2,171,,.,,,.,,,.,,,.,,,.,,.,.,,.,.,
308,2,1608,0,,,,,,,,,,,,,,,,,,,,,,,,,
152,1,1561,3,"M0399,M0109,M0412",M0399,Poor weight gain,61,M0109,-2,84,M0412,-2,87,,.,,,.,,,.,,.,.,,.,.,
152,2,1951,0,,,,,,,,,,,,,,,,,,,,,,,,,
112,1,1340,3,"M0413,M0799,M0111",M0413,-2,131,M0799,IV infiltrate,132,M0111,-2,126,,.,,,.,,,.,,.,.,,.,.,
112,2,1593,0,,,,,,,,,,,,,,,,,,,,,,,,,
323,1,1551,0,,,,,,,,,,,,,,,,,,,,,,,,,
323,2,1551,0,,,,,,,,,,,,,,,,,,,,,,,,,
258,1,1491,1,M0405,M0405,-2,131,,.,,,.,,,.,,,.,,,.,,.,.,,.,.,
258,2,1491,2,"M0411,M0412",M0411,-2,246,M0412,-2,253,,.,,,.,,,.,,,.,,.,.,,.,.,
638,1,1477,1,M0411,M0411,-2,55,,.,,,.,,,.,,,.,,,.,,.,.,,.,.,
638,2,1521,0,,,,,,,,,,,,,,,,,,,,,,,,,
621,1,1516,0,,,,,,,,,,,,,,,,,,,,,,,,,
621,2,1516,0,,,,,,,,,,,,,,,,,,,,,,,,,
433,1,1515,0,,,,,,,,,,,,,,,,,,,,,,,,,
433,2,1515,0,,,,,,,,,,,,,,,,,,,,,,,,,
298,1,1257,0,,,,,,,,,,,,,,,,,,,,,,,,,
298,2,1257,0,,,,,,,,,,,,,,,,,,,,,,,,,
146,1,1457,1,M0407,M0407,-2,147,,.,,,.,,,.,,,.,,,.,,.,.,,.,.,
146,2,1501,0,,,,,,,,,,,,,,,,,,,,,,,,,
528,1,1490,0,,,,,,,,,,,,,,,,,,,,,,,,,
847,1,1483,0,,,,,,,,,,,,,,,,,,,,,,,,,
847,2,1483,0,,,,,,,,,,,,,,,,,,,,,,,,,
636,1,1458,0,,,,,,,,,,,,,,,,,,,,,,,,,
636,2,1458,0,,,,,,,,,,,,,,,,,,,,,,,,,
690,2,410,0,,,,,,,,,,,,,,,,,,,,,,,,,
690,1,1410,2,"M0407,M0411",M0407,-2,16,M0411,-2,73,,.,,,.,,,.,,,.,,.,.,,.,.,
910,1,1392,2,"M0411,M0110",M0411,-2,29,M0110,-2,106,,.,,,.,,,.,,,.,,.,.,,.,.,
910,2,1436,0,,,,,,,,,,,,,,,,,,,,,,,,,
413,1,1434,0,,,,,,,,,,,,,,,,,,,,,,,,,
335,2,430,0,,,,,,,,,,,,,,,,,,,,,,,,,
335,1,1410,0,,,,,,,,,,,,,,,,,,,,,,,,,
123,1,1391,0,,,,,,,,,,,,,,,,,,,,,,,,,
161,2,399,4,"M0003,M0003,M0003,M0003",M0003,-2,219,M0003,-2,244,M0003,-2,255,M0003,-2,249,,.,,,.,,.,.,,.,.,
161,1,1335,2,"M0032,M0003",M0032,-2,59,M0003,-2,126,,.,,,.,,,.,,,.,,.,.,,.,.,
278,2,396,0,,,,,,,,,,,,,,,,,,,,,,,,,
278,1,1093,3,"M9999,M0499,M0032",M9999,hypoglycemia,69,M0499,right hand cellulitis,119,M0032,-2,69,,.,,,.,,,.,,.,.,,.,.,
234,2,414,0,,,,,,,,,,,,,,,,,,,,,,,,,
234,1,1325,0,,,,,,,,,,,,,,,,,,,,,,,,,
270,1,1059,3,"M0109,M0405,M0399",M0109,-2,24,M0405,-2,24,M0399,Feeding difficulties,24,,.,,,.,,,.,,.,.,,.,.,
626,2,415,0,,,,,,,,,,,,,,,,,,,,,,,,,
626,1,1298,0,,,,,,,,,,,,,,,,,,,,,,,,,
504,2,386,0,,,,,,,,,,,,,,,,,,,,,,,,,
504,1,1254,3,"M0111,M0030,M0032",M0111,-2,36,M0030,-2,37,M0032,-2,82,,.,,,.,,,.,,.,.,,.,.,
210,2,380,1,M0414,M0414,-2,358,,.,,,.,,,.,,,.,,,.,,.,.,,.,.,
210,1,1292,0,,,,,,,,,,,,,,,,,,,,,,,,,
411,1,918,4,"M0404,M0008,M0407,M0399",M0404,-2,37,M0008,-2,37,M0407,-2,69,M0399,Diarrhea NOS,130,,.,,,.,,.,.,,.,.,
411,2,374,0,,,,,,,,,,,,,,,,,,,,,,,,,
196,2,394,0,,,,,,,,,,,,,,,,,,,,,,,,,
196,1,1262,0,,,,,,,,,,,,,,,,,,,,,,,,,
369,2,407,0,,,,,,,,,,,,,,,,,,,,,,,,,
369,1,1200,1,M0603,M0603,-2,98,,.,,,.,,,.,,,.,,,.,,.,.,,.,.,
788,2,393,0,,,,,,,,,,,,,,,,,,,,,,,,,
788,1,1239,0,,,,,,,,,,,,,,,,,,,,,,,,,
23,1,397,0,,,,,,,,,,,,,,,,,,,,,,,,,
23,2,390,0,,,,,,,,,,,,,,,,,,,,,,,,,
166,2,366,1,M0111,M0111,-2,163,,.,,,.,,,.,,,.,,,.,,.,.,,.,.,
166,1,1230,0,,,,,,,,,,,,,,,,,,,,,,,,,
712,1,184,2,"M0207,M0099",M0207,-2,137,M0099,LV-Ao tunnel with aortic insufficiency,134,,.,,,.,,,.,,,.,,.,.,,.,.,
712,2,373,1,M0032,M0032,-2,281,,.,,,.,,,.,,,.,,,.,,.,.,,.,.,
378,1,206,2,"M0111,M0399",M0111,-2,42,M0399,Vomitting NOS,106,,.,,,.,,,.,,,.,,.,.,,.,.,
378,2,394,0,,,,,,,,,,,,,,,,,,,,,,,,,
831,1,948,2,"M0305,M0399",M0305,-2,32,M0399,Feeding intolerance,36,,.,,,.,,,.,,,.,,.,.,,.,.,
831,2,1201,0,,,,,,,,,,,,,,,,,,,,,,,,,
812,1,174,0,,,,,,,,,,,,,,,,,,,,,,,,,
812,2,366,0,,,,,,,,,,,,,,,,,,,,,,,,,
362,1,194,0,,,,,,,,,,,,,,,,,,,,,,,,,
362,2,373,0,,,,,,,,,,,,,,,,,,,,,,,,,
327,1,225,0,,,,,,,,,,,,,,,,,,,,,,,,,
327,2,366,0,,,,,,,,,,,,,,,,,,,,,,,,,
426,1,142,3,"M0112,M0111,M0034",M0112,-2,87,M0111,-2,119,M0034,-2,136,,.,,,.,,,.,,.,.,,.,.,
107,2,373,0,,,,,,,,,,,,,,,,,,,,,,,,,
107,1,1094,0,,,,,,,,,,,,,,,,,,,,,,,,,
387,2,417,0,,,,,,,,,,,,,,,,,,,,,,,,,
387,1,1431,0,,,,,,,,,,,,,,,,,,,,,,,,,
822,1,182,2,"M0111,M0099",M0111,-2,62,M0099,shunt narrowing,62,,.,,,.,,,.,,,.,,.,.,,.,.,
822,2,414,1,M0099,M0099,Recoart and LPA obstruction,237,,.,,,.,,,.,,,.,,,.,,.,.,,.,.,
805,1,322,4,"M0111,M0414,M0410,M0499",M0111,-2,88,M0414,-2,117,M0410,-2,164,M0499,fever,193,,.,,,.,,.,.,,.,.,
805,2,428,1,M0411,M0411,-2,278,,.,,,.,,,.,,,.,,,.,,.,.,,.,.,
373,1,217,4,"M0407,M0399,M0111,M0499",M0407,-2,48,M0399,failure to thrive,41,M0111,-2,76,M0499,febrile illness- no + cultures,139,,.,,,.,,.,.,,.,.,
373,2,292,1,M0006,M0006,-2,291,,.,,,.,,,.,,,.,,,.,,.,.,,.,.,
188,1,322,0,,,,,,,,,,,,,,,,,,,,,,,,,
188,2,700,0,,,,,,,,,,,,,,,,,,,,,,,,,
52,1,666,1,M9999,M9999,Broken Right Femur,236,,.,,,.,,,.,,,.,,,.,,.,.,,.,.,
52,2,427,0,,,,,,,,,,,,,,,,,,,,,,,,,
561,2,397,0,,,,,,,,,,,,,,,,,,,,,,,,,
561,1,998,0,,,,,,,,,,,,,,,,,,,,,,,,,
247,1,154,0,,,,,,,,,,,,,,,,,,,,,,,,,
247,2,446,0,,,,,,,,,,,,,,,,,,,,,,,,,
885,1,185,0,,,,,,,,,,,,,,,,,,,,,,,,,
885,2,389,1,M0499,M0499,bronchitis,348,,.,,,.,,,.,,,.,,,.,,.,.,,.,.,
487,1,133,0,,,,,,,,,,,,,,,,,,,,,,,,,
487,2,399,1,M0407,M0407,-2,151,,.,,,.,,,.,,,.,,,.,,.,.,,.,.,
518,1,127,0,,,,,,,,,,,,,,,,,,,,,,,,,
797,1,145,0,,,,,,,,,,,,,,,,,,,,,,,,,
797,2,945,0,,,,,,,,,,,,,,,,,,,,,,,,,
393,1,211,0,,,,,,,,,,,,,,,,,,,,,,,,,
393,2,926,0,,,,,,,,,,,,,,,,,,,,,,,,,
919,2,371,1,M9999,M9999,"sodium too low, admit to OSH over weekend",127,,.,,,.,,,.,,,.,,,.,,.,.,,.,.,
919,1,934,0,,,,,,,,,,,,,,,,,,,,,,,,,
839,1,141,6,"M0407,M0303,M0008,M0111,M0210,M0207",M0407,-2,28,M0303,-2,30,M0008,-2,29,M0111,-2,82,M0210,-2,34,M0207,-2,83,.,.,,.,.,
839,2,904,0,,,,,,,,,,,,,,,,,,,,,,,,,
302,1,597,2,"M0404,M0299",M0404,-2,34,M0299,craniotomy,146,,.,,,.,,,.,,,.,,.,.,,.,.,
302,2,469,2,"M0106,M0199",M0106,-2,190,M0199,left lower lobe actelectasis,192,,.,,,.,,,.,,,.,,.,.,,.,.,
243,1,107,2,"M0111,M0305",M0111,-2,72,M0305,-2,79,,.,,,.,,,.,,,.,,.,.,,.,.,
243,2,864,0,,,,,,,,,,,,,,,,,,,,,,,,,
458,1,184,0,,,,,,,,,,,,,,,,,,,,,,,,,
458,2,821,0,,,,,,,,,,,,,,,,,,,,,,,,,
817,1,170,0,,,,,,,,,,,,,,,,,,,,,,,,,
402,1,92,2,"M0411,M0111",M0411,-2,85,M0111,-2,85,,.,,,.,,,.,,,.,,.,.,,.,.,
402,2,518,0,,,,,,,,,,,,,,,,,,,,,,,,,
220,2,384,3,"M0106,M9999,M0113",M0106,-2,241,M9999,Digoxin toxicity,276,M0113,-2,231,,.,,,.,,,.,,.,.,,.,.,
220,1,757,0,,,,,,,,,,,,,,,,,,,,,,,,,
101,2,395,0,,,,,,,,,,,,,,,,,,,,,,,,,
101,1,744,0,,,,,,,,,,,,,,,,,,,,,,,,,
364,1,737,-9,,,,,,,,,,,,,,,,,,,,,,,,,
140,1,149,0,,,,,,,,,,,,,,,,,,,,,,,,,
140,2,712,0,,,,,,,,,,,,,,,,,,,,,,,,,
854,1,130,0,,,,,,,,,,,,,,,,,,,,,,,,,
854,2,508,0,,,,,,,,,,,,,,,,,,,,,,,,,
285,1,114,1,M0032,M0032,-2,92,,.,,,.,,,.,,,.,,,.,,.,.,,.,.,
285,2,652,1,M0399,M0399,Feeding Intolerance,190,,.,,,.,,,.,,,.,,,.,,.,.,,.,.,
331,1,122,0,,,,,,,,,,,,,,,,,,,,,,,,,
331,2,395,3,"M0499,M0411,M0411",M0499,C Diff colitis & GT site infection,220,M0411,-2,295,M0411,-2,219,,.,,,.,,,.,,.,.,,.,.,
386,1,316,1,M0407,M0407,-2,32,,.,,,.,,,.,,,.,,,.,,.,.,,.,.,
386,2,683,0,,,,,,,,,,,,,,,,,,,,,,,,,
90,1,73,4,"M0602,M0410,M0107,M0111",M0602,-2,55,M0410,-2,54,M0107,-2,60,M0111,-2,55,,.,,,.,,.,.,,.,.,
399,1,276,3,"M0021,M0411,M0411",M0021,-2,83,M0411,-2,82,M0411,-2,154,,.,,,.,,,.,,.,.,,.,.,
399,2,412,1,M0106,M0106,-2,184,,.,,,.,,,.,,,.,,,.,,.,.,,.,.,
445,2,490,0,,,,,,,,,,,,,,,,,,,,,,,,,
445,1,644,0,,,,,,,,,,,,,,,,,,,,,,,,,
743,1,224,4,"M0006,M0099,M0099,M0099",M0006,-2,61,M0099,Bradycardia,61,M0099,Wide Complex Tachycardia,61,M0099,Bradycardia,71,,.,,,.,,.,.,,.,.,
743,2,584,0,,,,,,,,,,,,,,,,,,,,,,,,,
730,1,222,0,,,,,,,,,,,,,,,,,,,,,,,,,
730,2,410,0,,,,,,,,,,,,,,,,,,,,,,,,,
293,2,366,0,,,,,,,,,,,,,,,,,,,,,,,,,
293,1,619,0,,,,,,,,,,,,,,,,,,,,,,,,,
311,1,598,0,,,,,,,,,,,,,,,,,,,,,,,,,
164,1,946,0,,,,,,,,,,,,,,,,,,,,,,,,,
185,1,573,0,,,,,,,,,,,,,,,,,,,,,,,,,
187,1,285,2,"M0399,M0206",M0399,FTT,184,M0206,-2,75,,.,,,.,,,.,,,.,,.,.,,.,.,
187,2,543,0,,,,,,,,,,,,,,,,,,,,,,,,,
830,1,540,0,,,,,,,,,,,,,,,,,,,,,,,,,
830,2,540,0,,,,,,,,,,,,,,,,,,,,,,,,,
658,1,1544,2,"M0003,M0413",M0003,-2,74,M0413,-2,148,,.,,,.,,,.,,,.,,.,.,,.,.,
658,2,1612,1,M0412,M0412,-2,195,,.,,,.,,,.,,,.,,,.,,.,.,,.,.,
307,1,1412,1,M0414,M0414,-2,192,,.,,,.,,,.,,,.,,,.,,.,.,,.,.,
51,1,1512,1,M0111,M0111,-2,55,,.,,,.,,,.,,,.,,,.,,.,.,,.,.,
51,2,1902,0,,,,,,,,,,,,,,,,,,,,,,,,,
907,2,440,1,M0102,M0102,-2,222,,.,,,.,,,.,,,.,,,.,,.,.,,.,.,
907,1,1378,2,"M0407,M0412",M0407,-2,80,M0412,-2,130,,.,,,.,,,.,,,.,,.,.,,.,.,
574,1,378,0,,,,,,,,,,,,,,,,,,,,,,,,,
110,1,1230,0,,,,,,,,,,,,,,,,,,,,,,,,,
859,1,1493,0,,,,,,,,,,,,,,,,,,,,,,,,,
859,2,368,1,M0407,M0407,-2,122,,.,,,.,,,.,,,.,,,.,,.,.,,.,.,
607,1,251,1,M0414,M0414,-2,136,,.,,,.,,,.,,,.,,,.,,.,.,,.,.,
607,2,251,1,M0032,M0032,-2,212,,.,,,.,,,.,,,.,,,.,,.,.,,.,.,
204,1,145,2,"M0399,M0603",M0399,Feeding intolerance,41,M0603,-2,43,,.,,,.,,,.,,,.,,.,.,,.,.,
204,2,385,0,,,,,,,,,,,,,,,,,,,,,,,,,
848,1,108,3,"M0310,M0310,M0111",M0310,-2,28,M0310,-2,79,M0111,-2,93,,.,,,.,,,.,,.,.,,.,.,
848,2,371,1,M0032,M0032,-2,281,,.,,,.,,,.,,,.,,,.,,.,.,,.,.,
50,1,170,1,M0111,M0111,-2,163,,.,,,.,,,.,,,.,,,.,,.,.,,.,.,
50,2,366,1,M0399,M0399,FTT,277,,.,,,.,,,.,,,.,,,.,,.,.,,.,.,
127,1,129,0,,,,,,,,,,,,,,,,,,,,,,,,,
127,2,852,2,"M0399,M0399",M0399,feeding intolerance,191,M0399,Diarrhea,232,,.,,,.,,,.,,,.,,.,.,,.,.,
867,1,887,0,,,,,,,,,,,,,,,,,,,,,,,,,
837,1,281,3,"M0411,M0111,M0499",M0411,-2,217,M0111,-2,263,M0499,Otitis Media,259,,.,,,.,,,.,,.,.,,.,.,
837,2,370,1,M0499,M0499,C-diff infection,338,,.,,,.,,,.,,,.,,,.,,.,.,,.,.,
162,1,174,2,"M0413,M0407",M0413,-2,83,M0407,-2,83,,.,,,.,,,.,,,.,,.,.,,.,.,
162,2,381,1,M0414,M0414,-2,236,,.,,,.,,,.,,,.,,,.,,.,.,,.,.,
734,1,138,0,,,,,,,,,,,,,,,,,,,,,,,,,
197,1,533,1,M0605,M0605,-2,29,,.,,,.,,,.,,,.,,,.,,.,.,,.,.,
197,2,525,0,,,,,,,,,,,,,,,,,,,,,,,,,
414,1,247,3,"M0499,M0499,M9999",M0499,fever,194,M0499,Otitis Media,166,M9999,Hypoglycemia,236,,.,,,.,,,.,,.,.,,.,.,
414,2,371,6,"M0106,M0414,M0408,M0407,M0399,M0111",M0106,-2,285,M0414,-2,308,M0408,-2,308,M0407,-2,298,M0399,Hypernatremia,309,M0111,-2,354,.,.,,.,.,
693,1,149,0,,,,,,,,,,,,,,,,,,,,,,,,,
693,2,387,7,"M0411,M0102,M0032,M0107,M0499,M0106",M0411,-2,169,M0102,-2,169,M0032,-2,169,M0107,-2,184,M0499,RLL Pneumonia,283,M0106,-2,198,M0106,-2,308,.,.,
655,1,372,4,"M0408,M0205,M0111,M0499",M0408,-2,245,M0205,-2,254,M0111,-2,278,M0499,VP shunt infection,312,,.,,,.,,.,.,,.,.,
511,2,1876,0,,,,,,,,,,,,,,,,,,,,,,,,,
511,1,1486,1,M0412,M0412,-2,170,,.,,,.,,,.,,,.,,,.,,.,.,,.,.,
439,1,643,0,,,,,,,,,,,,,,,,,,,,,,,,,
405,1,1397,2,"M0404,M0032",M0404,-2,64,M0032,-2,134,,.,,,.,,,.,,,.,,.,.,,.,.,
405,2,459,0,,,,,,,,,,,,,,,,,,,,,,,,,
150,1,359,0,,,,,,,,,,,,,,,,,,,,,,,,,
150,2,533,0,,,,,,,,,,,,,,,,,,,,,,,,,
605,1,981,0,,,,,,,,,,,,,,,,,,,,,,,,,
605,2,981,0,,,,,,,,,,,,,,,,,,,,,,,,,
891,1,168,1,M0111,M0111,-2,53,,.,,,.,,,.,,,.,,,.,,.,.,,.,.,
891,2,378,1,M0414,M0414,-2,185,,.,,,.,,,.,,,.,,,.,,.,.,,.,.,
265,1,537,0,,,,,,,,,,,,,,,,,,,,,,,,,
845,1,58,1,M0402,M0402,-2,46,,.,,,.,,,.,,,.,,,.,,.,.,,.,.,
845,2,441,0,,,,,,,,,,,,,,,,,,,,,,,,,