blind_id,comp_age,banatdx,BANDX_S,adxcat,ASSOCDX,asdxcode,ASDXCODE_0,ASDX_S_0,ASDXCODE_1,ASDX_S_1,ASDXCODE_2,ASDX_S_2,ASDXCODE_3,ASDX_S_3,ASDXCODE_4,ASDX_S_4,ASDXCODE_5,ASDX_S_5,ASDXCODE_6,ASDX_S_6,ASDXCODE_7,ASDX_S_7,ASDXCODE_8,ASDX_S_8,BNUMPSV,BATRSEPT,BCOARCT,BAVALVOT,BOTHSURG,BOSURG_S,PALSURG,palsrg_age,bproc,BPROC_S,BNUMCON,bconcode,BCONCOD_0,BCON_S_0,BCONCOD_1,BCON_S_1,BCONCOD_2,BCON_S_2,BCONCOD_3,BCON_S_3,BCONCOD_4,BCON_S_4,BNUMSURG,bsurgcode,BSURGCOD_0,BSURG_S_0,BSURGCOD_1,BSURG_S_1,BSURGCOD_2,BSURG_S_2,BSURGCOD_3,BSURG_S_3,BSURGCOD_4,BSURG_S_4,BSURGCOD_5,BSURG_S_5,BSURGCOD_6,BSURG_S_6,BSURGCOD_7,BSURG_S_7,BSURGCOD_8,BSURG_S_8,BNUMCATH,bcath,bcath_0,bcath_0_age,BCATHNAM_0,bcath_1,bcath_1_age,BCATHNAM_1,bcath_2,bcath_2_age,BCATHNAM_2,lloop,vent_type
713,27,"A1.06.01.01: SV, Heterotaxia syndrome, DORV w/ AVCD, Asplenia",-2,SV:Unbalanced AVC R dominant,,,,,,,,,,,,,,,,,,,,,2:No,-2,-2,-2,-2,-2,,1,"B1.02: SV Palliation, PA band",-2,2,11 99,11:Repair of totally anomalous pulmonary venous connection,-2,99:Other concurrent surgery,Ligation and division PDA,,,,,,,2,2 99,02:Chest exploration without intervention,-2,99:Other cardiac surgical procedure,RA line insertion,,,,,,,,,,,,,,,0,,,,,,,,,,,2,3
167,33,"A1.05.01.01: SV, Unbalanced AVCD, Right dominant, No PS/PA",-2,SV:Unbalanced AVC R dominant,,,,,,,,,,,,,,,,,,,,,2:No,-2,-2,-2,-2,-2,,15,"B1.05.02: SV Palliation, Norwood procedure, Sano operation",-2,2,99 6,99:Other concurrent surgery,Ligation PDA,06:Division of main pulmonary artery,-2,,,,,,,1,99,99:Other cardiac surgical procedure,ECMO,,,,,,,,,,,,,,,,,0,,,,,,,,,,,2,2
1146,24,"A2.01: HLHS, Ao and MA",-2,HLHS,,,,,,,,,,,,,,,,,,,,,2:No,-2,-2,-2,-2,-2,,7,"B1.05.02: SV Palliation, Norwood procedure, Sano operation",-2,1,99,99:Other concurrent surgery,Division Anomalous Rt. Subclavian Artery,,,,,,,,,0,,,,,,,,,,,,,,,,,,,,0,,,,,,,,,,,2,2
859,28,"A1.06.01: SV, Heterotaxia syndrome, DORV w/ AVCD",-2,SV:Unbalanced AVC R dominant,,,,,,,,,,,,,,,,,,,,,2:No,-2,-2,-2,-2,-2,,15,"B1.01.01.11: SV Palliation, Shunt-systemic-to-pulmonary, Left (MBTSL) placement",-2,3,9 99 99,09:Patch repair of pulmonary artery stenosis,-2,99:Other concurrent surgery,Ligation PDA,99:Other concurrent surgery,PA Band,,,,,1,1,01:Chest closure,-2,,,,,,,,,,,,,,,,,1,F7.03.02.02,F7.03.02.02: Stent; PA; Branch; Peripheral,10,-2,,,,,,,2,3
414,19,"A2.02.01: HLHS, Ao atresia and MV stenosis, Intact ventr. septum",-2,HLHS,,,,,,,,,,,,,,,,,,,,,2:No,-2,-2,-2,-2,-2,,7,"B1.05.01: SV Palliation, Norwood procedure, Modified BTS",-2,0,,,,,,,,,,,,1,1,01:Chest closure,-2,,,,,,,,,,,,,,,,,0,,,,,,,,,,,2,2
810,21,"A1.06.01: SV, Heterotaxia syndrome, DORV w/ AVCD",-2,SV:Unbalanced AVC R dominant,1:Yes,I300 I400 I350 I999,I300,-2,I400,-2,I350,-2,I999,Common Atrium,,,,,,,,,,,2:No,-2,-2,-2,-2,-2,,5,"B1.02.01: SV Palliation, PA band, Band placement",-2,1,99,99:Other concurrent surgery,Ligation PDA,,,,,,,,,0,,,,,,,,,,,,,,,,,,,,0,,,,,,,,,,,2,3
289,8,"A2.01: HLHS, Ao and MA",-2,HLHS,1:Yes,I999 I999,I999,Lt.Ventricular Coronary Fistula,I999,Mild Tricuspid Regurg,,,,,,,,,,,,,,,2:No,-2,-2,-2,-2,-2,,5,"B1.05.02: SV Palliation, Norwood procedure, Sano operation",-2,1,99,99:Other concurrent surgery,ECMO Support,,,,,,,,,0,,,,,,,,,,,,,,,,,,,,0,,,,,,,,,,,2,2
1234,44,"A1.04.01.02: SV, TA, D-loop, no TGA, Pulm. hypoplasia, Small VSD (Type 1b)",-2,SV:TA,2:No,,,,,,,,,,,,,,,,,,,,2:No,-2,-2,-2,-2,-2,,41,"B1.01.01.21: SV Palliation, Shunt-systemic-to-pulmonary, Right (MBTSR) placement",-2,2,7 99,07:Ligation of main pulmonary artery,-2,99:Other concurrent surgery,Ligation PDA,,,,,,,0,,,,,,,,,,,,,,,,,,,,0,,,,,,,,,,,2,1
1023,16,"A2.02.01: HLHS, Ao atresia and MV stenosis, Intact ventr. septum",-2,HLHS,2:No,,,,,,,,,,,,,,,,,,,,2:No,-2,-2,-2,-2,-2,,9,"B1.05.01: SV Palliation, Norwood procedure, Modified BTS",-2,0,,,,,,,,,,,,0,,,,,,,,,,,,,,,,,,,,0,,,,,,,,,,,2,2
894,20,"A2.04.01: HLHS, Ao stenosis and MV stenosis, Intact ventr. septum",-2,HLHS,2:No,,,,,,,,,,,,,,,,,,,,2:No,-2,-2,-2,-2,-2,,9,"B1.05.02: SV Palliation, Norwood procedure, Sano operation",-2,1,99,99:Other concurrent surgery,Ligation PDA,,,,,,,,,1,1,01:Chest closure,-2,,,,,,,,,,,,,,,,,1,F7.05,F7.05: Stent; Conduit,16,-2,,,,,,,2,2
898,18,"A3.01: Other functional SV, PA w/ intact ventr. septum",-2,PA/IVS,1:Yes,I300,I300,-2,,,,,,,,,,,,,,,,,2:No,-2,-2,-2,-2,-2,,7,"B1.01.01.21: SV Palliation, Shunt-systemic-to-pulmonary, Right (MBTSR) placement",-2,2,99 99,99:Other concurrent surgery,Ligation PDA,99:Other concurrent surgery,Ligation Azygous Vein,,,,,,,0,,,,,,,,,,,,,,,,,,,,1,F3.01,F3.01: Balloon septostomy: Native atrial septum,8,-2,,,,,,,2,1
977,36,"A2.05.02.02: HLHS, Ao stenosis and MV hypoplasia, Small VSD",-2,HLHS,2:No,,,,,,,,,,,,,,,,,,,,2:No,-2,-2,-2,-2,-2,,7,"B1.05.01: SV Palliation, Norwood procedure, Modified BTS",-2,1,99,99:Other concurrent surgery,Ligation PDA,,,,,,,,,2,1 12,01:Chest closure,-2,12:Thoracic duct ligation,-2,,,,,,,,,,,,,,,0,,,,,,,,,,,2,2
846,16,"A2.07.01: HLHS, Ao stenosis and MA, Large VSD",-2,HLHS,1:Yes,I601 I750,I601,-2,I750,-2,,,,,,,,,,,,,,,2:No,-2,-2,-2,-2,-2,,4,"B1.05.01: SV Palliation, Norwood procedure, Modified BTS",-2,1,11,11:Repair of totally anomalous pulmonary venous connection,-2,,,,,,,,,1,1,01:Chest closure,-2,,,,,,,,,,,,,,,,,0,,,,,,,,,,,2,2
586,26,"A2.05.01: HLHS, Ao stenosis and MV hypoplasia, Intact ventr. septum",-2,HLHS,2:No,,,,,,,,,,,,,,,,,,,,2:No,-2,-2,-2,-2,-2,,16,"B1.05.01: SV Palliation, Norwood procedure, Modified BTS",-2,0,,,,,,,,,,,,1,1,01:Chest closure,-2,,,,,,,,,,,,,,,,,0,,,,,,,,,,,2,2
427,21,"A2.02.01: HLHS, Ao atresia and MV stenosis, Intact ventr. septum",-2,HLHS,2:No,,,,,,,,,,,,,,,,,,,,2:No,-2,-2,-2,-2,-2,,7,"B1.05.01: SV Palliation, Norwood procedure, Modified BTS",-2,0,,,,,,,,,,,,0,,,,,,,,,,,,,,,,,,,,0,,,,,,,,,,,2,2
522,30,"A2.01: HLHS, Ao and MA",-2,HLHS,2:No,,,,,,,,,,,,,,,,,,,,2:No,-2,-2,-2,-2,-2,,7,"B1.05.01: SV Palliation, Norwood procedure, Modified BTS",-2,1,99,99:Other concurrent surgery,Ligation PDA,,,,,,,,,0,,,,,,,,,,,,,,,,,,,,0,,,,,,,,,,,2,2
538,44,"A1.02.03.02: SV, DIRV, Other, PS",-2,DIRV,2:No,,,,,,,,,,,,,,,,,,,,2:No,-2,-2,-2,-2,-2,,32,"B1.01.01.21: SV Palliation, Shunt-systemic-to-pulmonary, Right (MBTSR) placement",-2,3,6 99 99,06:Division of main pulmonary artery,-2,99:Other concurrent surgery,LIGATION PDA,99:Other concurrent surgery,RIGHT BT SHUNT,,,,,3,2 99 99,02:Chest exploration without intervention,-2,99:Other cardiac surgical procedure,CENTRAL SHUNT,99:Other cardiac surgical procedure,LIGATION PDA,,,,,,,,,,,,,1,F3.01,F3.01: Balloon septostomy: Native atrial septum,7,-2,,,,,,,2,2
50,370,"A1.01.02.02: SV, DILV, {S,D,D/L/I} Outlet chamber, Small VSD",-2,DILV,1:Yes,I750,I750,-2,,,,,,,,,,,,,,,,,2:No,-2,-2,-2,-2,-2,1,12,"B1.05.01: SV Palliation, Norwood procedure, Modified BTS",-2,2,99 99,99:Other concurrent surgery,DKS,99:Other concurrent surgery,PDA Ligation,,,,,,,0,,,,,,,,,,,,,,,,,,,,0,,,,,,,,,,,2,1
485,16,"A2.01: HLHS, Ao and MA",-2,HLHS,2:No,,,,,,,,,,,,,,,,,,,,2:No,-2,-2,-2,-2,-2,,6,"B1.05.01: SV Palliation, Norwood procedure, Modified BTS",-2,1,99,99:Other concurrent surgery,Ligation PDA,,,,,,,,,1,1,01:Chest closure,-2,,,,,,,,,,,,,,,,,0,,,,,,,,,,,2,2
1080,33,"A3.01: Other functional SV, PA w/ intact ventr. septum",-2,PA/IVS,1:Yes,I999 I999,I999,ASD,I999,TRISCUPID ATRESIA,,,,,,,,,,,,,,,2:No,-2,-2,-2,-2,-2,,11,"B1.01.01.21: SV Palliation, Shunt-systemic-to-pulmonary, Right (MBTSR) placement",-2,1,99,99:Other concurrent surgery,LIGATION PDA,,,,,,,,,1,99,99:Other cardiac surgical procedure,DE-LIGATE PDA,,,,,,,,,,,,,,,,,0,,,,,,,,,,,2,1
337,45,"A2.06.01: HLHS, Hypoplastic AV and MV and LV, Intact ventr. septum",-2,HLHS,2:No,,,,,,,,,,,,,,,,,,,,2:No,-2,-2,-2,-2,-2,,4,"B1.05.01: SV Palliation, Norwood procedure, Modified BTS",-2,1,99,99:Other concurrent surgery,LIGATION PDA,,,,,,,,,3,2 1 99,02:Chest exploration without intervention,-2,01:Chest closure,-2,99:Other cardiac surgical procedure,ECMO,,,,,,,,,,,,,0,,,,,,,,,,,2,2
1148,39,"A1.02.03.03: SV, DIRV, Other, PA",-2,DIRV,1:Yes,I999 I601 I999 I750,I999,RT. AORTIC ARCH,I601,-2,I999,LT IVC,I750,-2,,,,,,,,,,,2:No,-2,-2,-2,-2,-2,,6,"B1.01.01.11: SV Palliation, Shunt-systemic-to-pulmonary, Left (MBTSL) placement",-2,1,99,99:Other concurrent surgery,LIGATION PDA,,,,,,,,,0,,,,,,,,,,,,,,,,,,,,0,,,,,,,,,,,2,2
232,18,"A2.01: HLHS, Ao and MA",-2,HLHS,2:No,,,,,,,,,,,,,,,,,,,,2:No,-2,-2,-2,-2,-2,,7,"B1.05.01: SV Palliation, Norwood procedure, Modified BTS",-2,0,,,,,,,,,,,,0,,,,,,,,,,,,,,,,,,,,0,,,,,,,,,,,2,2
363,35,"A2.02.01: HLHS, Ao atresia and MV stenosis, Intact ventr. septum",-2,HLHS,1:Yes,I300 I400 I999,I300,-2,I400,-2,I999,LEFT ISOMERISM,,,,,,,,,,,,,2:No,-2,-2,-2,-2,-2,,5,"B1.05.01: SV Palliation, Norwood procedure, Modified BTS",-2,1,99,99:Other concurrent surgery,LIGATION PDA,,,,,,,,,0,,,,,,,,,,,,,,,,,,,,0,,,,,,,,,,,2,2
424,32,"A2.06: HLHS, Hypoplastic AV and MV and LV",-2,HLHS,2:No,,,,,,,,,,,,,,,,,,,,2:No,-2,-2,-2,-2,-2,,15,"B1.05.01: SV Palliation, Norwood procedure, Modified BTS",-2,1,99,99:Other concurrent surgery,Ligation PDA,,,,,,,,,1,1,01:Chest closure,-2,,,,,,,,,,,,,,,,,0,,,,,,,,,,,2,2
290,17,"A1.06.01: SV, Heterotaxia syndrome, DORV w/ AVCD",-2,SV:Unbalanced AVC R dominant,1:Yes,I750 I601 I650,I750,-2,I601,-2,I650,-2,,,,,,,,,,,,,2:No,-2,-2,-2,-2,-2,,8,"B1.05.02: SV Palliation, Norwood procedure, Sano operation",-2,3,11 99 99,11:Repair of totally anomalous pulmonary venous connection,-2,99:Other concurrent surgery,LIGATION VERTICAL VEIN,99:Other concurrent surgery,LIGATION DUCTUS ARTERIOSIS,,,,,1,99,99:Other cardiac surgical procedure,ECMO,,,,,,,,,,,,,,,,,0,,,,,,,,,,,2,3
1218,34,"A2.06.01: HLHS, Hypoplastic AV and MV and LV, Intact ventr. septum",-2,HLHS,2:No,,,,,,,,,,,,,,,,,,,,2:No,-2,-2,-2,-2,-2,,8,"B1.05.01: SV Palliation, Norwood procedure, Modified BTS",-2,0,,,,,,,,,,,,1,1,01:Chest closure,-2,,,,,,,,,,,,,,,,,0,,,,,,,,,,,2,2
76,22,"A2.04.01: HLHS, Ao stenosis and MV stenosis, Intact ventr. septum",-2,HLHS,2:No,,,,,,,,,,,,,,,,,,,,2:No,-2,-2,-2,-2,-2,,6,"B1.05.01: SV Palliation, Norwood procedure, Modified BTS",-2,1,99,99:Other concurrent surgery,LIGATION PDA,,,,,,,,,1,1,01:Chest closure,-2,,,,,,,,,,,,,,,,,0,,,,,,,,,,,2,2
58,25,"A3.01: Other functional SV, PA w/ intact ventr. septum",-2,PA/IVS,1:Yes,I999,I999,CORONARY FISTULA,,,,,,,,,,,,,,,,,2:No,-2,-2,-2,-2,-2,,5,"B1.01.01.21: SV Palliation, Shunt-systemic-to-pulmonary, Right (MBTSR) placement",-2,1,99,99:Other concurrent surgery,LIG.PDA,,,,,,,,,0,,,,,,,,,,,,,,,,,,,,0,,,,,,,,,,,2,1
34,25,"A1.01.02.01: SV, DILV, {S,D,D/L/I} Outlet chamber, Large VSD",-2,DILV,2:No,,,,,,,,,,,,,,,,,,,,2:No,-2,-2,-2,-2,-2,,5,"B1.02.01: SV Palliation, PA band, Band placement",-2,0,,,,,,,,,,,,0,,,,,,,,,,,,,,,,,,,,1,F7.06,F7.06: Stent; PDA,8,-2,,,,,,,2,1
1152,121,"A3.01: Other functional SV, PA w/ intact ventr. septum",-2,PA/IVS,1:Yes,I999,I999,Severe Tircuspid Regurgitation,,,,,,,,,,,,,,,,,1:Yes,2:No,2:No,2:No,1:Yes,"Lig PDA, RA plication",2,,,-2,-2,,,,,,,,,,,,1,99,99:Other cardiac surgical procedure,ecmo,,,,,,,,,,,,,,,,,2,F5.04 | F2.04,F5.04: Radiofrequency ablation; Atretic pulmonary valve,3,-2,F2.04: Balloon valvuloplasty; Pulmonic,3,-2,,,,2,1
141,14,"A1.05.01.01: SV, Unbalanced AVCD, Right dominant, No PS/PA",-2,SV:Unbalanced AVC R dominant,1:Yes,I999,I999,Hypoplastic transverse and decending Ao arch,,,,,,,,,,,,,,,,,2:No,-2,-2,-2,-2,-2,,5,"B1.02.01: SV Palliation, PA band, Band placement",-2,0,,,,,,,,,,,,0,,,,,,,,,,,,,,,,,,,,1,F7.06,F7.06: Stent; PDA,5,-2,,,,,,,2,2
611,234,A4: Unclassified,"aortic stenosis, planned biV repair",Other SV,1:Yes,I999,I999,"Severely reduced LV function, BAV, MR/TR",,,,,,,,,,,,,,,,,2:No,-2,-2,-2,-2,-2,2,,,-2,-2,,,,,,,,,,,,0,,,,,,,,,,,,,,,,,,,,1,F2.01,F2.01: Balloon valvuloplasty; Aortic,3,-2,,,,,,,2,3
613,23,"A1.05.01.02: SV, Unbalanced AVCD, Right dominant, PS",-2,SV:Unbalanced AVC R dominant,2:No,,,,,,,,,,,,,,,,,,,,2:No,-2,-2,-2,-2,-2,,22,"B1.02.01: SV Palliation, PA band, Band placement",-2,1,99,99:Other concurrent surgery,Ligation abherant Lt. subclavian,,,,,,,,,0,,,,,,,,,,,,,,,,,,,,1,F7.06,F7.06: Stent; PDA,22,-2,,,,,,,2,2
1077,32,"A3.01: Other functional SV, PA w/ intact ventr. septum",-2,PA/IVS,2:No,,,,,,,,,,,,,,,,,,,,1:Yes,2:No,2:No,2:No,1:Yes,LIGATION PDA,,11,"B1.01.01.21: SV Palliation, Shunt-systemic-to-pulmonary, Right (MBTSR) placement",-2,0,,,,,,,,,,,,0,,,,,,,,,,,,,,,,,,,,2,F5.04 | F2.04,F5.04: Radiofrequency ablation; Atretic pulmonary valve,2,-2,F2.04: Balloon valvuloplasty; Pulmonic,2,-2,,,,2,1
857,44,"A2.01: HLHS, Ao and MA",-2,HLHS,1:Yes,I750,I750,-2,,,,,,,,,,,,,,,,,2:No,-2,-2,-2,-2,-2,,8,"B1.02.01: SV Palliation, PA band, Band placement",-2,1,99,99:Other concurrent surgery,Shunt froom MPA to rt. carotid artery,,,,,,,,,0,,,,,,,,,,,,,,,,,,,,1,F7.06,F7.06: Stent; PDA,8,-2,,,,,,,2,2
512,28,"A2.02.01: HLHS, Ao atresia and MV stenosis, Intact ventr. septum",-2,HLHS,1:Yes,I999,I999,L.V.SINUSOIDS,,,,,,,,,,,,,,,,,2:No,-2,-2,-2,-2,-2,,8,"B1.01.01.21: SV Palliation, Shunt-systemic-to-pulmonary, Right (MBTSR) placement",-2,1,99,99:Other concurrent surgery,BILATERAL PA BANDS,,,,,,,,,0,,,,,,,,,,,,,,,,,,,,1,F7.06,F7.06: Stent; PDA,8,-2,,,,,,,2,2
956,36,A4: Unclassified,"Other PA single outlet type, VSD",Other SV,2:No,,,,,,,,,,,,,,,,,,,,2:No,-2,-2,-2,-2,-2,,10,"B1.01.01.21: SV Palliation, Shunt-systemic-to-pulmonary, Right (MBTSR) placement",-2,2,9 99,09:Patch repair of pulmonary artery stenosis,-2,99:Other concurrent surgery,Lig. PDA,,,,,,,0,,,,,,,,,,,,,,,,,,,,0,,,,,,,,,,,2,3
110,22,"A3.07: Other functional SV, L-loop TGA or DORV w/ 2 ventricles",-2,Two ventricles,1:Yes,I100,I100,-2,,,,,,,,,,,,,,,,,2:No,-2,-2,-2,-2,-2,,12,"B1.02.01: SV Palliation, PA band, Band placement",-2,2,99 99,99:Other concurrent surgery,Repair Co-arctation,99:Other concurrent surgery,Lig. PDA,,,,,,,0,,,,,,,,,,,,,,,,,,,,0,,,,,,,,,,,1,3
1104,19,A4: Unclassified,Unclassified,Other SV,1:Yes,I999,I999,Severe tricuspid regurg.,,,,,,,,,,,,,,,,,2:No,-2,-2,-2,-2,-2,,,B1: Single Ventricle Palliation,-2,0,,,,,,,,,,,,0,,,,,,,,,,,,,,,,,,,,0,,,,,,,,,,,2,3
474,25,"A3.04.01.03: Other functional SV, D-loop DORV w/ 2 ventricles, 2 AV valves, PS or atresia",-2,Two ventricles,2:No,,,,,,,,,,,,,,,,,,,,2:No,-2,-2,-2,-2,-2,,,B1: Single Ventricle Palliation,-2,0,,,,,,,,,,,,0,,,,,,,,,,,,,,,,,,,,0,,,,,,,,,,,2,3
668,26,"A1.05.01.01: SV, Unbalanced AVCD, Right dominant, No PS/PA",-2,SV:Unbalanced AVC R dominant,1:Yes,I750 I300 I999,I750,-2,I300,-2,I999,"Severe AS, Mild AI",,,,,,,,,,,,,2:No,-2,-2,-2,-2,-2,2,,,-2,-2,,,,,,,,,,,,0,,,,,,,,,,,,,,,,,,,,0,,,,,,,,,,,2,2
914,22,"A2.06.02.01: HLHS, Hypoplastic AV and MV and LV, Large VSD",-2,HLHS,2:No,,,,,,,,,,,,,,,,,,,,2:No,-2,-2,-2,-2,-2,2,,,-2,-2,,,,,,,,,,,,0,,,,,,,,,,,,,,,,,,,,0,,,,,,,,,,,2,2
855,19,"A1.06.01.02: SV, Heterotaxia syndrome, DORV w/ AVCD, Polysplenia",-2,SV:Unbalanced AVC R dominant,1:Yes,I300 I400 I750,I300,-2,I400,-2,I750,-2,,,,,,,,,,,,,2:No,-2,-2,-2,-2,-2,2,,,-2,-2,,,,,,,,,,,,0,,,,,,,,,,,,,,,,,,,,0,,,,,,,,,,,2,3
998,17,"A1.04.01.02: SV, TA, D-loop, no TGA, Pulm. hypoplasia, Small VSD (Type 1b)",-2,SV:TA,2:No,,,,,,,,,,,,,,,,,,,,2:No,-2,-2,-2,-2,-2,1,6,"B1.01.01.21: SV Palliation, Shunt-systemic-to-pulmonary, Right (MBTSR) placement",-2,0,,,,,,,,,,,,2,99 1,99:Other cardiac surgical procedure,main pa ligation,01:Chest closure,-2,,,,,,,,,,,,,,,0,,,,,,,,,,,2,1
47,7,"A1.04.01.03: SV, TA, D-loop, no TGA, No pulm. hypoplaisa, Large VSD (Type 1c)",-2,SV:TA,1:Yes,I200,I200,-2,,,,,,,,,,,,,,,,,2:No,-2,-2,-2,-2,-2,2,,,-2,-2,,,,,,,,,,,,0,,,,,,,,,,,,,,,,,,,,0,,,,,,,,,,,2,1
1210,27,"A3.02.03: Other functional SV, VSDs, Pulmonary stenosis or atresia",-2,Other SV,1:Yes,I750,I750,-2,,,,,,,,,,,,,,,,,2:No,-2,-2,-2,-2,-2,2,,,-2,-2,,,,,,,,,,,,0,,,,,,,,,,,,,,,,,,,,0,,,,,,,,,,,2,3
785,13,"A2.06.01: HLHS, Hypoplastic AV and MV and LV, Intact ventr. septum",-2,HLHS,1:Yes,I750,I750,-2,,,,,,,,,,,,,,,,,2:No,-2,-2,-2,-2,-2,1,6,"B1.02.01: SV Palliation, PA band, Band placement",-2,0,,,,,,,,,,,,0,,,,,,,,,,,,,,,,,,,,1,F7.06,F7.06: Stent; PDA,6,-2,,,,,,,2,2
696,34,"A2.05.01: HLHS, Ao stenosis and MV hypoplasia, Intact ventr. septum",-2,HLHS,2:No,,,,,,,,,,,,,,,,,,,,2:No,-2,-2,-2,-2,-2,2,,,-2,-2,,,,,,,,,,,,0,,,,,,,,,,,,,,,,,,,,0,,,,,,,,,,,2,2
42,47,"A3.10.02: Other functional SV, Hypoplastic RV w/ VSDs, TV stenosis",-2,Other SV,1:Yes,I999 I999 I999 I999 I999,I999,Single Coronary Artery,I999,superior-inferior ventricles,I999,AV discordance,I999,PFO,I999,subpulmonary stenosis,,,,,,,,,1:Yes,1:Yes,2:No,2:No,2:No,-2,2,,,-2,-2,,,,,,,,,,,,0,,,,,,,,,,,,,,,,,,,,0,,,,,,,,,,,2,1
1047,29,"A2.04.01: HLHS, Ao stenosis and MV stenosis, Intact ventr. septum",-2,HLHS,2:No,,,,,,,,,,,,,,,,,,,,2:No,-2,-2,-2,-2,-2,1,15,"B1.05.02: SV Palliation, Norwood procedure, Sano operation",-2,0,,,,,,,,,,,,1,99,99:Other cardiac surgical procedure,Chest Tube Insertion,,,,,,,,,,,,,,,,,0,,,,,,,,,,,2,2
1184,47,"A3.10.02: Other functional SV, Hypoplastic RV w/ VSDs, TV stenosis",-2,Other SV,1:Yes,I750,I750,-2,,,,,,,,,,,,,,,,,2:No,-2,-2,-2,-2,-2,2,,,-2,-2,,,,,,,,,,,,0,,,,,,,,,,,,,,,,,,,,2,F2.04 | F7.06,F2.04: Balloon valvuloplasty; Pulmonic,1,-2,F7.06: Stent; PDA,32,-2,,,,2,1
1193,57,"A1.04.01.03: SV, TA, D-loop, no TGA, No pulm. hypoplaisa, Large VSD (Type 1c)",-2,SV:TA,2:No,,,,,,,,,,,,,,,,,,,,2:No,-2,-2,-2,-2,-2,2,,,-2,-2,,,,,,,,,,,,0,,,,,,,,,,,,,,,,,,,,1,F3.01,F3.01: Balloon septostomy: Native atrial septum,52,-2,,,,,,,2,1
116,23,"A3.04.01.01: Other functional SV, D-loop DORV w/ 2 ventricles, 2 AV valves, No Ao or PS",-2,Two ventricles,1:Yes,I750 I999,I750,-2,I999,Aberrant Rt. Subclavian Artery,,,,,,,,,,,,,,,2:No,-2,-2,-2,-2,-2,2,,,-2,-2,,,,,,,,,,,,0,,,,,,,,,,,,,,,,,,,,1,F3.01,F3.01: Balloon septostomy: Native atrial septum,0,-2,,,,,,,2,3
1170,47,"A3.06.01.03: Other functional SV, D-loop TGA w/ 2 ventricles, Solitus atria, PS or atresia",-2,Two ventricles,2:No,,,,,,,,,,,,,,,,,,,,2:No,-2,-2,-2,-2,-2,1,25,"B1.02.01: SV Palliation, PA band, Band placement",-2,0,,,,,,,,,,,,0,,,,,,,,,,,,,,,,,,,,1,F3.01,F3.01: Balloon septostomy: Native atrial septum,24,-2,,,,,,,2,3
1000,25,"A3.04.01.01: Other functional SV, D-loop DORV w/ 2 ventricles, 2 AV valves, No Ao or PS",-2,Two ventricles,1:Yes,I100,I100,-2,,,,,,,,,,,,,,,,,2:No,-2,-2,-2,-2,-2,2,,,-2,-2,,,,,,,,,,,,0,,,,,,,,,,,,,,,,,,,,0,,,,,,,,,,,2,3
360,37,"A2.03.01: HLHS, Ao atresia and Large VSD",-2,HLHS,1:Yes,I999,I999,ASD,,,,,,,,,,,,,,,,,2:No,-2,-2,-2,-2,-2,1,9,"B1.01.03.21: SV Palliation, Shunt-systemic-to-pulmonary, Central w/ tube graft, Right placement",-2,2,99 99,99:Other concurrent surgery,Bilateral PA Banding,99:Other concurrent surgery,Ductal stenting,,,,,,,0,,,,,,,,,,,,,,,,,,,,1,F7.06,F7.06: Stent; PDA,9,-2,,,,,,,2,3
1240,33,"A1.04.03.03: SV, TA, D-loop, TGA, Lg pulm. artery (Type 2c)",-2,SV:TA,1:Yes,I150 I999 I999 I999,I150,-2,I999,ASD,I999,VSD,I999,PDA,,,,,,,,,,,2:No,-2,-2,-2,-2,-2,1,4,"B1.05.01: SV Palliation, Norwood procedure, Modified BTS",-2,0,,,,,,,,,,,,0,,,,,,,,,,,,,,,,,,,,0,,,,,,,,,,,2,1
112,49,"A1.05.02.01: SV, Unbalanced AVCD, Left dominant, No PS/PA",-2,SV:Unbalanced AVC L dominant,1:Yes,I750 I999 I999,I750,-2,I999,PDA,I999,Double outlet (R) Atrium,,,,,,,,,,,,,2:No,-2,-2,-2,-2,-2,2,,,-2,-2,,,,,,,,,,,,0,,,,,,,,,,,,,,,,,,,,0,,,,,,,,,,,2,1
212,48,"A2.04.01: HLHS, Ao stenosis and MV stenosis, Intact ventr. septum",-2,HLHS,1:Yes,I999 I999,I999,PDA,I999,PDA,,,,,,,,,,,,,,,1:Yes,2:No,2:No,1:Yes,2:No,-2,1,12,"B1.02.01: SV Palliation, PA band, Band placement",-2,2,99 99,99:Other concurrent surgery,PDA Stent,99:Other concurrent surgery,ASD stent,,,,,,,0,,,,,,,,,,,,,,,,,,,,3,F2.01 | F7.06 | F7,F2.01: Balloon valvuloplasty; Aortic,1,-2,F7.06: Stent; PDA,12,-2,F7: Stent,12,-2,2,2
351,28,"A2.02.01: HLHS, Ao atresia and MV stenosis, Intact ventr. septum",-2,HLHS,1:Yes,I999 I999,I999,"ASD, non-restrictive",I999,Large PDA,,,,,,,,,,,,,,,2:No,-2,-2,-2,-2,-2,1,6,"B1.05.01: SV Palliation, Norwood procedure, Modified BTS",-2,0,,,,,,,,,,,,0,,,,,,,,,,,,,,,,,,,,0,,,,,,,,,,,2,2
938,17,"A2.02.01: HLHS, Ao atresia and MV stenosis, Intact ventr. septum",-2,HLHS,1:Yes,I999 I999,I999,non-restrictive ASD,I999,PDA,,,,,,,,,,,,,,,2:No,-2,-2,-2,-2,-2,1,9,"B1.05.02: SV Palliation, Norwood procedure, Sano operation",-2,0,,,,,,,,,,,,0,,,,,,,,,,,,,,,,,,,,0,,,,,,,,,,,2,2
303,48,"A1.04.01.03: SV, TA, D-loop, no TGA, No pulm. hypoplaisa, Large VSD (Type 1c)",-2,SV:TA,1:Yes,I999 I999,I999,ASD,I999,PDA,,,,,,,,,,,,,,,2:No,-2,-2,-2,-2,-2,2,,,-2,-2,,,,,,,,,,,,0,,,,,,,,,,,,,,,,,,,,0,,,,,,,,,,,2,1
835,41,"A1.05.01.01: SV, Unbalanced AVCD, Right dominant, No PS/PA",-2,SV:Unbalanced AVC R dominant,1:Yes,I999 I999,I999,"ASD, non-restrictive",I999,PDA,,,,,,,,,,,,,,,2:No,-2,-2,-2,-2,-2,1,20,"B1.02.01: SV Palliation, PA band, Band placement",-2,0,,,,,,,,,,,,0,,,,,,,,,,,,,,,,,,,,1,F7.06,F7.06: Stent; PDA,20,-2,,,,,,,2,2
385,49,"A2.06.02.02: HLHS, Hypoplastic AV and MV and LV, Small VSD",-2,HLHS,1:Yes,I999 I999,I999,ASD,I999,PDA,,,,,,,,,,,,,,,2:No,-2,-2,-2,-2,-2,1,12,"B1.05.01: SV Palliation, Norwood procedure, Modified BTS",-2,0,,,,,,,,,,,,3,99 99 1,99:Other cardiac surgical procedure,chest reopening,99:Other cardiac surgical procedure,ECMO,01:Chest closure,-2,,,,,,,,,,,,,1,F1.03.02.01.01,"F1.03.02.01.01: Balloon angioplasty, NOS; PA; Branch; Central; Left",30,-2,,,,,,,2,2
1140,26,"A1.04.01.01: SV, TA, D-loop, no TGA, PA (Type 1a)",-2,SV:TA,1:Yes,I999 I999 I999,I999,ASD,I999,PDA,I999,PAPVD -  LUPV  to VERT. VEIN,,,,,,,,,,,,,2:No,-2,-2,-2,-2,-2,1,14,"B1.01.01.21: SV Palliation, Shunt-systemic-to-pulmonary, Right (MBTSR) placement",-2,1,99,99:Other concurrent surgery,PDA Ligation,,,,,,,,,0,,,,,,,,,,,,,,,,,,,,0,,,,,,,,,,,2,1
689,44,"A3.01: Other functional SV, PA w/ intact ventr. septum",-2,PA/IVS,1:Yes,I999 I999 I999 I999,I999,PFO,I999,Hypoplastic TV,I999,RV Sinusoids,I999,PDA,,,,,,,,,,,2:No,-2,-2,-2,-2,-2,1,17,"B1.01.01.21: SV Palliation, Shunt-systemic-to-pulmonary, Right (MBTSR) placement",-2,2,99 99,99:Other concurrent surgery,PDA Ligation,99:Other concurrent surgery,ECMO,,,,,,,2,1 2,01:Chest closure,-2,02:Chest exploration without intervention,-2,,,,,,,,,,,,,,,1,F3.01,F3.01: Balloon septostomy: Native atrial septum,3,-2,,,,,,,2,1
497,44,"A1.03.03.03: SV, MA, {S,L,L/D/I}, PS",-2,SV:MA,1:Yes,I999 I999 I999,I999,PDA,I999,ASD,I999,LPA stenosis,,,,,,,,,,,,,2:No,-2,-2,-2,-2,-2,2,,,-2,-2,,,,,,,,,,,,0,,,,,,,,,,,,,,,,,,,,0,,,,,,,,,,,1,2
1141,45,"A1.06.03: SV, Heterotaxia syndrome, Other","unbal AVSD, hypoplastic RV, TGA , Ao ant to  PA",SV:Unbalanced AVC L dominant,1:Yes,I999 I999 I750 I601,I999,PDA,I999,subpulmonary stenosis,I750,-2,I601,-2,,,,,,,,,,,2:No,-2,-2,-2,-2,-2,2,,,-2,-2,,,,,,,,,,,,0,,,,,,,,,,,,,,,,,,,,0,,,,,,,,,,,2,3
122,46,"A1.04.01.03: SV, TA, D-loop, no TGA, No pulm. hypoplaisa, Large VSD (Type 1c)",-2,SV:TA,1:Yes,I999 I999,I999,PDA,I999,Lge. urestrictive ASD secundum,,,,,,,,,,,,,,,2:No,-2,-2,-2,-2,-2,1,37,"B1.02.01: SV Palliation, PA band, Band placement",-2,0,,,,,,,,,,,,0,,,,,,,,,,,,,,,,,,,,0,,,,,,,,,,,2,1
267,49,"A2.06.01: HLHS, Hypoplastic AV and MV and LV, Intact ventr. septum",-2,HLHS,1:Yes,I999 I999,I999,PDA,I999,Multiplev ASDs,,,,,,,,,,,,,,,2:No,-2,-2,-2,-2,-2,2,,,-2,-2,,,,,,,,,,,,0,,,,,,,,,,,,,,,,,,,,0,,,,,,,,,,,2,2
1136,25,"A1.01.07.01: SV, DILV, {I,L,L/D/I} Outlet chamber, Large VSD",-2,DILV,1:Yes,I999 I999,I999,ASD,I999,PDA,,,,,,,,,,,,,,,2:No,-2,-2,-2,-2,-2,1,7,"B1.01.01.11: SV Palliation, Shunt-systemic-to-pulmonary, Left (MBTSL) placement",-2,1,9,09:Patch repair of pulmonary artery stenosis,-2,,,,,,,,,0,,,,,,,,,,,,,,,,,,,,0,,,,,,,,,,,1,1
292,27,"A2.01: HLHS, Ao and MA",-2,HLHS,1:Yes,I999,I999,PDA,,,,,,,,,,,,,,,,,2:No,-2,-2,-2,-2,-2,1,6,"B1.02.01: SV Palliation, PA band, Band placement",-2,1,99,99:Other concurrent surgery,Reversed shunt between PA and innominate artery,,,,,,,,,3,99 99 99,99:Other cardiac surgical procedure,Removal of atrioseptal stent,99:Other cardiac surgical procedure,Tricuspid valve repair,99:Other cardiac surgical procedure,ECMO,,,,,,,,,,,,,3,F7.06 | F7.06 | F9,F7.06: Stent; PDA,13,-2,F7.06: Stent; PDA,6,-2,F9: Other device implantation,13,Stent artial septum,2,2