blind_id,comp_age,hadm_age,hdis_age,PALSURG,PSRGWHEN,psrg_age,bprocode,BPROC_S,BNUMCON,BCONCOD_0,BCON_S_0,BYPASST,CLAMPT,ARREST,ARRESTT,HICU,HVENT,HNUMCATH,hcath,hcath_age_0,hcath_sp,HNUMSURG,hsurgcode,hsurg_sp,HSURGCOD_0,HSURG_S_0,HSURGCOD_1,HSURG_S_1,HSURGCOD_2,HSURG_S_2,HSURGCOD_3,HSURG_S_3,HSURGCOD_4,HSURG_S_4,HSURGCOD_5,HSURG_S_5,HSURGCOD_6,HSURG_S_6,HSURGCOD_7,HSURG_S_7,HSURGCOD_8,HSURG_S_8,HSURGCOD_9,HSURG_S_9,HNUMMED,hmedcode,hmedcode_0,HMEDNAME_0,hmedcode_1,HMEDNAME_1,hmedcode_2,HMEDNAME_2,hmedcode_3,HMEDNAME_3,hmedcode_4,HMEDNAME_4,hmedcode_5,HMEDNAME_5,hmedcode_6,HMEDNAME_6,hmedcode_7,HMEDNAME_7,hmedcode_8,HMEDNAME_8,hmedcode_9,HMEDNAME_9,hmedcode_10,HMEDNAME_10,hmedcode_11,HMEDNAME_11,hmedcode_12,HMEDNAME_12,hmedcode_13,HMEDNAME_13,hmedcode_14,HMEDNAME_14,BBOTTLE,BBOTCAL,BBOTVOL,BBREAST,BBRSTCAL,BBRSTVOL,BNGBR,BNGBRCAL,BNGBRVOL,BNGF,BNGFCAL,BNGFVOL,TOTCAL,Feedgrp,HOSAT,HAIRTYPE,HNUMCOMP,hcompcode,hcomp_sp,HCOMPCOD_0,HCOMP_S_0,hcomp_age_0,HCOMPCOD_1,HCOMP_S_1,hcomp_age_1,HCOMPCOD_2,HCOMP_S_2,hcomp_age_2,HCOMPCOD_3,HCOMP_S_3,hcomp_age_3,HCOMPCOD_4,HCOMP_S_4,hcomp_age_4,HCOMPCOD_5,HCOMP_S_5,hcomp_age_5,HCOMPCOD_6,HCOMP_S_6,hcomp_age_6,HCOMPCOD_7,HCOMP_S_7,hcomp_age_7,HCOMPCOD_8,HCOMP_S_8,hcomp_age_8,HCOMPCOD_9,HCOMP_S_9,hcomp_age_9,HCOMPCOD_10,HCOMP_S_10,hcomp_age_10,HCOMPCOD_11,HCOMP_S_11,hcomp_age_11,HCOMPCOD_12,HCOMP_S_12,hcomp_age_12,HCOMPCOD_13,HCOMP_S_13,hcomp_age_13,HCOMPCOD_14,HCOMP_S_14,hcomp_age_14,HCOMPCOD_15,HCOMP_S_15,hcomp_age_15,HCOMPCOD_16,HCOMP_S_16,hcomp_age_16,HCOMPCOD_17,HCOMP_S_17,hcomp_age_17,HCOMPCOD_18,HCOMP_S_18,hcomp_age_18,HCOMPCOD_19,HCOMP_S_19,hcomp_age_19,HCOMPCOD_20,HCOMP_S_20,hcomp_age_20,HCOMPCOD_21,HCOMP_S_21,hcomp_age_21,HCOMPCOD_22,HCOMP_S_22,hcomp_age_22,DISCHARG
1023,35,1,34,,,,,,,,,110,50,1:Yes,4,7,6,0,,,,0,,,,,,,,,,,,,,,,,,,,,,,5,14.08 09.99 09.99 15.99 07.06,14.00-14.99= Diuretics,,09.00-09.99= Biologics,Tri-Vi-Sol,09.00-09.99= Biologics,Folic Acid,15.00-15.99= Electrolytes,Calcium Carbonate,07.00-07.99= Antithrombotics,-2,.,,.,,.,,.,,.,,.,,.,,.,,.,,.,,1:Yes,0.90,202,2:No,-2.00,-2,2:No,-2.00,-2,1:Yes,0.90,278,432,Tube Feed Group,85,1:Room Air,3,C0205 C2201 C9999,Renal function decline,C-0205= Chylothorax,-2,14,C-2201= Wound infection,-2,27,C-9999= Other significant complication,Renal function decline,28,,,,,,,,,,,,,,,,,,,,,,,,,,,,,,,,,,,,,,,,,,,,,,,,,,,,,,,,,,,,,2:No
894,102,4,59,,,,,,,,,148,120,1:Yes,19,13,9,0,,,,0,,,,,,,,,,,,,,,,,,,,,,,6,04.02 07.06 09.99 14.08 16.06 16.99,04.00-04.99= Anticonvulsants,,07.00-07.99= Antithrombotics,,09.00-09.99= Biologics,Ferrous Fumarate,14.00-14.99= Diuretics,,16.00-16.99= Gastrointestinals,,16.00-16.99= Gastrointestinals,Domperidone,.,,.,,.,,.,,.,,.,,.,,.,,.,,1:Yes,0.90,391,2:No,-2.00,-2,2:No,-2.00,-2,2:No,-2.00,-2,351.9,Bottle Feed Group,87,1:Room Air,5,C1504 C0205 C1801 C9999 C1805,Severe Conduit Stenosis,C-1504= Pneumothorax,-2,45,C-0205= Chylothorax,-2,20,C-1801= Seizure(s),-2,33,C-9999= Other significant complication,Severe Conduit Stenosis,16,C-1805= Stroke,-2,33,,,,,,,,,,,,,,,,,,,,,,,,,,,,,,,,,,,,,,,,,,,,,,,,,,,,,,,2:No
586,36,3,35,,,,,,,,,133,40,1:Yes,34,10,6,0,,,,1,1,,01:Chest closure,-2,,,,,,,,,,,,,,,,,,,5,07.06 14.08 04.02 09.99 09.99,07.00-07.99= Antithrombotics,,14.00-14.99= Diuretics,,04.00-04.99= Anticonvulsants,,09.00-09.99= Biologics,Ca carbonate,09.00-09.99= Biologics,Calcitrol,.,,.,,.,,.,,.,,.,,.,,.,,.,,.,,1:Yes,0.90,341,2:No,-2.00,-2,2:No,-2.00,-2,1:Yes,0.90,257,538.2,Tube Feed Group,78,1:Room Air,3,C9999 C1807 C9999,Hypocalcemia | Seroma,C-9999= Other significant complication,Hypocalcemia,18,C-1807= Systemic hypertension,-2,19,C-9999= Other significant complication,Seroma,29,,,,,,,,,,,,,,,,,,,,,,,,,,,,,,,,,,,,,,,,,,,,,,,,,,,,,,,,,,,,,2:No
427,34,2,22,,,,,,,,,61,47,1:Yes,44,8,6,0,,,,0,,,,,,,,,,,,,,,,,,,,,,,3,07.06 16.06 09.99,07.00-07.99= Antithrombotics,,16.00-16.99= Gastrointestinals,,09.00-09.99= Biologics,Di Vi Sol,.,,.,,.,,.,,.,,.,,.,,.,,.,,.,,.,,.,,1:Yes,0.90,25,1:Yes,0.67,-8,2:No,-2.00,-2,2:No,-2.00,-2,,Bottle Feed Group,82,1:Room Air,3,C1807 C0601 C0001,,C-1807= Systemic hypertension,-2,7,C-0601= Gastrointestinal complication (includes necrotizing enterocolitis [NEC]),-2,14,C-0001= Acute renal dysfunction or failure (7 days),-2,8,,,,,,,,,,,,,,,,,,,,,,,,,,,,,,,,,,,,,,,,,,,,,,,,,,,,,,,,,,,,,2:No
522,30,0,28,,,,,,,,,122,63,1:Yes,3,12,9,0,,,,1,1,,01:Chest closure,-2,,,,,,,,,,,,,,,,,,,2,07.06 16.06,07.00-07.99= Antithrombotics,,16.00-16.99= Gastrointestinals,-2,.,,.,,.,,.,,.,,.,,.,,.,,.,,.,,.,,.,,.,,1:Yes,0.90,280,2:No,-2.00,-2,2:No,-2.00,-2,1:Yes,0.90,240,468,Tube Feed Group,80,1:Room Air,3,C1902 C0601 C9999,HYPOTENSION,C-1902= Tracheal injury,-2,18,C-0601= Gastrointestinal complication (includes necrotizing enterocolitis [NEC]),-2,27,C-9999= Other significant complication,HYPOTENSION,8,,,,,,,,,,,,,,,,,,,,,,,,,,,,,,,,,,,,,,,,,,,,,,,,,,,,,,,,,,,,,2:No
485,25,0,24,,,,,,,,,172,82,1:Yes,9,12,9,0,,,,1,1,,01:Chest closure,-2,,,,,,,,,,,,,,,,,,,2,14.08 07.06,14.00-14.99= Diuretics,,07.00-07.99= Antithrombotics,-2,.,,.,,.,,.,,.,,.,,.,,.,,.,,.,,.,,.,,.,,1:Yes,0.90,64,2:No,-2.00,-2,1:Yes,0.67,-8,1:Yes,0.90,416,,Tube Feed Group,80,1:Room Air,1,C9999,Seroma,C-9999= Other significant complication,Seroma,23,,,,,,,,,,,,,,,,,,,,,,,,,,,,,,,,,,,,,,,,,,,,,,,,,,,,,,,,,,,,,,,,,,,2:No
232,20,0,20,,,,,,,,,106,55,1:Yes,8,8,6,0,,,,0,,,,,,,,,,,,,,,,,,,,,,,3,07.06 07.02 14.08,07.00-07.99= Antithrombotics,,07.00-07.99= Antithrombotics,,14.00-14.99= Diuretics,-2,.,,.,,.,,.,,.,,.,,.,,.,,.,,.,,.,,.,,1:Yes,0.80,450,2:No,-2.00,-2,2:No,-2.00,-2,2:No,-2.00,-2,360,Bottle Feed Group,80,1:Room Air,1,C0003,,C-0003= Atrial flutter,-2,7,,,,,,,,,,,,,,,,,,,,,,,,,,,,,,,,,,,,,,,,,,,,,,,,,,,,,,,,,,,,,,,,,,,2:No
363,69,1,66,,,,,,,,,102,47,1:Yes,3,12,7,0,,,,0,,,,,,,,,,,,,,,,,,,,,,,4,14.08 07.06 03.99 16.99,14.00-14.99= Diuretics,,07.00-07.99= Antithrombotics,,03.00-03.99= Antibiotics,Cotrimoxazole,16.00-16.99= Gastrointestinals,Omeprazole,.,,.,,.,,.,,.,,.,,.,,.,,.,,.,,.,,2:No,-2.00,-2,2:No,-2.00,-2,1:Yes,0.67,480,1:Yes,0.80,-8,,Tube Feed Group,78,1:Room Air,7,C9999 C2201 C0601 C9999 C9999 C0601 C0601,Pneumonia | Intermittent desaturation | Fever,C-9999= Other significant complication,Pneumonia,7,C-2201= Wound infection,-2,15,C-0601= Gastrointestinal complication (includes necrotizing enterocolitis [NEC]),-2,8,C-9999= Other significant complication,Intermittent desaturation,17,C-9999= Other significant complication,Fever,23,C-0601= Gastrointestinal complication (includes necrotizing enterocolitis [NEC]),-2,26,C-0601= Gastrointestinal complication (includes necrotizing enterocolitis [NEC]),-2,42,,,,,,,,,,,,,,,,,,,,,,,,,,,,,,,,,,,,,,,,,,,,,,,,,2:No
1218,91,1,76,,,,,,,,,167,64,1:Yes,17,44,10,0,,,,2,1 2,,01:Chest closure,,02:Chest exploration without intervention,-2,,,,,,,,,,,,,,,,,5,07.06 13.02 09.99 16.99 19.99,07.00-07.99= Antithrombotics,,13.00-13.99= Converting Enzyme Inhibitors,,09.00-09.99= Biologics,Di-Vi-Sol,16.00-16.99= Gastrointestinals,Omeprazole,19.00-19.99= Inotropic Agents,Domperidone,.,,.,,.,,.,,.,,.,,.,,.,,.,,.,,1:Yes,1.00,70,2:No,-2.00,-2,1:Yes,1.00,560,2:No,-2.00,-2,630,Tube Feed Group,78,1:Room Air,7,C0205 C1802 C1807 C9999 C1502 C0601 C1806,Difficulty in withdrawl from sedation,C-0205= Chylothorax,-2,15,"C-1802= Sepsis, confirmed by blood cultures",-2,18,C-1807= Systemic hypertension,-2,41,C-9999= Other significant complication,Difficulty in withdrawl from sedation,52,C-1502= Pericardial tamponade,-2,8,C-0601= Gastrointestinal complication (includes necrotizing enterocolitis [NEC]),-2,24,C-1806= Supraventricular tachycardia,-2,20,,,,,,,,,,,,,,,,,,,,,,,,,,,,,,,,,,,,,,,,,,,,,,,,,2:No
76,37,0,30,,,,,,,,,142,63,1:Yes,1,17,14,0,,,,2,1 2,,01:Chest closure,,02:Chest exploration without intervention,-2,,,,,,,,,,,,,,,,,4,07.06 14.08 15.99 09.99,07.00-07.99= Antithrombotics,,14.00-14.99= Diuretics,,15.00-15.99= Electrolytes,Na Cl,09.00-09.99= Biologics,D-Vi-Sol,.,,.,,.,,.,,.,,.,,.,,.,,.,,.,,.,,1:Yes,0.90,20,2:No,-2.00,-2,1:Yes,0.90,440,2:No,-2.00,-2,414,Tube Feed Group,79,1:Room Air,3,C0702 C2103 C1501,,C-0702= Hemorrhage,-2,6,C-2103= Ventricular dysfunction,-2,15,C-1501= Pericardial effusion,-2,15,,,,,,,,,,,,,,,,,,,,,,,,,,,,,,,,,,,,,,,,,,,,,,,,,,,,,,,,,,,,,2:No
34,26,0,21,,,,,,,,,-9,-9,2:No,-2,6,4,0,,,,0,,,,,,,,,,,,,,,,,,,,,,,2,07.06 09.99,07.00-07.99= Antithrombotics,,09.00-09.99= Biologics,Di-Vi-Sol,.,,.,,.,,.,,.,,.,,.,,.,,.,,.,,.,,.,,.,,1:Yes,0.90,480,2:No,-2.00,-2,2:No,-2.00,-2,2:No,-2.00,-2,432,Bottle Feed Group,75,1:Room Air,2,C2102 C2101,,C-2102= Ventricular arrhythmia,-2,18,C-2101= Vascular complication,-2,19,,,,,,,,,,,,,,,,,,,,,,,,,,,,,,,,,,,,,,,,,,,,,,,,,,,,,,,,,,,,,,,,2:No
785,15,0,15,1,1,,,-2,-2,,,0,0,2:No,-2,4,2,1,F7.06,14,,0,,,,,,,,,,,,,,,,,,,,,,,0,,,,,,,,,,,,,,,,,,,,,,,,,,,,,,,,1:Yes,0.67,360,2:No,-2.00,-2,2:No,-2.00,-2,2:No,-2.00,-2,241.2,Bottle Feed Group,84,1:Room Air,,,,,,,,,,,,,,,,,,,,,,,,,,,,,,,,,,,,,,,,,,,,,,,,,,,,,,,,,,,,,,,,,,,,,,,,,
1047,36,10,35,1,1,,,-2,-2,,,138,82,1:Yes,18,14,7,0,,,,2,99 99,Pericardial Tap | Insertion chest tube,99:Other cardiac surgical procedure,Pericardial Tap,99:Other cardiac surgical procedure,Insertion chest tube,,,,,,,,,,,,,,,,,2,14.08 07.06,14.00-14.99= Diuretics,,07.00-07.99= Antithrombotics,-2,.,,.,,.,,.,,.,,.,,.,,.,,.,,.,,.,,.,,.,,1:Yes,0.90,600,2:No,-2.00,-2,2:No,-2.00,-2,2:No,-2.00,-2,540,Bottle Feed Group,85,1:Room Air,,,,,,,,,,,,,,,,,,,,,,,,,,,,,,,,,,,,,,,,,,,,,,,,,,,,,,,,,,,,,,,,,,,,,,,,,
1240,33,0,28,1,1,,,-2,-2,,,104,75,1:Yes,46,16,11,0,,,,0,,,,,,,,,,,,,,,,,,,,,,,3,07.06 14.08 16.06,07.00-07.99= Antithrombotics,,14.00-14.99= Diuretics,,16.00-16.99= Gastrointestinals,-2,.,,.,,.,,.,,.,,.,,.,,.,,.,,.,,.,,.,,1:Yes,0.90,165,2:No,-2.00,-2,1:Yes,0.90,315,2:No,-2.00,-2,432,Tube Feed Group,82,1:Room Air,,,,,,,,,,,,,,,,,,,,,,,,,,,,,,,,,,,,,,,,,,,,,,,,,,,,,,,,,,,,,,,,,,,,,,,,,
351,30,0,29,1,1,,,-2,-2,,,66,59,1:Yes,17,13,11,0,,,,0,,,,,,,,,,,,,,,,,,,,,,,5,07.06 16.99 09.99 15.99 22.01,07.00-07.99= Antithrombotics,,16.00-16.99= Gastrointestinals,Domperidone,09.00-09.99= Biologics,D-vi-sol,15.00-15.99= Electrolytes,Calcium Carbonate,"22.00-22.99= Sedatives, hypnotics, anesthetics, analgesics",-2,.,,.,,.,,.,,.,,.,,.,,.,,.,,.,,1:Yes,1.00,153,1:Yes,0.67,14,1:Yes,1.00,238,2:No,-2.00,-2,400.38,Tube Feed Group,85,1:Room Air,,,,,,,,,,,,,,,,,,,,,,,,,,,,,,,,,,,,,,,,,,,,,,,,,,,,,,,,,,,,,,,,,,,,,,,,,
938,23,1,21,1,1,,,-2,-2,,,106,65,1:Yes,32,7,6,0,,,,0,,,,,,,,,,,,,,,,,,,,,,,2,14.08 99.99,14.00-14.99= Diuretics,,99.99= Unclassified,Clotrimazole cream,.,,.,,.,,.,,.,,.,,.,,.,,.,,.,,.,,.,,.,,1:Yes,0.90,510,2:No,-2.00,-2,2:No,-2.00,-2,2:No,-2.00,-2,459,Bottle Feed Group,84,1:Room Air,,,,,,,,,,,,,,,,,,,,,,,,,,,,,,,,,,,,,,,,,,,,,,,,,,,,,,,,,,,,,,,,,,,,,,,,,
986,20,1,17,1,1,,,-2,-2,,,-9,-9,2:No,-2,4,3,0,,,,0,,,,,,,,,,,,,,,,,,,,,,,3,07.06 09.99 15.99,07.00-07.99= Antithrombotics,,09.00-09.99= Biologics,d-vi-sol,15.00-15.99= Electrolytes,Calcium carbonate,.,,.,,.,,.,,.,,.,,.,,.,,.,,.,,.,,.,,1:Yes,0.80,361,1:Yes,0.67,-8,2:No,-2.00,-2,2:No,-2.00,-2,,Bottle Feed Group,75,1:Room Air,,,,,,,,,,,,,,,,,,,,,,,,,,,,,,,,,,,,,,,,,,,,,,,,,,,,,,,,,,,,,,,,,,,,,,,,,
29,37,0,33,1,1,,,-2,-2,,,100,47,1:Yes,4,15,13,0,,,,2,99 1,Chest opening,99:Other cardiac surgical procedure,Chest opening,01:Chest closure,-2,,,,,,,,,,,,,,,,,5,07.06 14.08 16.06 09.99 15.99,07.00-07.99= Antithrombotics,,14.00-14.99= Diuretics,,16.00-16.99= Gastrointestinals,,09.00-09.99= Biologics,Calcitriol,15.00-15.99= Electrolytes,Calcium carbonate,.,,.,,.,,.,,.,,.,,.,,.,,.,,.,,1:Yes,1.00,419,2:No,-2.00,-2,1:Yes,1.00,45,2:No,-2.00,-2,464,Tube Feed Group,84,1:Room Air,,,,,,,,,,,,,,,,,,,,,,,,,,,,,,,,,,,,,,,,,,,,,,,,,,,,,,,,,,,,,,,,,,,,,,,,,
1190,32,8,31,1,1,,,-2,-2,,,0,0,2:No,-2,9,6,0,,,,0,,,,,,,,,,,,,,,,,,,,,,,3,14.08 07.06 16.06,14.00-14.99= Diuretics,,07.00-07.99= Antithrombotics,,16.00-16.99= Gastrointestinals,-2,.,,.,,.,,.,,.,,.,,.,,.,,.,,.,,.,,.,,1:Yes,0.90,60,2:No,-2.00,-2,2:No,-2.00,-2,1:Yes,0.90,500,504,Tube Feed Group,80,1:Room Air,,,,,,,,,,,,,,,,,,,,,,,,,,,,,,,,,,,,,,,,,,,,,,,,,,,,,,,,,,,,,,,,,,,,,,,,,
412,23,0,22,1,1,,,-2,-2,,,143,68,1:Yes,6,12,11,0,,,,0,,,,,,,,,,,,,,,,,,,,,,,4,07.06 16.06 16.99 22.01,07.00-07.99= Antithrombotics,,16.00-16.99= Gastrointestinals,,16.00-16.99= Gastrointestinals,domperidone,"22.00-22.99= Sedatives, hypnotics, anesthetics, analgesics",-2,.,,.,,.,,.,,.,,.,,.,,.,,.,,.,,.,,1:Yes,0.90,59,2:No,-2.00,-2,1:Yes,0.90,349,2:No,-2.00,-2,367.2,Tube Feed Group,87,1:Room Air,,,,,,,,,,,,,,,,,,,,,,,,,,,,,,,,,,,,,,,,,,,,,,,,,,,,,,,,,,,,,,,,,,,,,,,,,
909,47,2,41,1,1,,,-2,-2,,,0,0,2:No,-2,6,5,1,F3.01,26,,0,,,,,,,,,,,,,,,,,,,,,,,4,16.99 07.04 07.06 14.08,16.00-16.99= Gastrointestinals,Omeprazole,07.00-07.99= Antithrombotics,,07.00-07.99= Antithrombotics,,14.00-14.99= Diuretics,-2,.,,.,,.,,.,,.,,.,,.,,.,,.,,.,,.,,1:Yes,0.67,100,2:No,-2.00,-2,1:Yes,0.67,260,2:No,-2.00,-2,241.2,Tube Feed Group,84,1:Room Air,,,,,,,,,,,,,,,,,,,,,,,,,,,,,,,,,,,,,,,,,,,,,,,,,,,,,,,,,,,,,,,,,,,,,,,,,
511,44,0,26,,,,,,,,,176,48,1:Yes,12,15,10,0,,,,2,99 99,CLIP PUT ON BT SHUNT | CLIP REMOVED FROM SHUNT,99:Other cardiac surgical procedure,CLIP PUT ON BT SHUNT,99:Other cardiac surgical procedure,CLIP REMOVED FROM SHUNT,,,,,,,,,,,,,,,,,2,14.08 07.02,14.00-14.99= Diuretics,,07.00-07.99= Antithrombotics,-2,.,,.,,.,,.,,.,,.,,.,,.,,.,,.,,.,,.,,.,,2:No,-2.00,-2,2:No,-2.00,-2,1:Yes,0.94,384,2:No,-2.00,-2,360.96,Tube Feed Group,85,1:Room Air,5,C9999 C9999 C9999 C9999 C9999,"CLIP PUT ON SHUNT, CHEST OPENED | CARDIAC CATHETERIZATION | CLIP REMOVED FROM SHUNT, CHEST OPENED | BRONCHOSCOPY | LEFT VOCAL CORD PARESIS",C-9999= Other significant complication,"CLIP PUT ON SHUNT, CHEST OPENED",7,C-9999= Other significant complication,CARDIAC CATHETERIZATION,7,C-9999= Other significant complication,"CLIP REMOVED FROM SHUNT, CHEST OPENED",11,C-9999= Other significant complication,BRONCHOSCOPY,19,C-9999= Other significant complication,LEFT VOCAL CORD PARESIS,19,,,,,,,,,,,,,,,,,,,,,,,,,,,,,,,,,,,,,,,,,,,,,,,,,,,,,,,2:No
91,18,3,17,,,,,,,,,163,74,1:Yes,51,9,8,0,,,,1,1,,01:Chest closure,-2,,,,,,,,,,,,,,,,,,,2,07.02 14.08,07.00-07.99= Antithrombotics,,14.00-14.99= Diuretics,-2,.,,.,,.,,.,,.,,.,,.,,.,,.,,.,,.,,.,,.,,2:No,-2.00,-2,2:No,-2.00,-2,2:No,-2.00,-2,1:Yes,0.73,264,192.72,Tube Feed Group,86,1:Room Air,2,C1508 C0205,,C-1508= Pleural effusion,-2,9,C-0205= Chylothorax,-2,11,,,,,,,,,,,,,,,,,,,,,,,,,,,,,,,,,,,,,,,,,,,,,,,,,,,,,,,,,,,,,,,,2:No
134,20,1,18,,,,,,,,,149,51,1:Yes,28,6,5,0,,,,0,,,,,,,,,,,,,,,,,,,,,,,3,14.08 15.04 07.02,14.00-14.99= Diuretics,,15.00-15.99= Electrolytes,,07.00-07.99= Antithrombotics,-2,.,,.,,.,,.,,.,,.,,.,,.,,.,,.,,.,,.,,2:No,-2.00,-2,1:Yes,0.67,-8,2:No,-2.00,-2,2:No,-2.00,-2,,Breast Feed Group,73,1:Room Air,1,C9999,RIGHT TESTICULAR HERNIA,C-9999= Other significant complication,RIGHT TESTICULAR HERNIA,9,,,,,,,,,,,,,,,,,,,,,,,,,,,,,,,,,,,,,,,,,,,,,,,,,,,,,,,,,,,,,,,,,,,2:No
183,10,3,19,,,,,,,,,186,71,1:Yes,30,6,5,0,,,,1,1,,01:Chest closure,-2,,,,,,,,,,,,,,,,,,,3,14.08 07.02 17.02,14.00-14.99= Diuretics,,07.00-07.99= Antithrombotics,,17.00-17.99= Glycosides,-2,.,,.,,.,,.,,.,,.,,.,,.,,.,,.,,.,,.,,1:Yes,0.73,360,1:Yes,-8.00,-8,2:No,-2.00,-2,1:Yes,-8.00,-8,,Tube Feed Group,76,1:Room Air,1,C1501,,C-1501= Pericardial effusion,-2,13,,,,,,,,,,,,,,,,,,,,,,,,,,,,,,,,,,,,,,,,,,,,,,,,,,,,,,,,,,,,,,,,,,,2:No
983,53,3,47,,,,,,,,,261,67,1:Yes,31,14,8,1,F7.01.03,30,4MM STENT PLACE IN INOMINATE ARTERY,1,1,,01:Chest closure,-2,,,,,,,,,,,,,,,,,,,7,07.02 07.04 14.08 17.02 16.03 16.99 09.04,07.00-07.99= Antithrombotics,,07.00-07.99= Antithrombotics,,14.00-14.99= Diuretics,,17.00-17.99= Glycosides,,16.00-16.99= Gastrointestinals,,16.00-16.99= Gastrointestinals,PRILOSEC,09.00-09.99= Biologics,-2,.,,.,,.,,.,,.,,.,,.,,.,,2:No,-2.00,-2,2:No,-2.00,-2,1:Yes,1.00,460,2:No,-2.00,-2,460,Tube Feed Group,80,1:Room Air,8,C1508 C9999 C9999 C9999 C9999 C9999 C9999 C0201,"LEUKOCYTOSIS, ANC=18.4 | VOCAL CORD PARESIS | OCCASIONAL PVC'S | ASPIRATION | STENOTIC INNOMINATE ARTERY | G-J TUBE PLACED IN O.R.",C-1508= Pleural effusion,-2,9,C-9999= Other significant complication,"LEUKOCYTOSIS, ANC=18.4",10,C-9999= Other significant complication,VOCAL CORD PARESIS,14,C-9999= Other significant complication,OCCASIONAL PVC'S,30,C-9999= Other significant complication,ASPIRATION,22,C-9999= Other significant complication,STENOTIC INNOMINATE ARTERY,30,C-9999= Other significant complication,G-J TUBE PLACED IN O.R.,44,C-0201= Cardiopulmonary arrest,-2,44,,,,,,,,,,,,,,,,,,,,,,,,,,,,,,,,,,,,,,,,,,,,,,2:No
1203,15,0,15,,,,,,,,,162,93,1:Yes,62,5,4,0,,,,1,1,,01:Chest closure,-2,,,,,,,,,,,,,,,,,,,3,14.08 17.02 07.02,14.00-14.99= Diuretics,,17.00-17.99= Glycosides,,07.00-07.99= Antithrombotics,-2,.,,.,,.,,.,,.,,.,,.,,.,,.,,.,,.,,.,,1:Yes,0.73,540,1:Yes,-8.00,-8,2:No,-2.00,-2,2:No,-2.00,-2,,Bottle Feed Group,76,1:Room Air,0,,,,,,,,,,,,,,,,,,,,,,,,,,,,,,,,,,,,,,,,,,,,,,,,,,,,,,,,,,,,,,,,,,,,,,,,-2
118,21,0,21,,,,,,,,,132,76,1:Yes,60,10,6,0,,,,1,1,,01:Chest closure,-2,,,,,,,,,,,,,,,,,,,3,17.02 14.08 07.02,17.00-17.99= Glycosides,,14.00-14.99= Diuretics,,07.00-07.99= Antithrombotics,-2,.,,.,,.,,.,,.,,.,,.,,.,,.,,.,,.,,.,,1:Yes,0.80,329,2:No,-2.00,-2,2:No,-2.00,-2,2:No,-2.00,-2,263.2,Bottle Feed Group,74,1:Room Air,1,C0601,,C-0601= Gastrointestinal complication (includes necrotizing enterocolitis [NEC]),-2,12,,,,,,,,,,,,,,,,,,,,,,,,,,,,,,,,,,,,,,,,,,,,,,,,,,,,,,,,,,,,,,,,,,,2:No
808,17,4,17,,,,,,,,,134,51,1:Yes,51,6,4,0,,,,0,,,,,,,,,,,,,,,,,,,,,,,4,07.02 14.08 04.02 16.06,07.00-07.99= Antithrombotics,,14.00-14.99= Diuretics,,04.00-04.99= Anticonvulsants,,16.00-16.99= Gastrointestinals,-2,.,,.,,.,,.,,.,,.,,.,,.,,.,,.,,.,,1:Yes,0.80,480,2:No,-2.00,-2,2:No,-2.00,-2,2:No,-2.00,-2,384,Bottle Feed Group,85,1:Room Air,0,,,,,,,,,,,,,,,,,,,,,,,,,,,,,,,,,,,,,,,,,,,,,,,,,,,,,,,,,,,,,,,,,,,,,,,,-2
666,14,3,14,,,,,,,,,122,44,1:Yes,43,5,4,0,,,,1,1,,01:Chest closure,-2,,,,,,,,,,,,,,,,,,,2,14.08 07.02,14.00-14.99= Diuretics,,07.00-07.99= Antithrombotics,-2,.,,.,,.,,.,,.,,.,,.,,.,,.,,.,,.,,.,,.,,2:No,-2.00,-2,1:Yes,0.67,-8,2:No,-2.00,-2,2:No,-2.00,-2,,Breast Feed Group,84,1:Room Air,1,C0601,,C-0601= Gastrointestinal complication (includes necrotizing enterocolitis [NEC]),-2,10,,,,,,,,,,,,,,,,,,,,,,,,,,,,,,,,,,,,,,,,,,,,,,,,,,,,,,,,,,,,,,,,,,,2:No
1002,16,6,16,,,,,,,,,45,9,1:Yes,8,4,3,0,,,,0,,,,,,,,,,,,,,,,,,,,,,,1,14.08,14.00-14.99= Diuretics,-2,.,,.,,.,,.,,.,,.,,.,,.,,.,,.,,.,,.,,.,,.,,2:No,-2.00,-2,1:Yes,0.67,-8,2:No,-2.00,-2,2:No,-2.00,-2,,Breast Feed Group,76,1:Room Air,1,C9999,junctional bradycardia,C-9999= Other significant complication,junctional bradycardia,13,,,,,,,,,,,,,,,,,,,,,,,,,,,,,,,,,,,,,,,,,,,,,,,,,,,,,,,,,,,,,,,,,,,2:No
711,34,0,29,,,,,,,,,75,15,1:Yes,15,14,9,1,F3.01,0,,0,,,,,,,,,,,,,,,,,,,,,,,4,17.02 07.02 16.06 14.08,17.00-17.99= Glycosides,,07.00-07.99= Antithrombotics,,16.00-16.99= Gastrointestinals,,14.00-14.99= Diuretics,-2,.,,.,,.,,.,,.,,.,,.,,.,,.,,.,,.,,1:Yes,0.90,480,2:No,-2.00,-2,2:No,-2.00,-2,2:No,-2.00,-2,432,Bottle Feed Group,-8,1:Room Air,3,C9999 C0601 C9999,occassional PVC's | critically high potassium,C-9999= Other significant complication,occassional PVC's,9,C-0601= Gastrointestinal complication (includes necrotizing enterocolitis [NEC]),-2,23,C-9999= Other significant complication,critically high potassium,27,,,,,,,,,,,,,,,,,,,,,,,,,,,,,,,,,,,,,,,,,,,,,,,,,,,,,,,,,,,,,2:No
61,22,5,22,,,,,,,,,120,45,1:Yes,45,11,9,0,,,,1,1,,01:Chest closure,-2,,,,,,,,,,,,,,,,,,,2,14.08 07.02,14.00-14.99= Diuretics,,07.00-07.99= Antithrombotics,-2,.,,.,,.,,.,,.,,.,,.,,.,,.,,.,,.,,.,,.,,1:Yes,0.87,90,1:Yes,0.67,-8,2:No,-2.00,-2,2:No,-2.00,-2,,Bottle Feed Group,77,1:Room Air,2,C2105 C9999,ATELECTASIS,C-2105= Ventricular tachycardia,-2,20,C-9999= Other significant complication,ATELECTASIS,18,,,,,,,,,,,,,,,,,,,,,,,,,,,,,,,,,,,,,,,,,,,,,,,,,,,,,,,,,,,,,,,,2:No
259,29,0,29,,,,,,,,,146,54,1:Yes,54,14,8,0,,,,1,99,"CHEST RE-OPENED, CLOST REMOVED & CLOSED ON XX/XX/XX",99:Other cardiac surgical procedure,"CHEST RE-OPENED, CLOST REMOVED & CLOSED ON XX/XX/X",,,,,,,,,,,,,,,,,,,5,14.08 17.02 07.02 99.99 03.05,14.00-14.99= Diuretics,,17.00-17.99= Glycosides,,07.00-07.99= Antithrombotics,,99.99= Unclassified,ACTIGAU,03.00-03.99= Antibiotics,-2,.,,.,,.,,.,,.,,.,,.,,.,,.,,.,,1:Yes,0.86,298,2:No,-2.00,-2,2:No,-2.00,-2,2:No,-2.00,-2,256.28,Bottle Feed Group,88,1:Room Air,2,C0601 C9999,GALLBLADDER SLUDGE,C-0601= Gastrointestinal complication (includes necrotizing enterocolitis [NEC]),-2,4,C-9999= Other significant complication,GALLBLADDER SLUDGE,23,,,,,,,,,,,,,,,,,,,,,,,,,,,,,,,,,,,,,,,,,,,,,,,,,,,,,,,,,,,,,,,,2:No
128,27,0,26,,,,,,,,,146,56,1:Yes,56,12,10,0,,,,0,,,,,,,,,,,,,,,,,,,,,,,4,14.08 07.02 16.06 09.99,14.00-14.99= Diuretics,,07.00-07.99= Antithrombotics,,16.00-16.99= Gastrointestinals,,09.00-09.99= Biologics,SYNAGIS,.,,.,,.,,.,,.,,.,,.,,.,,.,,.,,.,,1:Yes,0.90,365,2:No,-2.00,-2,2:No,-2.00,-2,2:No,-2.00,-2,328.5,Bottle Feed Group,88,1:Room Air,2,C2102 C9999,CHEST RE-OPENED FOR EXPLORATION,C-2102= Ventricular arrhythmia,-2,23,C-9999= Other significant complication,CHEST RE-OPENED FOR EXPLORATION,6,,,,,,,,,,,,,,,,,,,,,,,,,,,,,,,,,,,,,,,,,,,,,,,,,,,,,,,,,,,,,,,,2:No
529,60,0,60,1,1,,,-2,-2,,,111,43,1:Yes,41,15,11,0,,,,2,99 1,"CHEST OPENED, CPR PERFORMED",99:Other cardiac surgical procedure,"CHEST OPENED, CPR PERFORMED",01:Chest closure,-2,,,,,,,,,,,,,,,,,6,04.02 03.04 07.02 14.08 17.02 13.02,04.00-04.99= Anticonvulsants,,03.00-03.99= Antibiotics,,07.00-07.99= Antithrombotics,,14.00-14.99= Diuretics,,17.00-17.99= Glycosides,,13.00-13.99= Converting Enzyme Inhibitors,-2,.,,.,,.,,.,,.,,.,,.,,.,,.,,2:No,-2.00,-2,2:No,-2.00,-2,2:No,-2.00,-2,1:Yes,0.93,360,334.8,Tube Feed Group,88,1:Room Air,,,,,,,,,,,,,,,,,,,,,,,,,,,,,,,,,,,,,,,,,,,,,,,,,,,,,,,,,,,,,,,,,,,,,,,,,
1242,30,0,26,1,1,,,-2,-2,,,150,80,1:Yes,48,12,8,0,,,,0,,,,,,,,,,,,,,,,,,,,,,,4,07.02 17.02 14.08 09.99,07.00-07.99= Antithrombotics,,17.00-17.99= Glycosides,,14.00-14.99= Diuretics,,09.00-09.99= Biologics,SYNAGIS,.,,.,,.,,.,,.,,.,,.,,.,,.,,.,,.,,1:Yes,1.00,308,1:Yes,-8.00,-8,2:No,-2.00,-2,2:No,-2.00,-2,,Bottle Feed Group,85,1:Room Air,,,,,,,,,,,,,,,,,,,,,,,,,,,,,,,,,,,,,,,,,,,,,,,,,,,,,,,,,,,,,,,,,,,,,,,,,
911,13,0,12,1,1,,,-2,-2,,,48,0,2:No,-2,8,6,0,,,,0,,,,,,,,,,,,,,,,,,,,,,,3,03.04 07.02 14.08,03.00-03.99= Antibiotics,,07.00-07.99= Antithrombotics,,14.00-14.99= Diuretics,-2,.,,.,,.,,.,,.,,.,,.,,.,,.,,.,,.,,.,,1:Yes,0.80,330,2:No,-2.00,-2,2:No,-2.00,-2,2:No,-2.00,-2,264,Bottle Feed Group,83,1:Room Air,,,,,,,,,,,,,,,,,,,,,,,,,,,,,,,,,,,,,,,,,,,,,,,,,,,,,,,,,,,,,,,,,,,,,,,,,
1019,37,0,19,1,1,,,-2,-2,,,176,106,1:Yes,50,7,5,0,,,,0,,,,,,,,,,,,,,,,,,,,,,,2,14.08 07.02,14.00-14.99= Diuretics,,07.00-07.99= Antithrombotics,-2,.,,.,,.,,.,,.,,.,,.,,.,,.,,.,,.,,.,,.,,1:Yes,0.87,320,2:No,-2.00,-2,2:No,-2.00,-2,2:No,-2.00,-2,278.4,Bottle Feed Group,81,1:Room Air,,,,,,,,,,,,,,,,,,,,,,,,,,,,,,,,,,,,,,,,,,,,,,,,,,,,,,,,,,,,,,,,,,,,,,,,,
755,39,0,33,1,1,,,-2,-2,,,199,101,1:Yes,49,17,8,0,,,,3,1 13 13,,01:Chest closure,,13:Thoracostomy tube,,13:Thoracostomy tube,-2,,,,,,,,,,,,,,,4,14.08 07.02 03.16 99.99,14.00-14.99= Diuretics,,07.00-07.99= Antithrombotics,,03.00-03.99= Antibiotics,,99.99= Unclassified,NYSTATIN ORAL SUSPENSION,.,,.,,.,,.,,.,,.,,.,,.,,.,,.,,.,,1:Yes,0.87,304,2:No,-2.00,-2,2:No,-2.00,-2,2:No,-2.00,-2,264.48,Bottle Feed Group,75,1:Room Air,,,,,,,,,,,,,,,,,,,,,,,,,,,,,,,,,,,,,,,,,,,,,,,,,,,,,,,,,,,,,,,,,,,,,,,,,
981,52,0,52,1,1,,,-2,-2,,,104,53,1:Yes,29,24,8,0,,,,1,1,,01:Chest closure,-2,,,,,,,,,,,,,,,,,,,5,14.08 07.02 16.99 16.03 03.02,14.00-14.99= Diuretics,,07.00-07.99= Antithrombotics,,16.00-16.99= Gastrointestinals,PRILOSEC,16.00-16.99= Gastrointestinals,,03.00-03.99= Antibiotics,-2,.,,.,,.,,.,,.,,.,,.,,.,,.,,.,,1:Yes,1.00,292,2:No,-2.00,-2,1:Yes,1.00,71,2:No,-2.00,-2,363,Tube Feed Group,89,1:Room Air,,,,,,,,,,,,,,,,,,,,,,,,,,,,,,,,,,,,,,,,,,,,,,,,,,,,,,,,,,,,,,,,,,,,,,,,,