blind_id,rx_age,WT_RX,DOSERX,DOSEADM,VOLPDOSE,rxdisp_age,RXDAYS,VOLDISP,start_age,stop_age,resid_age,RESIDVOL,BOTLPROB
1023,26,3.7,0.200,0.70,0.70,27,30,52.0,34,64,93,0.3,3:No Problem
1023,54,4.6,0.400,0.90,0.90,54,60,120.0,64,82,,-9.0,-9
586,33,4.0,0.200,0.80,0.80,33,37,60.0,35,67,69,0.7,3:No Problem
586,50,4.4,0.205,0.90,0.90,51,67,120.0,68,92,93,70.1,3:No Problem
586,90,5.0,0.200,1.20,1.20,92,6,160.0,92,148,149,5.8,3:No Problem
586,140,7.1,0.200,1.40,1.40,140,67,190.0,149,166,181,134.0,3:No Problem
586,173,7.9,0.200,1.60,1.60,173,67,215.0,173,216,217,70.0,3:No Problem
586,210,9.0,0.200,1.80,1.80,212,67,240.0,216,276,313,6.0,3:No Problem
586,271,9.6,0.200,1.90,1.90,272,67,255.0,276,335,358,0.9,3:No Problem
586,315,10.0,0.200,2.00,2.00,316,67,270.0,335,396,428,0.0,3:No Problem
586,377,11.6,0.200,2.30,2.30,377,67,310.0,396,454,457,32.0,3:No Problem
427,22,4.0,0.200,0.80,0.80,22,37,60.0,22,41,50,24.0,3:No Problem
427,44,4.0,0.200,1.00,1.00,44,67,135.0,45,91,93,32.0,3:No Problem
427,85,5.8,0.200,1.20,1.20,90,67,160.0,91,134,141,52.6,3:No Problem
427,139,6.9,0.200,1.40,1.40,139,67,190.0,141,190,211,35.0,3:No Problem
427,189,7.7,0.200,1.50,1.50,189,67,200.0,191,233,247,55.0,3:No Problem
427,231,8.3,0.200,1.70,1.70,231,67,230.0,234,287,290,34.0,3:No Problem
427,280,8.9,0.200,1.80,1.80,280,67,250.0,287,345,346,104.0,3:No Problem
427,345,9.8,0.200,2.00,2.00,345,67,270.0,345,400,401,35.5,3:No Problem
522,28,3.8,0.200,0.80,0.80,28,30,60.0,28,42,49,37.3,3:No Problem
485,24,3.3,0.200,0.70,0.70,24,37,52.0,24,24,32,50.0,3:No Problem
232,20,3.8,0.200,0.80,0.80,20,37,60.0,20,43,50,18.5,3:No Problem
232,43,4.3,0.200,0.90,0.90,43,37,70.0,43,69,70,19.0,3:No Problem
232,69,4.8,0.200,1.00,1.00,69,67,135.0,69,86,89,94.0,3:No Problem
76,30,3.2,0.200,0.65,0.65,30,37,85.0,30,72,121,6.4,3:No Problem
76,71,4.3,0.200,0.90,0.90,71,67,120.0,72,124,149,5.2,3:No Problem
76,121,5.3,0.200,1.10,1.10,121,67,150.0,124,169,169,53.0,3:No Problem
76,162,5.9,0.200,1.20,1.20,169,21,50.0,169,180,187,19.5,3:No Problem
76,188,6.7,0.200,1.30,1.30,188,67,175.0,188,246,267,2.4,3:No Problem
76,237,7.0,0.200,1.40,1.40,240,67,190.0,246,306,322,0.4,3:No Problem
76,306,7.4,0.200,1.50,1.50,306,67,200.0,306,360,383,-9.0,1:Bottle Broken
76,357,7.9,0.200,1.60,1.60,358,67,215.0,360,415,418,28.0,3:No Problem
34,19,2.8,0.200,0.60,0.60,19,67,80.0,22,48,48,24.0,2:Bottle Leaked
34,48,3.3,0.200,0.70,0.70,48,67,95.0,48,105,112,2.0,3:No Problem
34,103,4.3,0.200,0.90,0.90,103,67,120.0,105,138,236,77.0,3:No Problem
34,151,5.3,0.200,1.10,1.10,151,67,150.0,154,204,242,33.6,3:No Problem
34,200,6.0,0.200,1.20,1.20,203,67,160.0,204,265,300,24.6,3:No Problem
34,262,7.2,0.200,1.40,1.40,264,67,190.0,265,325,,0.0,-9
34,320,8.5,0.200,1.70,1.70,321,67,230.0,325,382,399,25.5,3:No Problem
34,374,9.4,0.200,1.90,1.90,376,67,255.0,382,419,451,105.2,3:No Problem
34,416,10.0,0.200,2.00,2.00,418,37,150.0,419,448,451,30.0,3:No Problem
785,14,3.9,0.200,0.80,0.80,14,67,110.0,15,23,34,94.0,3:No Problem
785,64,4.9,0.200,1.00,1.00,64,67,135.0,,,65,135.0,3:No Problem
1047,32,4.4,0.200,0.90,0.90,32,67,120.0,35,85,91,1.0,3:No Problem
1047,59,5.6,0.200,1.10,1.10,64,67,150.0,85,132,154,-9.0,3:No Problem
1047,121,6.9,0.200,1.40,1.40,122,67,190.0,133,176,176,49.0,3:No Problem
1047,171,8.1,0.200,1.60,1.60,172,37,120.0,176,205,217,22.0,3:No Problem
1047,203,8.0,0.200,1.60,1.60,204,67,220.0,205,239,256,104.0,3:No Problem
1047,242,8.9,0.200,1.80,1.80,242,67,245.0,242,297,312,40.0,3:No Problem
1047,295,9.8,0.200,2.00,2.00,295,67,270.0,298,362,394,1.6,3:No Problem
1047,347,10.4,0.200,2.10,2.10,350,67,280.0,362,423,455,39.0,3:No Problem
1240,27,3.3,0.200,0.70,0.70,27,67,95.0,28,76,96,0.0,2:Bottle Leaked
1240,74,4.4,0.200,0.90,0.90,74,67,120.0,76,110,112,44.0,3:No Problem
1240,109,5.9,0.200,1.20,1.20,110,37,90.0,111,140,147,23.0,3:No Problem
1240,138,6.5,0.200,1.30,1.30,139,37,100.0,141,171,196,19.5,3:No Problem
1240,165,6.4,0.200,1.30,1.30,166,37,100.0,171,202,213,24.5,3:No Problem
1240,195,7.5,0.200,1.50,1.50,202,37,110.0,203,234,252,16.0,2:Bottle Leaked
1240,318,8.3,0.200,1.70,1.70,319,67,230.0,321,386,395,0.6,3:No Problem
1240,376,9.3,0.200,1.90,1.90,377,47,180.0,386,434,462,1.2,3:No Problem
1240,417,9.5,0.200,1.90,1.90,423,37,140.0,435,446,462,48.0,3:No Problem
1240,227,7.5,0.200,1.50,1.50,228,67,200.0,234,262,,-9.0,1:Bottle Broken
1240,263,8.1,0.200,1.60,1.60,263,67,220.0,,,395,0.0,1:Bottle Broken
351,27,2.6,0.200,0.50,0.50,28,37,40.0,,,,-9.0,-9
351,48,2.9,0.200,0.60,0.60,49,37,45.0,,,,-9.0,-9
938,20,3.6,0.200,0.70,0.70,20,37,55.0,21,61,64,0.9,3:No Problem
938,49,4.4,0.200,0.90,0.90,50,37,70.0,61,83,92,22.0,3:No Problem
938,86,5.2,0.200,1.00,1.00,86,37,75.0,86,109,163,22.5,3:No Problem
938,146,6.9,0.200,1.40,1.40,146,37,105.0,146,174,174,29.0,3:No Problem
938,196,8.0,0.200,1.60,1.60,198,67,215.0,203,258,267,4.4,3:No Problem
938,168,6.9,0.200,1.40,1.40,170,37,105.0,175,202,219,15.0,3:No Problem
938,251,9.8,0.200,2.00,2.00,251,67,270.0,,,316,0.0,1:Bottle Broken
938,308,11.2,0.200,2.20,2.20,308,67,300.0,310,371,385,6.4,3:No Problem
938,369,11.2,0.200,2.20,2.20,369,57,250.0,372,419,428,32.0,3:No Problem
29,31,3.4,0.200,0.68,0.68,31,37,50.0,35,57,71,16.5,3:No Problem
29,56,4.1,0.200,0.80,0.80,56,37,60.0,57,79,91,22.5,3:No Problem
29,76,5.1,0.200,1.00,1.00,78,37,75.0,,114,139,0.3,3:No Problem
29,113,6.3,0.200,1.30,1.30,113,37,97.0,114,146,163,7.0,3:No Problem
29,-954,7.3,0.200,1.50,1.50,141,37,111.0,146,175,177,23.0,3:No Problem
29,189,8.2,0.200,1.70,1.70,189,37,130.0,189,224,279,74.0,3:No Problem
29,218,8.6,0.200,1.70,1.70,223,67,230.0,225,275,294,115.0,3:No Problem
29,272,10.0,0.200,2.00,2.00,272,67,270.0,273,343,352,65.0,3:No Problem
29,342,10.7,0.200,2.10,2.10,342,64,270.0,343,397,447,95.0,3:No Problem
1190,31,4.0,0.100,0.40,0.40,31,37,30.0,31,52,86,13.0,3:No Problem
1190,52,4.5,0.200,0.90,0.90,52,67,67.0,52,73,79,29.0,3:No Problem
1190,73,5.0,0.200,1.00,1.00,73,37,74.0,73,96,100,26.0,3:No Problem
1190,95,5.0,0.200,1.00,1.00,96,37,75.0,96,122,131,8.0,3:No Problem
1190,121,6.4,0.200,1.30,1.30,121,37,100.0,122,158,166,7.7,3:No Problem
1190,156,6.9,0.200,1.40,1.40,157,37,105.0,158,187,188,26.2,3:No Problem
1190,186,6.9,0.200,1.40,1.40,186,17,50.0,187,192,240,35.0,3:No Problem
1190,201,7.5,0.200,1.50,1.50,201,67,200.0,201,265,285,20.0,3:No Problem
1190,256,7.5,0.200,1.50,1.50,257,67,200.0,265,335,346,12.0,3:No Problem
1190,333,8.2,0.200,1.60,1.60,334,67,215.0,335,384,408,90.0,3:No Problem
1190,380,9.0,0.200,1.80,1.80,383,67,245.0,385,451,474,28.0,3:No Problem
1190,451,10.2,0.200,2.00,2.00,451,67,270.0,452,468,468,195.0,3:No Problem
412,22,3.5,0.200,0.70,0.70,22,37,52.0,22,41,66,23.5,3:No Problem
511,43,3.9,0.050,0.20,0.20,43,14,10.0,43,49,50,4.0,-9
511,49,4.2,0.100,0.42,0.40,49,90,72.0,49,95,96,25.0,-9
511,96,5.5,0.100,0.55,0.60,96,60,72.0,96,123,124,20.0,-9
511,124,6.3,0.100,0.60,0.60,124,60,80.0,124,152,153,40.0,-9
511,153,6.8,0.100,0.70,0.70,153,60,100.0,153,182,183,53.0,-9
511,184,7.2,0.100,0.70,0.70,184,60,100.0,188,216,294,4.0,-9
511,266,8.7,0.200,1.70,1.70,267,30,130.0,273,,294,71.0,-9
511,226,8.4,0.200,1.70,1.70,226,60,150.0,,,,27.0,-9
511,216,7.0,0.200,1.40,1.40,216,17,50.0,217,272,294,12.0,-9
511,285,9.1,0.200,1.80,1.80,285,60,250.0,285,353,362,6.0,-9
511,331,9.9,0.200,2.00,2.00,334,60,260.0,354,406,434,6.0,-9
511,401,9.5,0.200,1.90,1.90,404,60,260.0,406,,464,83.0,-9
91,15,2.3,0.050,0.11,0.10,15,90,20.0,15,19,,-9.0,-9
91,19,2.3,0.200,0.45,0.45,19,90,90.0,19,81,153,3.0,-9
91,81,3.3,0.200,0.70,0.70,81,90,140.0,82,153,154,90.0,-9
91,153,5.1,0.200,1.00,1.00,153,90,200.0,158,252,,-9.0,-9
91,249,7.3,0.200,1.50,1.50,249,90,300.0,253,393,,-9.0,-9
91,391,9.1,0.200,1.80,1.80,391,90,360.0,393,445,,-9.0,-9
134,13,2.5,0.050,0.13,0.13,13,60,16.0,13,26,169,8.0,-9
134,25,2.5,0.200,0.50,0.50,25,80,80.0,26,58,60,40.0,-9
134,57,4.2,0.200,0.80,0.80,57,60,120.0,58,76,84,80.0,-9
134,75,4.9,0.200,1.00,1.00,75,60,140.0,76,111,118,55.0,-9
134,111,5.5,0.200,1.10,1.10,111,60,160.0,112,144,169,92.0,-9
134,148,6.1,0.200,1.20,1.20,148,60,180.0,,,,-9.0,-9
134,151,6.1,0.200,1.20,1.20,151,-9,20.0,151,183,190,-9.0,-9
134,153,6.1,0.200,1.20,1.20,153,60,160.0,154,173,230,83.0,-9
134,180,6.4,0.200,1.30,1.30,180,60,180.0,182,195,230,159.0,-9
134,196,6.4,0.200,1.30,1.30,196,60,200.0,197,270,299,120.0,-9
183,10,3.7,0.050,0.19,0.19,10,90,50.0,10,52,153,0.0,-9
183,26,3.7,0.100,0.37,0.37,26,90,30.0,26,124,153,-9.0,-9
183,59,4.6,0.100,0.50,0.50,59,60,80.0,60,124,153,6.0,-9
183,59,5.9,0.100,0.60,0.60,123,90,120.0,,202,214,0.0,-9
183,192,7.3,0.100,0.70,0.70,193,90,140.0,194,270,289,0.0,-9
183,255,7.5,0.100,0.80,0.80,255,90,160.0,,346,356,0.0,-9
183,340,8.9,0.100,0.90,0.90,340,90,200.0,,436,454,64.0,-9
1203,12,3.0,0.050,0.15,0.15,12,90,40.0,12,39,41,16.0,3:No Problem
118,18,2.2,0.050,0.10,0.10,18,60,20.0,18,30,39,8.0,3:No Problem
118,31,2.5,0.100,0.25,0.30,31,60,50.0,,,,-9.0,-9
118,80,4.0,0.100,0.40,0.40,80,60,60.0,,,,-9.0,-9
118,122,4.9,0.100,0.50,0.50,123,60,80.0,124,151,151,45.0,3:No Problem
808,14,3.9,0.050,0.20,0.20,14,90,30.0,14,22,41,9.0,3:No Problem
808,21,3.9,0.200,0.80,0.80,21,90,160.0,22,39,,-9.0,-9
666,12,2.8,0.050,0.10,0.10,12,60,80.0,12,67,74,13.0,-9
666,67,4.3,0.150,0.70,0.70,67,60,100.0,68,117,145,19.0,-9
666,117,5.8,0.150,0.90,0.90,117,60,120.0,118,174,195,10.0,-9
666,174,6.5,0.150,1.00,1.00,174,60,140.0,175,221,245,37.0,-9
666,221,6.5,0.150,1.00,1.00,221,60,140.0,222,279,346,6.0,-9
1002,15,3.3,0.050,0.20,0.20,15,90,50.0,16,89,96,0.0,3:No Problem
1002,85,4.5,0.100,0.50,0.50,85,90,100.0,90,168,180,1.0,3:No Problem
1002,162,5.7,0.100,0.57,0.60,162,60,80.0,182,242,268,25.0,3:No Problem
1002,226,7.1,0.100,0.70,0.70,226,60,100.0,228,273,318,2.0,-9
1002,267,7.5,0.150,1.10,1.10,268,60,160.0,274,335,382,0.0,3:No Problem
1002,339,8.2,0.150,1.20,1.20,339,60,160.0,340,397,,-9.0,-9
1002,396,9.0,0.150,1.40,1.40,396,60,200.0,397,,,-9.0,-9
61,17,2.9,0.050,0.10,0.10,17,60,60.0,18,53,85,0.0,-9
61,41,3.3,0.200,0.70,0.70,41,60,100.0,53,106,113,9.0,-9
61,106,4.5,0.200,0.90,0.90,106,60,120.0,107,,185,25.0,-9
259,17,2.5,0.050,0.10,0.10,17,60,80.0,17,78,100,4.0,-9
259,74,4.0,0.200,0.80,0.80,74,60,120.0,76,121,150,18.0,-9
259,130,5.1,0.200,1.00,1.00,130,60,150.0,,,,-9.0,-9
259,191,6.6,0.200,1.30,1.30,191,90,250.0,192,263,301,66.0,-9
128,23,3.0,0.050,0.20,0.20,23,60,80.0,,,,-9.0,-9
128,100,4.4,0.050,0.20,0.20,100,60,40.0,,,,-9.0,-9
529,21,2.7,0.050,0.10,0.10,21,60,60.0,21,41,,-9.0,-9
1242,23,2.7,0.050,0.10,0.10,23,60,60.0,24,86,184,0.0,-9
1242,84,3.3,0.050,0.20,0.20,85,60,40.0,87,137,184,0.0,-9
1242,135,3.3,0.050,0.20,0.20,135,60,40.0,138,178,203,0.0,-9
1242,177,4.8,0.050,0.20,0.20,177,60,40.0,178,233,248,0.0,-9
1242,228,5.5,0.050,0.30,0.30,228,60,50.0,233,233,248,50.0,-9
911,11,2.6,0.050,0.10,0.10,11,60,20.0,11,17,25,19.0,3:No Problem
1019,18,3.1,0.050,0.15,0.15,18,60,20.0,18,67,100,7.0,3:No Problem
1019,65,4.3,0.050,0.20,0.20,66,60,30.0,67,95,108,15.0,3:No Problem
755,118,3.8,0.050,0.20,0.20,118,60,30.0,123,144,175,19.0,3:No Problem
780,30,2.8,0.100,0.30,0.30,31,67,30.0,31,66,106,0.0,2:Bottle Leaked
780,44,3.2,0.100,0.30,0.30,44,67,40.0,67,106,,-9.0,-9
780,106,4.4,0.100,0.40,0.40,106,67,50.0,107,137,169,37.0,3:No Problem
400,27,2.8,0.200,0.55,0.55,27,67,80.0,27,64,91,7.0,3:No Problem
400,64,3.6,0.200,0.70,0.70,64,67,90.0,65,113,119,10.0,3:No Problem
400,112,5.0,0.200,1.00,1.00,113,60,120.0,119,130,155,80.0,3:No Problem
400,147,5.5,0.200,1.10,1.10,147,60,150.0,149,210,234,0.5,3:No Problem
400,210,6.0,0.200,1.20,1.20,210,67,150.0,211,275,289,27.0,3:No Problem
1092,62,4.4,0.045,0.20,0.20,62,60,30.0,,,,-9.0,-9
1092,92,4.4,0.045,0.20,0.20,92,60,30.0,93,116,151,15.0,3:No Problem
1092,117,5.9,0.045,0.25,0.25,117,60,35.0,124,138,151,0.0,3:No Problem
1092,138,6.2,0.150,0.90,0.90,138,60,120.0,139,190,208,0.0,3:No Problem
1092,189,7.3,0.150,1.10,1.10,189,60,150.0,190,238,252,15.0,3:No Problem
1092,238,7.8,0.150,1.20,1.20,239,60,150.0,240,280,329,11.0,3:No Problem
1092,280,8.4,0.150,1.20,1.20,280,60,150.0,281,327,,-9.0,-9
1092,327,8.6,0.150,1.30,1.30,327,60,160.0,328,364,392,3.0,3:No Problem
1092,362,8.9,0.150,1.30,1.30,364,60,160.0,365,405,447,0.0,3:No Problem
1092,405,8.9,0.150,1.30,1.30,405,20,70.0,406,413,447,54.0,3:No Problem
628,17,3.5,0.050,0.18,0.18,17,60,90.0,18,30,98,90.0,3:No Problem
958,15,3.8,0.200,0.80,0.80,15,60,120.0,17,73,74,30.0,3:No Problem
958,74,5.5,0.200,1.10,1.10,74,60,150.0,75,118,137,32.0,3:No Problem
958,117,6.5,0.200,1.30,1.30,117,60,160.0,117,173,314,12.0,3:No Problem
94,17,2.5,0.050,0.13,0.13,17,60,40.0,18,81,264,1.0,3:No Problem
94,80,3.6,0.100,0.35,0.35,80,60,50.0,81,125,264,7.0,3:No Problem
94,125,4.7,0.100,0.50,0.50,125,60,80.0,125,,,-9.0,-9
94,171,5.6,0.150,0.80,0.80,171,60,100.0,172,191,,-9.0,-9
94,220,6.8,0.150,1.00,1.00,220,60,120.0,221,270,,-9.0,-9
94,269,7.6,0.150,1.10,1.10,269,60,140.0,269,327,332,0.0,3:No Problem
94,328,8.1,0.150,1.20,1.20,328,60,150.0,328,390,489,0.0,3:No Problem
94,389,9.3,0.150,1.40,1.40,389,21,70.0,390,419,,-9.0,-9
94,418,9.3,0.150,1.40,1.40,418,10,30.0,419,426,,-9.0,-9
389,22,2.5,0.050,0.12,0.12,22,60,30.0,24,67,142,3.0,3:No Problem
389,66,4.0,0.050,0.20,0.20,66,60,30.0,67,131,178,0.0,3:No Problem
389,109,4.7,0.050,0.24,0.24,109,60,30.0,131,162,178,0.0,3:No Problem
389,109,4.7,0.050,0.24,0.24,109,60,30.0,131,172,178,0.0,3:No Problem
389,183,5.6,0.050,0.28,0.28,187,60,40.0,187,240,287,0.0,3:No Problem
389,239,5.6,0.050,0.28,0.28,239,60,40.0,240,287,324,0.0,3:No Problem
389,283,7.2,0.050,0.36,0.36,283,60,50.0,288,336,374,0.0,3:No Problem
389,330,7.4,0.100,0.74,0.74,333,60,90.0,336,389,436,0.0,3:No Problem
389,379,7.7,0.100,0.77,0.77,379,60,100.0,389,436,436,20.0,3:No Problem
1244,24,3.1,0.200,0.60,0.60,24,14,30.0,25,35,37,16.0,-9
1244,91,4.1,0.200,0.80,0.80,91,10,120.0,94,,176,56.0,-9
1244,35,3.3,0.200,0.70,0.70,35,60,100.0,35,64,74,57.0,-9
1244,162,5.9,0.200,1.20,1.20,162,60,170.0,,,176,170.0,-9
1244,133,4.5,0.200,0.90,0.90,133,40,90.0,,,176,37.0,-9
868,23,2.6,0.200,0.50,0.50,23,10,20.0,26,30,44,15.0,-9
868,84,4.4,0.200,0.90,0.90,84,60,120.0,86,138,147,13.0,-9
868,30,2.8,0.200,0.60,0.60,30,60,90.0,30,92,92,15.0,-9
868,134,5.5,0.200,1.10,1.10,135,60,150.0,139,193,205,33.0,-9
868,195,5.7,0.200,1.10,1.10,198,50,150.0,195,261,,0.0,3:No Problem
868,261,6.9,0.200,1.40,1.40,261,60,180.0,261,307,554,0.0,3:No Problem
868,307,7.6,0.200,1.50,1.50,307,60,200.0,307,370,,0.0,3:No Problem
868,370,8.5,0.200,1.70,1.70,370,60,230.0,370,443,,0.0,3:No Problem
729,33,3.4,0.150,0.50,0.50,33,10,20.0,33,39,56,11.0,-9
729,40,3.7,0.200,0.70,0.70,40,60,100.0,40,93,125,21.0,-9
729,93,5.0,0.200,1.00,1.00,93,60,140.0,93,154,168,40.0,-9
729,154,6.1,0.200,1.20,1.20,154,60,160.0,154,210,,0.0,3:No Problem
729,210,7.3,0.200,1.50,1.50,210,60,210.0,210,301,,0.0,3:No Problem
729,301,8.6,0.200,1.70,1.70,301,60,240.0,301,364,533,0.0,3:No Problem
729,362,9.0,0.200,1.80,1.80,362,60,240.0,,,,-9.0,-9
729,364,9.9,0.200,2.00,2.00,364,60,240.0,364,421,,0.0,3:No Problem
1064,12,3.4,0.110,0.40,0.40,12,7,20.0,12,13,13,18.0,-9
1064,20,3.5,0.110,0.40,0.40,20,7,20.0,20,29,,0.0,-9
1064,29,3.8,0.200,0.80,0.80,29,60,110.0,29,82,,0.0,3:No Problem
1064,82,5.4,0.200,1.10,1.10,82,60,150.0,82,132,,0.0,3:No Problem
1064,132,6.8,0.200,1.40,1.40,132,60,200.0,132,195,82,10.0,3:No Problem
1064,195,7.6,0.200,1.50,1.50,195,60,200.0,195,253,447,9.0,3:No Problem
1064,253,8.2,0.200,1.60,1.60,253,67,200.0,253,300,447,3.0,3:No Problem
1064,300,9.3,0.200,1.90,1.90,300,60,260.0,300,349,447,9.0,3:No Problem
1064,348,9.9,0.200,2.00,2.00,349,67,260.0,349,407,447,99.0,3:No Problem
928,23,4.0,0.200,0.80,0.80,23,60,110.0,23,65,347,0.0,3:No Problem
928,65,4.3,0.150,0.60,0.60,65,60,100.0,65,106,436,70.0,3:No Problem
928,106,6.4,0.100,0.60,0.60,106,67,100.0,106,129,347,100.0,3:No Problem
928,128,6.5,0.150,1.00,1.00,129,67,140.0,129,166,436,0.0,3:No Problem
928,166,7.2,0.150,1.10,1.10,166,60,150.0,166,208,436,0.0,3:No Problem
928,204,8.2,0.200,1.60,1.60,204,60,240.0,208,267,436,1.0,3:No Problem
928,267,10.1,0.200,2.00,2.00,267,60,270.0,267,333,436,8.0,3:No Problem
928,334,10.1,0.200,2.00,2.00,334,60,270.0,334,407,436,25.0,3:No Problem
928,407,10.9,0.200,2.20,2.20,407,60,280.0,407,416,436,235.0,3:No Problem
366,19,4.0,0.100,0.40,0.40,20,30,30.0,20,32,460,0.0,3:No Problem
366,31,4.1,0.150,0.60,0.60,31,30,50.0,32,45,460,25.0,3:No Problem
366,51,4.4,0.200,0.90,0.90,51,60,130.0,60,102,,-9.0,-9
366,101,6.4,0.200,1.30,1.30,102,60,200.0,102,156,,-9.0,-9
366,156,7.1,0.200,1.40,1.40,160,60,200.0,165,-146,460,0.0,3:No Problem
366,200,7.8,0.200,1.50,1.50,200,60,210.0,221,276,460,3.0,3:No Problem
366,271,8.3,0.200,1.70,1.70,272,60,230.0,277,337,460,0.0,3:No Problem
366,327,8.5,0.200,1.70,1.70,327,60,240.0,328,404,,-9.0,-9
366,404,8.5,0.200,1.70,1.70,405,30,130.0,405,425,460,75.0,3:No Problem
109,13,3.6,0.050,0.20,0.20,13,60,30.0,13,,,-9.0,-9
109,158,6.9,0.200,1.40,1.40,158,60,200.0,162,,,-9.0,-9
109,217,8.2,0.200,1.60,1.60,217,60,200.0,217,,,-9.0,-9
109,300,8.2,0.200,1.60,1.60,301,60,220.0,302,,,-9.0,-9
109,311,8.2,0.200,1.60,1.60,311,30,100.0,312,,,-9.0,-9
597,48,2.9,0.100,0.30,0.30,48,60,50.0,51,82,,-9.0,-9
597,82,2.9,0.100,0.30,0.30,82,60,50.0,83,155,,-9.0,-9
597,155,4.3,0.100,0.40,0.40,155,60,60.0,156,172,,-9.0,-9
597,172,5.3,0.150,0.80,0.80,172,60,120.0,173,230,,-9.0,-9
597,230,6.6,0.200,1.30,1.30,230,60,180.0,231,291,,-9.0,-9
597,291,6.6,0.200,1.30,1.30,291,60,180.0,292,334,,-9.0,-9
597,334,6.6,0.200,1.30,1.30,335,60,180.0,335,406,,-9.0,-9
126,20,4.1,0.050,0.20,0.20,20,7,20.0,20,27,212,14.0,3:No Problem
126,367,10.9,0.200,2.20,2.20,371,67,300.0,371,461,475,280.0,3:No Problem
126,27,4.2,0.100,0.40,0.40,27,67,60.0,27,,,-9.0,-9
126,66,5.4,0.100,0.50,0.50,66,67,70.0,66,,,-9.0,-9
126,104,5.8,0.150,0.90,0.90,104,67,130.0,104,,,-9.0,-9
126,198,8.0,0.200,1.60,1.60,199,67,215.0,200,,,-9.0,-9
126,311,9.5,0.200,2.00,2.00,311,67,280.0,311,,,-9.0,-9
699,37,4.4,0.050,0.20,0.20,37,60,30.0,44,56,,-9.0,3:No Problem
699,56,5.3,0.150,0.80,0.80,56,67,110.0,56,93,,-9.0,3:No Problem
699,92,5.8,0.200,1.20,1.20,93,67,160.0,94,145,,-9.0,3:No Problem
699,145,8.6,0.200,1.70,1.70,146,67,240.0,146,192,,-9.0,3:No Problem
699,190,9.3,0.200,1.90,1.90,191,67,255.0,192,286,,-9.0,3:No Problem
699,287,10.9,0.200,2.20,2.20,287,67,300.0,287,362,,-9.0,3:No Problem
699,359,11.0,0.200,2.20,2.20,362,67,300.0,362,429,,-9.0,3:No Problem
699,428,11.5,0.200,2.30,2.30,429,67,320.0,429,457,,-9.0,3:No Problem
328,45,3.9,0.100,0.40,0.40,45,60,60.0,45,116,291,5.0,3:No Problem
328,116,5.5,0.100,0.50,0.50,116,67,70.0,116,-194,291,0.0,3:No Problem
328,187,6.3,0.200,1.30,1.30,187,67,180.0,190,,291,30.0,3:No Problem
328,266,7.0,0.200,1.40,1.40,266,67,200.0,267,359,467,3.0,3:No Problem
328,360,7.0,0.200,1.40,1.40,361,67,200.0,360,452,467,3.0,3:No Problem
941,37,3.1,0.050,0.10,0.10,37,67,30.0,41,99,206,0.0,3:No Problem
941,90,4.7,0.050,0.20,0.20,90,67,30.0,100,163,450,3.0,3:No Problem
941,161,6.1,0.100,0.60,0.60,161,67,80.0,161,209,450,0.0,3:No Problem
941,209,7.7,0.100,0.80,0.80,212,67,110.0,212,286,,-9.0,3:No Problem
941,286,7.7,0.100,0.80,0.80,287,67,110.0,287,367,450,75.0,3:No Problem
1058,57,3.0,0.050,0.10,0.10,57,67,20.0,62,74,,-9.0,3:No Problem
1058,75,3.5,0.150,0.50,0.50,75,67,70.0,75,110,,-9.0,3:No Problem
1058,111,3.5,0.150,0.50,0.50,111,67,70.0,111,160,,-9.0,3:No Problem
1058,161,5.1,0.150,0.80,0.80,161,67,110.0,161,231,,-9.0,3:No Problem
1058,230,6.4,0.150,1.00,1.00,232,67,140.0,232,322,385,70.0,3:No Problem
1058,314,7.3,0.150,1.10,1.10,314,67,80.0,314,405,385,70.0,3:No Problem
1058,355,7.3,0.150,1.10,1.10,355,67,150.0,355,529,,-9.0,3:No Problem
1058,530,7.3,0.150,1.10,1.10,530,67,140.0,530,547,,-9.0,3:No Problem
451,29,3.6,0.200,0.70,0.70,29,10,30.0,30,34,,-9.0,3:No Problem
451,35,3.6,0.200,0.70,0.70,35,67,100.0,35,83,,-9.0,3:No Problem
451,70,3.6,0.200,0.70,0.70,70,67,100.0,84,141,,-9.0,3:No Problem
451,141,5.0,0.200,1.00,1.00,141,67,140.0,142,188,,-9.0,3:No Problem
451,188,5.6,0.200,1.10,1.10,189,67,140.0,189,251,,-9.0,3:No Problem
451,238,6.8,0.200,1.40,1.40,248,67,190.0,252,334,,-9.0,3:No Problem
451,332,8.6,0.200,1.70,1.70,335,67,230.0,335,398,,-9.0,3:No Problem
451,399,9.1,0.200,1.80,1.80,399,67,240.0,399,464,,-9.0,3:No Problem
451,464,9.1,0.200,1.80,1.80,465,67,250.0,465,500,,-9.0,3:No Problem
1194,27,3.4,0.050,0.20,0.20,27,67,30.0,27,,,-9.0,-9
1194,161,7.5,0.200,1.50,1.50,161,67,200.0,161,,,-9.0,-9
1194,279,8.6,0.200,1.70,1.70,279,67,230.0,280,,,-9.0,-9
1194,336,8.3,0.200,1.70,1.70,336,67,230.0,,,434,85.0,3:No Problem
1194,330,8.3,0.200,1.70,1.70,331,67,230.0,336,,,-9.0,-9
1194,71,4.5,0.200,0.90,0.90,71,67,130.0,71,,,-9.0,-9
1194,42,3.7,0.150,0.60,0.60,43,67,45.0,43,,,-9.0,-9
1194,58,4.5,0.090,0.40,0.40,58,35,40.0,58,,,-9.0,-9
1194,211,7.9,0.200,1.60,1.60,211,67,200.0,211,,,-9.0,-9
842,16,3.6,0.100,0.40,0.40,16,60,60.0,17,49,,-9.0,3:No Problem
842,49,4.7,0.200,0.90,0.90,49,67,130.0,50,106,120,126.0,3:No Problem
842,106,6.4,0.200,1.30,1.30,106,67,180.0,107,183,,-9.0,3:No Problem
842,180,7.1,0.200,1.40,1.40,184,67,200.0,184,252,,-9.0,3:No Problem
842,252,8.0,0.200,1.60,1.60,252,67,215.0,253,277,,-9.0,3:No Problem
842,274,8.0,0.200,1.60,1.60,278,67,215.0,278,336,,-9.0,3:No Problem
842,336,8.7,0.200,1.70,1.70,336,67,230.0,337,411,,-9.0,3:No Problem
842,411,9.7,0.200,1.90,1.90,412,30,150.0,412,432,,-9.0,3:No Problem
842,432,9.7,0.200,1.90,1.90,433,30,150.0,433,462,,-9.0,3:No Problem
1084,8,3.1,0.050,0.20,0.20,8,67,30.0,11,21,,-9.0,-9
1084,21,3.4,0.150,0.50,0.50,22,67,70.0,22,58,,-9.0,-9
1084,58,4.7,0.200,0.90,0.90,58,67,130.0,59,117,463,30.0,3:No Problem
1084,117,6.0,0.200,1.20,1.20,117,67,180.0,118,172,463,15.0,3:No Problem
1084,170,8.2,0.200,1.60,1.60,173,67,220.0,173,300,463,0.0,3:No Problem
1084,300,9.0,0.200,1.80,1.80,300,67,240.0,301,40,463,0.0,3:No Problem
79,15,3.8,0.200,0.80,0.80,21,67,20.0,51,111,112,3.0,3:No Problem
79,112,5.2,0.200,1.00,1.00,112,67,140.0,112,166,,0.0,3:No Problem
79,188,5.4,0.200,1.10,1.10,188,67,80.0,189,220,,0.0,3:No Problem
79,232,5.4,0.200,1.10,1.10,232,67,150.0,233,331,333,75.0,3:No Problem
79,331,7.3,0.200,1.50,1.50,335,67,210.0,335,386,389,0.0,3:No Problem
79,386,7.5,0.200,1.50,1.50,386,67,20.0,386,,,-9.0,-9
124,22,3.6,0.200,0.70,0.70,23,67,100.0,29,57,,-9.0,3:No Problem
124,57,3.6,0.200,0.70,0.70,57,67,100.0,58,83,,-9.0,3:No Problem
124,83,4.3,0.200,0.90,0.90,83,67,120.0,84,113,258,0.0,3:No Problem
124,113,6.8,0.200,1.40,1.40,117,67,200.0,117,174,258,0.0,3:No Problem
124,174,6.8,0.200,1.40,1.40,175,67,190.0,175,258,258,0.0,3:No Problem
124,261,9.3,0.200,1.90,1.90,262,67,140.0,264,317,,-9.0,3:No Problem
124,317,10.4,0.200,2.10,2.10,320,67,280.0,320,377,377,10.0,3:No Problem
124,378,10.2,0.200,2.00,2.00,378,67,280.0,378,400,400,-9.0,3:No Problem
495,22,3.2,0.100,0.30,0.30,22,67,50.0,28,39,,-9.0,3:No Problem
495,40,3.5,0.200,0.70,0.70,41,67,100.0,41,90,,-9.0,3:No Problem
495,90,4.3,0.200,0.90,0.90,91,67,120.0,91,152,213,0.0,3:No Problem
495,152,4.3,0.200,0.90,0.90,153,67,130.0,153,208,213,45.0,3:No Problem
495,208,5.6,0.200,1.10,1.10,209,67,150.0,209,272,272,20.0,3:No Problem
495,271,5.6,0.200,1.10,1.10,272,67,150.0,272,314,315,10.0,3:No Problem
495,314,7.7,0.200,1.50,1.50,315,67,200.0,315,373,373,0.0,3:No Problem
495,370,8.6,0.200,1.70,1.70,373,67,240.0,374,501,516,45.0,3:No Problem
236,25,2.9,0.150,0.40,0.40,25,67,60.0,27,152,152,0.0,3:No Problem
236,152,3.9,0.100,0.40,0.40,153,67,60.0,153,272,272,0.0,3:No Problem
236,272,6.4,0.100,0.60,0.60,272,67,90.0,273,341,341,0.0,3:No Problem
236,341,6.5,0.100,0.60,0.60,342,67,90.0,342,440,440,0.0,3:No Problem
236,439,6.5,0.100,0.60,0.60,440,67,90.0,440,453,,-9.0,3:No Problem
657,16,2.2,0.200,0.40,0.40,16,60,60.0,17,47,103,0.0,3:No Problem
657,31,2.2,0.200,0.40,0.40,31,60,60.0,48,80,103,4.0,3:No Problem
657,74,3.7,0.200,0.70,0.70,74,60,50.0,,,103,50.0,3:No Problem
799,14,3.7,0.200,0.70,0.70,15,60,75.0,19,33,43,2.5,3:No Problem