blind_id,VISIT,GENDERS113,comp_age,FM13LANG,EATWEL,EATWEL_I,SLEEP,SLEEP_I,CONTNT,CONTNT_I,MOODY,MOODY_I,COMMUN,COMMUN_I,FLSICK,FLSICK_I,OCCUPY,OCCUPY_I,LIVELY,LIVELY_I,IRRIT,IRRIT_I,SLEEPN,SLEEPN_I,RESPND,RESPND_I,DIFFIC,DIFFIC_I,INTRST,INTRST_I,CRYING,CRYING_I,EQUIP,EQUIP_I,SMILE,SMILE_I,BABBLE,BABBLE_I,GETOBJ,GETOBJ_I,HEAR,HEAR_I,LOOK,LOOK_I,AFRAID,AFRAID_I,GETAROUND,GETAROUND_I,TANTRUM,TANTRUM_I,CUTPLAY,CUTPLAY_I,TROUBLE,TROUBLE_I,THROW_Q,THROW_I,TIMID,TIMID_I,HELPEAT,HELPEAT_I,RESTLESS,RESTLESS_I,PAYATTN,PAYATTN_I,NERVOUS,NERVOUS_I,CUTDOWN,CUTDOWN_I,INVOLVED,INVOLVED_I,HOSPITAL,HOSPTIME,HOSPDAYS,RELATN,RELAT_SP,GRADE,INCOME,totalall,total,genhealth,response
586,6:Study Visit 6 (Age 14 mo),1:Male,454,,3:Almost always,-2,3:Almost always,-2,3:Almost always,-2,1:Never or rarely,-2,3:Almost always,-2,1:Never or rarely,-2,3:Almost always,-2,3:Almost always,-2,1:Never or rarely,-2,3:Almost always,-2,3:Almost always,-2,1:Never or rarely,-2,3:Almost always,-2,1:Never or rarely,-2,2:Some of the time,-2,3:Almost always,-2,3:Almost always,-2,3:Almost always,-2,3:Almost always,-2,3:Almost always,-2,,,,,,,,,,,,,,,,,,,,,,,,,,,2:No,-2,-2,1:Biological Parent,-2,3:Some college or 2-year degree,"6:>=$100,000",100,,,
427,6:Study Visit 6 (Age 14 mo),1:Male,400,,2:Some of the time,2:Partly,2:Some of the time,2:Partly,3:Almost always,-2,2:Some of the time,3:Not at all,2:Some of the time,3:Not at all,1:Never or rarely,-2,3:Almost always,-2,3:Almost always,-2,1:Never or rarely,-2,1:Never or rarely,2:Partly,3:Almost always,-2,1:Never or rarely,-2,3:Almost always,-2,1:Never or rarely,-2,2:Some of the time,-2,3:Almost always,-2,3:Almost always,-2,3:Almost always,-2,3:Almost always,-2,3:Almost always,-2,,,,,,,,,,,,,,,,,,,,,,,,,,,2:No,-2,-2,1:Biological Parent,-2,4:4-year college graduate,"4:$60,000 - $79,000",85.71,,,
1218,6:Study Visit 6 (Age 14 mo),1:Male,447,,3:Almost always,-2,3:Almost always,-2,3:Almost always,-2,1:Never or rarely,-2,2:Some of the time,3:Not at all,1:Never or rarely,-2,3:Almost always,-2,3:Almost always,-2,1:Never or rarely,-2,2:Some of the time,3:Not at all,3:Almost always,-2,1:Never or rarely,-2,3:Almost always,-2,2:Some of the time,3:Not at all,2:Some of the time,-2,3:Almost always,-2,3:Almost always,-2,3:Almost always,-2,3:Almost always,-2,3:Almost always,-2,,,,,,,,,,,,,,,,,,,,,,,,,,,2:No,-2,-2,1:Biological Parent,-2,-9,"4:$60,000 - $79,000",100,,,
76,6:Study Visit 6 (Age 14 mo),2:Female,415,,2:Some of the time,3:Not at all,3:Almost always,-2,3:Almost always,-2,2:Some of the time,3:Not at all,3:Almost always,-2,1:Never or rarely,-2,2:Some of the time,3:Not at all,3:Almost always,-2,1:Never or rarely,-2,2:Some of the time,3:Not at all,3:Almost always,-2,1:Never or rarely,-2,3:Almost always,-2,2:Some of the time,3:Not at all,2:Some of the time,-2,3:Almost always,-2,3:Almost always,-2,3:Almost always,-2,3:Almost always,-2,3:Almost always,-2,,,,,,,,,,,,,,,,,,,,,,,,,,,2:No,-2,-2,1:Biological Parent,-2,4:4-year college graduate,"4:$60,000 - $79,000",100,,,
34,6:Study Visit 6 (Age 14 mo),2:Female,448,,3:Almost always,-2,3:Almost always,-2,3:Almost always,-2,1:Never or rarely,-2,3:Almost always,-2,2:Some of the time,1:Fully,3:Almost always,-2,3:Almost always,-2,1:Never or rarely,-2,3:Almost always,-2,3:Almost always,-2,1:Never or rarely,-2,3:Almost always,-2,1:Never or rarely,-2,2:Some of the time,-2,3:Almost always,-2,3:Almost always,-2,3:Almost always,-2,3:Almost always,-2,3:Almost always,-2,,,,,,,,,,,,,,,,,,,,,,,,,,,2:No,-2,-2,1:Biological Parent,-2,3:Some college or 2-year degree,"2:$20,000 - $39,000",96.43,,,
785,6:Study Visit 6 (Age 14 mo),1:Male,436,1,3:Almost always,-2,3:Almost always,-2,3:Almost always,-2,2:Some of the time,3:Not at all,2:Some of the time,3:Not at all,1:Never or rarely,-2,2:Some of the time,3:Not at all,3:Almost always,-2,1:Never or rarely,-2,3:Almost always,-2,3:Almost always,-2,1:Never or rarely,-2,3:Almost always,-2,1:Never or rarely,-2,2:Some of the time,-2,3:Almost always,-2,3:Almost always,-2,3:Almost always,-2,3:Almost always,-2,3:Almost always,-2,1:Never or rarely,-2,2:Some of the time,3:Not at all,1:Never or rarely,-2,1:Never or rarely,-2,1:Never or rarely,-2,3,-2,1:Never or rarely,-2,1:Never or rarely,-2,1:Never or rarely,-2,3:Almost always,-2,1:Never or rarely,-2,1:Never or rarely,-2,3:Almost always,-2,1:Yes,1,4,1:Biological Parent,-2,-9,"5:$80,000 - $99,000",100,95.45,100,100
1047,6:Study Visit 6 (Age 14 mo),1:Male,423,1,3:Almost always,-2,3:Almost always,-2,3:Almost always,-2,1:Never or rarely,-2,3:Almost always,-2,1:Never or rarely,-2,3:Almost always,-2,3:Almost always,-2,1:Never or rarely,-2,3:Almost always,-2,3:Almost always,-2,1:Never or rarely,-2,3:Almost always,-2,2:Some of the time,3:Not at all,2:Some of the time,-2,3:Almost always,-2,3:Almost always,-2,3:Almost always,-2,3:Almost always,-2,3:Almost always,-2,1:Never or rarely,-2,3:Almost always,-2,1:Never or rarely,-2,1:Never or rarely,-2,1:Never or rarely,-2,3,-2,1:Never or rarely,-2,1:Never or rarely,-2,1:Never or rarely,-2,3:Almost always,-2,1:Never or rarely,-2,1:Never or rarely,-2,3:Almost always,-2,2:No,-2,-2,1:Biological Parent,-2,3:Some college or 2-year degree,"2:$20,000 - $39,000",100,95.45,100,100
1240,6:Study Visit 6 (Age 14 mo),1:Male,446,1,3:Almost always,-2,3:Almost always,-2,3:Almost always,-2,2:Some of the time,3:Not at all,3:Almost always,-2,1:Never or rarely,-2,3:Almost always,-2,3:Almost always,-2,2:Some of the time,3:Not at all,3:Almost always,-2,3:Almost always,-2,1:Never or rarely,-2,3:Almost always,-2,2:Some of the time,3:Not at all,2:Some of the time,-2,3:Almost always,-2,3:Almost always,-2,2:Some of the time,3:Not at all,3:Almost always,-2,3:Almost always,-2,3:Almost always,3:Not at all,3:Almost always,-2,2:Some of the time,3:Not at all,1:Never or rarely,-2,1:Never or rarely,-2,3,-2,2:Some of the time,3:Not at all,1:Never or rarely,-2,2:Some of the time,3:Not at all,2:Some of the time,3:Not at all,1:Never or rarely,-2,1:Never or rarely,-2,2:Some of the time,3:Not at all,1:Yes,1,1,1:Biological Parent,-2,3:Some college or 2-year degree,"2:$20,000 - $39,000",100,95.45,100,100
938,6:Study Visit 6 (Age 14 mo),1:Male,419,1,3:Almost always,-2,3:Almost always,-2,3:Almost always,-2,2:Some of the time,2:Partly,2:Some of the time,3:Not at all,1:Never or rarely,-2,2:Some of the time,3:Not at all,3:Almost always,-2,1:Never or rarely,-2,2:Some of the time,3:Not at all,3:Almost always,-2,1:Never or rarely,-2,3:Almost always,-2,1:Never or rarely,-2,2:Some of the time,-2,3:Almost always,-2,3:Almost always,-2,3:Almost always,-2,3:Almost always,-2,3:Almost always,-2,1:Never or rarely,-2,3:Almost always,-2,1:Never or rarely,-2,1:Never or rarely,-2,1:Never or rarely,-2,3,-2,1:Never or rarely,-2,1:Never or rarely,-2,1:Never or rarely,-2,3:Almost always,-2,1:Never or rarely,-2,1:Never or rarely,-2,3:Almost always,-2,2:No,-2,-2,1:Biological Parent,-2,3:Some college or 2-year degree,"5:$80,000 - $99,000",96.43,93.18,97.06,100
986,6:Study Visit 6 (Age 14 mo),1:Male,423,1,3:Almost always,-2,3:Almost always,-2,3:Almost always,-2,2:Some of the time,1:Fully,2:Some of the time,1:Fully,2:Some of the time,1:Fully,3:Almost always,-2,3:Almost always,-2,1:Never or rarely,-2,3:Almost always,-2,3:Almost always,-2,1:Never or rarely,-2,3:Almost always,-2,2:Some of the time,2:Partly,2:Some of the time,-2,3:Almost always,-2,3:Almost always,-2,3:Almost always,-2,3:Almost always,-2,3:Almost always,-2,2:Some of the time,3:Not at all,2:Some of the time,3:Not at all,2:Some of the time,2:Partly,2:Some of the time,1:Fully,1:Never or rarely,-2,3,-2,2:Some of the time,2:Partly,1:Never or rarely,-2,1:Never or rarely,-2,3:Almost always,-2,1:Never or rarely,-2,1:Never or rarely,-2,3:Almost always,-2,2:No,-2,-2,1:Biological Parent,-2,4:4-year college graduate,"6:>=$100,000",85.71,88.64,88.24,95.45
29,6:Study Visit 6 (Age 14 mo),1:Male,398,1,2:Some of the time,1:Fully,2:Some of the time,2:Partly,3:Almost always,-2,2:Some of the time,2:Partly,3:Almost always,-2,3:Almost always,1:Fully,2:Some of the time,2:Partly,2:Some of the time,2:Partly,1:Never or rarely,-2,2:Some of the time,2:Partly,3:Almost always,-2,1:Never or rarely,-2,3:Almost always,-2,2:Some of the time,1:Fully,2:Some of the time,-2,3:Almost always,-2,3:Almost always,-2,3:Almost always,-2,3:Almost always,-2,3:Almost always,-2,2:Some of the time,3:Not at all,3:Almost always,-2,1:Never or rarely,-2,2:Some of the time,1:Fully,2:Some of the time,1:Fully,2,3,2:Some of the time,3:Not at all,1:Never or rarely,-2,3:Almost always,1:Fully,3:Almost always,-2,1:Never or rarely,-2,1:Never or rarely,-2,3:Almost always,-2,2:No,-2,-2,1:Biological Parent,-2,3:Some college or 2-year degree,"4:$60,000 - $79,000",67.86,68.18,64.71,81.82
1190,6:Study Visit 6 (Age 14 mo),1:Male,468,1,1:Never or rarely,1:Fully,3:Almost always,-2,3:Almost always,-2,2:Some of the time,2:Partly,3:Almost always,-2,3:Almost always,1:Fully,3:Almost always,-2,2:Some of the time,1:Fully,2:Some of the time,2:Partly,3:Almost always,-2,3:Almost always,-2,1:Never or rarely,-2,3:Almost always,-2,1:Never or rarely,-2,1:Never or rarely,1:Fully,3:Almost always,-2,3:Almost always,-2,2:Some of the time,1:Fully,3:Almost always,-2,3:Almost always,-2,1:Never or rarely,-2,2:Some of the time,1:Fully,2:Some of the time,2:Partly,3:Almost always,1:Fully,1:Never or rarely,-2,1,3,1:Never or rarely,-2,3:Almost always,1:Fully,2:Some of the time,1:Fully,3:Almost always,-2,1:Never or rarely,-2,3:Almost always,1:Fully,2:Some of the time,2:Partly,1:Yes,5,31,1:Biological Parent,-2,3:Some college or 2-year degree,"3:$40,000 - $59,000",75,70.45,64.71,68.18
412,6:Study Visit 6 (Age 14 mo),1:Male,408,1,1:Never or rarely,1:Fully,3:Almost always,-2,3:Almost always,-2,2:Some of the time,1:Fully,1:Never or rarely,1:Fully,2:Some of the time,1:Fully,2:Some of the time,1:Fully,3:Almost always,-2,1:Never or rarely,-2,3:Almost always,-2,3:Almost always,-2,1:Never or rarely,-2,3:Almost always,-2,2:Some of the time,1:Fully,1:Never or rarely,1:Fully,3:Almost always,-2,1:Never or rarely,1:Fully,2:Some of the time,1:Fully,1:Never or rarely,1:Fully,3:Almost always,-2,1:Never or rarely,-2,1:Never or rarely,1:Fully,1:Never or rarely,-2,2:Some of the time,1:Fully,1:Never or rarely,-2,1,1,1:Never or rarely,-2,3:Almost always,1:Fully,1:Never or rarely,-2,2:Some of the time,1:Fully,1:Never or rarely,-2,1:Never or rarely,-2,2:Some of the time,1:Fully,1:Yes,4,160,1:Biological Parent,-2,2:High school graduate/g.e.d,"2:$20,000 - $39,000",71.43,72.73,82.35,54.55
,4:Study Visit 4 (Restart),1:Male,495,1,3:Almost always,-2,3:Almost always,-2,3:Almost always,-2,2:Some of the time,3:Not at all,3:Almost always,-2,1:Never or rarely,-2,3:Almost always,-2,3:Almost always,-2,1:Never or rarely,-2,3:Almost always,-2,3:Almost always,-2,1:Never or rarely,-2,3:Almost always,-2,1:Never or rarely,-2,2:Some of the time,-2,3:Almost always,-2,3:Almost always,-2,3:Almost always,-2,3:Almost always,-2,3:Almost always,-2,2:Some of the time,3:Not at all,3:Almost always,-2,1:Never or rarely,-2,1:Never or rarely,-2,1:Never or rarely,-2,3,-2,2:Some of the time,3:Not at all,2:Some of the time,3:Not at all,1:Never or rarely,-2,3:Almost always,-2,1:Never or rarely,-2,1:Never or rarely,-2,3:Almost always,-2,2:No,-2,-2,1:Biological Parent,-2,4:4-year college graduate,-7:Do not wish to provide,,,,
,4:Study Visit 4 (Restart),1:Male,417,1,3:Almost always,-2,3:Almost always,-2,3:Almost always,-2,1:Never or rarely,-2,3:Almost always,-2,1:Never or rarely,-2,3:Almost always,-2,3:Almost always,-2,1:Never or rarely,-2,3:Almost always,-2,3:Almost always,-2,1:Never or rarely,-2,3:Almost always,-2,2:Some of the time,3:Not at all,2:Some of the time,-2,3:Almost always,-2,3:Almost always,-2,3:Almost always,-2,3:Almost always,-2,3:Almost always,-2,1:Never or rarely,-2,2:Some of the time,3:Not at all,1:Never or rarely,-2,1:Never or rarely,-2,1:Never or rarely,-2,3,-2,1:Never or rarely,-2,1:Never or rarely,-2,2:Some of the time,3:Not at all,3:Almost always,-2,1:Never or rarely,-2,1:Never or rarely,-2,3:Almost always,-2,2:No,-2,-2,1:Biological Parent,-2,3:Some college or 2-year degree,"6:>=$100,000",,,,
,4:Study Visit 4 (Restart),1:Male,427,1,2:Some of the time,2:Partly,2:Some of the time,2:Partly,2:Some of the time,2:Partly,2:Some of the time,2:Partly,3:Almost always,-2,2:Some of the time,1:Fully,2:Some of the time,3:Not at all,2:Some of the time,1:Fully,1:Never or rarely,-2,2:Some of the time,3:Not at all,3:Almost always,-2,1:Never or rarely,-2,3:Almost always,-2,2:Some of the time,2:Partly,2:Some of the time,-2,3:Almost always,-2,3:Almost always,-2,3:Almost always,-2,3:Almost always,-2,3:Almost always,-2,1:Never or rarely,-2,3:Almost always,-2,2:Some of the time,3:Not at all,2:Some of the time,1:Fully,1:Never or rarely,-2,2,3,1:Never or rarely,-2,1:Never or rarely,-2,2:Some of the time,2:Partly,2:Some of the time,2:Partly,1:Never or rarely,-2,2:Some of the time,1:Fully,3:Almost always,-2,2:No,-2,-2,1:Biological Parent,-2,3:Some college or 2-year degree,"2:$20,000 - $39,000",,,,
,4:Study Visit 4 (Restart),1:Male,420,1,3:Almost always,-2,3:Almost always,-2,3:Almost always,-2,1:Never or rarely,-2,3:Almost always,-2,1:Never or rarely,-2,3:Almost always,-2,3:Almost always,-2,1:Never or rarely,-2,1:Never or rarely,3:Not at all,3:Almost always,-2,1:Never or rarely,-2,3:Almost always,-2,3:Almost always,3:Not at all,2:Some of the time,-2,3:Almost always,-2,3:Almost always,-2,3:Almost always,-2,3:Almost always,-2,3:Almost always,-2,-9,-9,-9,-9,-9,-9,-9,-9,-9,-9,-9,-9,-9,-9,-9,-9,-9,-9,-9,-9,-9,-9,-9,-9,-9,-9,1:Yes,1,6,1:Biological Parent,-2,3:Some college or 2-year degree,"3:$40,000 - $59,000",,,,
511,6:Study Visit 6 (Age 14 mo),1:Male,425,,2:Some of the time,2:Partly,2:Some of the time,2:Partly,3:Almost always,-2,2:Some of the time,2:Partly,2:Some of the time,3:Not at all,2:Some of the time,2:Partly,3:Almost always,-2,3:Almost always,-2,1:Never or rarely,-2,1:Never or rarely,2:Partly,3:Almost always,-2,1:Never or rarely,-2,3:Almost always,-2,1:Never or rarely,-2,2:Some of the time,-2,2:Some of the time,3:Not at all,3:Almost always,-2,3:Almost always,-2,3:Almost always,-2,3:Almost always,-2,,,,,,,,,,,,,,,,,,,,,,,,,,,2:No,-2,-2,1:Biological Parent,-2,3:Some college or 2-year degree,"6:>=$100,000",78.57,,,
,,,,,,,,,,,,,,,,,,,,,,,,,,,,,,,,,,,,,,,,,,,,,,,,,,,,,,,,,,,,,,,,,,,,,,,,,,,,,,,,,
134,6:Study Visit 6 (Age 14 mo),1:Male,442,,3:Almost always,-2,2:Some of the time,2:Partly,3:Almost always,-2,2:Some of the time,2:Partly,1:Never or rarely,-9,2:Some of the time,2:Partly,2:Some of the time,3:Not at all,2:Some of the time,1:Fully,3:Almost always,1:Fully,1:Never or rarely,1:Fully,3:Almost always,-2,2:Some of the time,2:Partly,3:Almost always,-2,3:Almost always,3:Not at all,2:Some of the time,-2,2:Some of the time,3:Not at all,3:Almost always,-2,3:Almost always,-2,2:Some of the time,1:Fully,3:Almost always,-2,,,,,,,,,,,,,,,,,,,,,,,,,,,2:No,-2,-2,1:Biological Parent,-2,1:Some high school or less,"1:<$20,000",60.71,,,
183,6:Study Visit 6 (Age 14 mo),1:Male,436,,2:Some of the time,3:Not at all,2:Some of the time,3:Not at all,3:Almost always,-2,2:Some of the time,3:Not at all,3:Almost always,-2,1:Never or rarely,-2,3:Almost always,-2,3:Almost always,-2,2:Some of the time,3:Not at all,3:Almost always,-2,3:Almost always,-2,2:Some of the time,3:Not at all,3:Almost always,-2,2:Some of the time,3:Not at all,2:Some of the time,-2,3:Almost always,-2,3:Almost always,-2,3:Almost always,-2,3:Almost always,-2,3:Almost always,-2,,,,,,,,,,,,,,,,,,,,,,,,,,,2:No,-2,-2,1:Biological Parent,-2,4:4-year college graduate,"4:$60,000 - $79,000",100,,,
983,6:Study Visit 6 (Age 14 mo),1:Male,425,,2:Some of the time,2:Partly,3:Almost always,-2,3:Almost always,-2,2:Some of the time,3:Not at all,2:Some of the time,3:Not at all,1:Never or rarely,-2,3:Almost always,-2,3:Almost always,-2,1:Never or rarely,-2,3:Almost always,-2,3:Almost always,-2,1:Never or rarely,-2,3:Almost always,-2,1:Never or rarely,-2,1:Never or rarely,1:Fully,3:Almost always,-2,3:Almost always,-2,3:Almost always,-2,3:Almost always,-2,3:Almost always,-2,,,,,,,,,,,,,,,,,,,,,,,,,,,2:No,-2,-2,1:Biological Parent,-2,4:4-year college graduate,"4:$60,000 - $79,000",96.43,,,
1203,6:Study Visit 6 (Age 14 mo),1:Male,432,,3:Almost always,-2,3:Almost always,-2,3:Almost always,-2,2:Some of the time,-9,3:Almost always,-2,1:Never or rarely,-2,3:Almost always,-2,3:Almost always,-2,2:Some of the time,-9,3:Almost always,-2,3:Almost always,-2,2:Some of the time,-9,3:Almost always,-2,2:Some of the time,-9,2:Some of the time,-2,3:Almost always,-2,3:Almost always,-2,3:Almost always,-2,3:Almost always,-2,3:Almost always,-2,,,,,,,,,,,,,,,,,,,,,,,,,,,2:No,-2,-2,1:Biological Parent,-2,2:High school graduate/g.e.d,"2:$20,000 - $39,000",85.71,,,
118,6:Study Visit 6 (Age 14 mo),1:Male,411,,3:Almost always,-2,3:Almost always,-2,3:Almost always,-2,1:Never or rarely,-2,3:Almost always,-2,1:Never or rarely,-2,3:Almost always,-2,3:Almost always,-2,1:Never or rarely,-2,3:Almost always,-2,3:Almost always,-2,1:Never or rarely,-2,3:Almost always,-2,1:Never or rarely,-2,2:Some of the time,-2,3:Almost always,-2,3:Almost always,-2,3:Almost always,-2,3:Almost always,-2,3:Almost always,-2,,,,,,,,,,,,,,,,,,,,,,,,,,,-9,-9,-9,-9,-2,-9,-9,100,,,
666,6:Study Visit 6 (Age 14 mo),1:Male,445,,2:Some of the time,2:Partly,2:Some of the time,2:Partly,3:Almost always,-2,2:Some of the time,2:Partly,3:Almost always,-2,2:Some of the time,1:Fully,3:Almost always,-2,3:Almost always,-2,2:Some of the time,2:Partly,2:Some of the time,2:Partly,3:Almost always,-2,2:Some of the time,2:Partly,3:Almost always,-2,2:Some of the time,2:Partly,2:Some of the time,-2,3:Almost always,-2,3:Almost always,-2,3:Almost always,-2,3:Almost always,-2,3:Almost always,-2,,,,,,,,,,,,,,,,,,,,,,,,,,,2:No,-2,-2,1:Biological Parent,-2,3:Some college or 2-year degree,"3:$40,000 - $59,000",71.43,,,
1002,6:Study Visit 6 (Age 14 mo),1:Male,419,,3:Almost always,-2,1:Never or rarely,2:Partly,2:Some of the time,1:Fully,2:Some of the time,1:Fully,3:Almost always,-2,2:Some of the time,1:Fully,3:Almost always,-2,2:Some of the time,1:Fully,1:Never or rarely,-2,1:Never or rarely,2:Partly,3:Almost always,-2,1:Never or rarely,-2,3:Almost always,-2,1:Never or rarely,-2,2:Some of the time,-2,3:Almost always,-2,3:Almost always,-2,3:Almost always,-2,3:Almost always,-2,3:Almost always,-2,,,,,,,,,,,,,,,,,,,,,,,,,,,2:No,-2,-2,1:Biological Parent,-2,2:High school graduate/g.e.d,"2:$20,000 - $39,000",71.43,,,
711,6:Study Visit 6 (Age 14 mo),1:Male,453,,2:Some of the time,3:Not at all,3:Almost always,-2,2:Some of the time,3:Not at all,1:Never or rarely,-2,2:Some of the time,2:Partly,2:Some of the time,2:Partly,2:Some of the time,2:Partly,2:Some of the time,2:Partly,1:Never or rarely,-2,3:Almost always,-2,3:Almost always,-2,1:Never or rarely,-2,3:Almost always,-2,1:Never or rarely,-2,2:Some of the time,-2,3:Almost always,-2,3:Almost always,-2,2:Some of the time,2:Partly,3:Almost always,-2,2:Some of the time,2:Partly,,,,,,,,,,,,,,,,,,,,,,,,,,,2:No,-2,-2,1:Biological Parent,-2,5:Graduate degree,"3:$40,000 - $59,000",85.71,,,
61,6:Study Visit 6 (Age 14 mo),2:Female,412,,3:Almost always,-2,3:Almost always,-2,3:Almost always,-2,2:Some of the time,2:Partly,2:Some of the time,2:Partly,2:Some of the time,2:Partly,3:Almost always,-2,3:Almost always,-2,1:Never or rarely,-2,3:Almost always,-2,3:Almost always,-2,1:Never or rarely,-2,3:Almost always,-2,1:Never or rarely,-2,1:Never or rarely,3:Not at all,3:Almost always,-2,3:Almost always,-2,2:Some of the time,3:Not at all,3:Almost always,-2,3:Almost always,-2,,,,,,,,,,,,,,,,,,,,,,,,,,,2:No,-2,-2,1:Biological Parent,-2,3:Some college or 2-year degree,"3:$40,000 - $59,000",89.29,,,
259,6:Study Visit 6 (Age 14 mo),1:Male,411,,3:Almost always,-2,3:Almost always,-2,3:Almost always,-2,1:Never or rarely,-2,2:Some of the time,3:Not at all,1:Never or rarely,-2,3:Almost always,-2,3:Almost always,-2,1:Never or rarely,-2,3:Almost always,-2,3:Almost always,-2,1:Never or rarely,-2,3:Almost always,-2,2:Some of the time,3:Not at all,2:Some of the time,-2,3:Almost always,-2,3:Almost always,-2,3:Almost always,-2,3:Almost always,-2,3:Almost always,-2,,,,,,,,,,,,,,,,,,,,,,,,,,,2:No,-2,-2,1:Biological Parent,-2,4:4-year college graduate,"5:$80,000 - $99,000",100,,,
,,,,,,,,,,,,,,,,,,,,,,,,,,,,,,,,,,,,,,,,,,,,,,,,,,,,,,,,,,,,,,,,,,,,,,,,,,,,,,,,,
1019,6:Study Visit 6 (Age 14 mo),1:Male,430,1,2:Some of the time,3:Not at all,2:Some of the time,3:Not at all,3:Almost always,-2,2:Some of the time,2:Partly,3:Almost always,-2,2:Some of the time,2:Partly,3:Almost always,-2,3:Almost always,-2,1:Never or rarely,-2,1:Never or rarely,3:Not at all,3:Almost always,-2,2:Some of the time,2:Partly,3:Almost always,-2,2:Some of the time,3:Not at all,2:Some of the time,-2,3:Almost always,-2,3:Almost always,-2,3:Almost always,-2,3:Almost always,-2,3:Almost always,-2,1:Never or rarely,-2,3:Almost always,-2,1:Never or rarely,-2,2:Some of the time,3:Not at all,1:Never or rarely,-2,1,3,1:Never or rarely,-2,3:Almost always,1:Fully,1:Never or rarely,-2,3:Almost always,-2,1:Never or rarely,-2,1:Never or rarely,-2,3:Almost always,-2,1:Yes,1,1,1:Biological Parent,-2,3:Some college or 2-year degree,"3:$40,000 - $59,000",89.29,88.64,91.18,81.82
755,6:Study Visit 6 (Age 14 mo),1:Male,418,1,3:Almost always,-2,3:Almost always,-2,3:Almost always,-2,2:Some of the time,3:Not at all,3:Almost always,-2,1:Never or rarely,-2,2:Some of the time,3:Not at all,3:Almost always,-2,-9,-9,2:Some of the time,3:Not at all,3:Almost always,-2,1:Never or rarely,-2,3:Almost always,-2,1:Never or rarely,-2,1:Never or rarely,1:Fully,3:Almost always,-2,3:Almost always,-2,3:Almost always,-2,3:Almost always,-2,3:Almost always,-2,3:Almost always,3:Not at all,1:Never or rarely,1:Fully,1:Never or rarely,-2,1:Never or rarely,-2,1:Never or rarely,-2,3,-2,2:Some of the time,3:Not at all,1:Never or rarely,-2,2:Some of the time,3:Not at all,3:Almost always,-2,2:Some of the time,3:Not at all,1:Never or rarely,-2,3:Almost always,-2,2:No,-2,-2,1:Biological Parent,-2,1:Some high school or less,"1:<$20,000",100,95.45,100,90.91
981,6:Study Visit 6 (Age 14 mo),2:Female,422,1,1:Never or rarely,1:Fully,3:Almost always,-2,3:Almost always,-2,1:Never or rarely,-2,3:Almost always,-2,1:Never or rarely,-2,3:Almost always,-2,3:Almost always,-2,1:Never or rarely,-2,3:Almost always,-2,3:Almost always,-2,1:Never or rarely,-2,3:Almost always,-2,1:Never or rarely,-2,1:Never or rarely,1:Fully,3:Almost always,-2,3:Almost always,-2,3:Almost always,-2,3:Almost always,-2,3:Almost always,-2,2:Some of the time,2:Partly,3:Almost always,-2,1:Never or rarely,-2,1:Never or rarely,-2,1:Never or rarely,-2,3,-2,1:Never or rarely,-2,2:Some of the time,1:Fully,1:Never or rarely,-2,3:Almost always,-2,1:Never or rarely,-2,1:Never or rarely,-2,3:Almost always,-2,2:No,-2,-2,1:Biological Parent,-2,5:Graduate degree,"3:$40,000 - $59,000",92.86,88.64,91.18,95.45
780,6:Study Visit 6 (Age 14 mo),2:Female,359,1,3:Almost always,-2,3:Almost always,-2,3:Almost always,-2,1:Never or rarely,-2,3:Almost always,-2,1:Never or rarely,-2,3:Almost always,-2,3:Almost always,-2,1:Never or rarely,-2,3:Almost always,-2,3:Almost always,-2,1:Never or rarely,-2,3:Almost always,-2,1:Never or rarely,-2,2:Some of the time,-2,3:Almost always,-2,3:Almost always,-2,3:Almost always,-2,3:Almost always,-2,3:Almost always,-2,1:Never or rarely,-2,1:Never or rarely,3:Not at all,1:Never or rarely,-2,1:Never or rarely,-2,1:Never or rarely,-2,2,3,2:Some of the time,3:Not at all,1:Never or rarely,-2,1:Never or rarely,-2,2:Some of the time,3:Not at all,1:Never or rarely,-2,1:Never or rarely,-2,3:Almost always,-2,1:Yes,1,4,1:Biological Parent,-2,3:Some college or 2-year degree,-7:Do not wish to provide,100,95.45,100,100