blind_id,ae_age,AE_T,AETIME_TU,aetime24,frmini_age,comp_age,SVRISV_YN,RELATED,PRIOREVTCD,PRIORAENM,prioron_age,AEOCCUR,AEHOSP,EVTCODE,AECODE,AE_SPEC,AE_SPEC_P,BODSYS,MED_ADM,aemedcd_0,AEMEDNAM_0,aemedcd_1,AEMEDNAM_1,aemedcd_2,AEMEDNAM_2,aemedcd_3,AEMEDNAM_3,aemedcd_4,AEMEDNAM_4,aemedcd_5,AEMEDNAM_5,aemedcd_6,AEMEDNAM_6,aemedcd_7,AEMEDNAM_7,aemedcd_8,AEMEDNAM_8,aemedcd_9,AEMEDNAM_9,aemedcd_10,AEMEDNAM_10,aemedcd_11,AEMEDNAM_11,aemedcd_12,AEMEDNAM_12,aemedcd_13,AEMEDNAM_13,aemedcd_14,AEMEDNAM_14,aemedcd_15,AEMEDNAM_15,aemedcd_16,AEMEDNAM_16,aemedcd_17,AEMEDNAM_17,aemedcd_18,AEMEDNAM_18,aemedcd_19,AEMEDNAM_19,aemedcd_20,AEMEDNAM_20,aemedcd_21,AEMEDNAM_21,aemedcd_22,AEMEDNAM_22,aemedcd_23,AEMEDNAM_23,aemedcd_24,AEMEDNAM_24,aemedcd_25,AEMEDNAM_25,aemedcd_26,AEMEDNAM_26,aemedcd_27,AEMEDNAM_27,aemedcd_28,AEMEDNAM_28,aemedcd_29,AEMEDNAM_29,aemedcd_30,AEMEDNAM_30,ECMO,INTUBATED,CPR,OTHERTX,OTHTX_S,CONCMEDS,concmcd_0,CONCMNAM_0,medcode0,MEDNAM_0,cncsrt_age_0,cncstp_age_0,concmcd_1,CONCMNAM_1,medcode1,MEDNAM_1,cncsrt_age_1,cncstp_age_1,concmcd_2,CONCMNAM_2,medcode2,MEDNAM_2,cncsrt_age_2,cncstp_age_2,concmcd_3,CONCMNAM_3,medcode3,MEDNAM_3,cncsrt_age_3,cncstp_age_3,concmcd_4,CONCMNAM_4,medcode4,MEDNAM_4,cncsrt_age_4,cncstp_age_4,concmcd_5,CONCMNAM_5,medcode5,MEDNAM_5,cncsrt_age_5,cncstp_age_5,concmcd_6,CONCMNAM_6,medcode6,MEDNAM_6,cncsrt_age_6,cncstp_age_6,concmcd_7,CONCMNAM_7,medcode7,MEDNAM_7,cncsrt_age_7,cncstp_age_7,concmcd_8,CONCMNAM_8,medcode8,MEDNAM_8,cncsrt_age_8,cncstp_age_8,concmcd_9,CONCMNAM_9,medcode9,MEDNAM_9,cncsrt_age_9,cncstp_age_9,concmcd_10,CONCMNAM_10,medcode10,MEDNAM_10,cncsrt_age_10,cncstp_age_10,concmcd_11,CONCMNAM_11,medcode11,MEDNAM_11,cncsrt_age_11,cncstp_age_11,concmcd_12,CONCMNAM_12,medcode12,MEDNAM_12,cncsrt_age_12,cncstp_age_12,concmcd_13,CONCMNAM_13,medcode13,MEDNAM_13,cncsrt_age_13,cncstp_age_13,concmcd_14,CONCMNAM_14,medcode14,MEDNAM_14,cncsrt_age_14,cncstp_age_14,concmcd_15,CONCMNAM_15,medcode15,MEDNAM_15,cncsrt_age_15,cncstp_age_15,concmcd_16,CONCMNAM_16,medcode16,MEDNAM_16,cncsrt_age_16,cncstp_age_16,concmcd_17,CONCMNAM_17,medcode17,MEDNAM_17,cncsrt_age_17,cncstp_age_17,concmcd_18,CONCMNAM_18,medcode18,MEDNAM_18,cncsrt_age_18,cncstp_age_18,concmcd_19,CONCMNAM_19,medcode19,MEDNAM_19,cncsrt_age_19,cncstp_age_19,concmcd_20,CONCMNAM_20,medcode20,MEDNAM_20,cncsrt_age_20,cncstp_age_20,concmcd_21,CONCMNAM_21,medcode21,MEDNAM_21,cncsrt_age_21,cncstp_age_21,concmcd_22,CONCMNAM_22,medcode22,MEDNAM_22,cncsrt_age_22,cncstp_age_22,concmcd_23,CONCMNAM_23,medcode23,MEDNAM_23,cncsrt_age_23,cncstp_age_23,aedose_age,AEDOSE_T,AEDOSE_TU,AEDOSERX,AEDOSADM,DRUGREL,FDRUGREL,DECREASE,FDECREAS,REAPPEAR,FREAPEAR,NONSTMED,nsmedcd,NSMEDNAM,B7SIGNDE,B7SIGNRE,TESTREL,TEST_S,EXPECTED,SERIOUS,death_age,RESOLVED,resolv_age,RES_AECODE,RES_NAME,res_onset_age,RES_DEATH,s201expected
1023,27,12:00,3:24-Hour,12:00,,28,,,,,,1:Inpatient,-2,10048038,C-2201= Wound infection,-2,wound infection,,1:Yes,03.00-03.99= Antibiotics,-2,.,,.,,.,,.,,.,,.,,.,,.,,.,,.,,.,,.,,.,,.,,.,,.,,.,,.,,.,,.,,.,,.,,.,,.,,.,,.,,.,,.,,.,,.,,,,,2:No,-2,1:Yes,07.00-07.99= Antithrombotics,-2,.,,19,,09.00-09.99= Biologics,Tri-Vi Sol Drops,.,,20,,09.00-09.99= Biologics,Folic Acid,.,,20,,17.00-17.99= Glycosides,-2,.,,22,28,"22.00-22.99= Sedatives, hypnotics, anesthetics, analgesics",-2,.,,16,,.,,.,,,,.,,.,,,,.,,.,,,,.,,.,,,,.,,.,,,,.,,.,,,,.,,.,,,,.,,.,,,,.,,.,,,,.,,.,,,,.,,.,,,,.,,.,,,,.,,.,,,,.,,.,,,,.,,.,,,,.,,.,,,,.,,.,,,,.,,.,,,,.,,.,,,,,,,,,1:Not Related,1,-2,-2,-2,-2,1:Not Related,,-2,-2,-2,1:Not Associated,-2,2:No,1:Not Serious,,2:No,,,,,,2:No
1023,28,10:00,3:24-Hour,10:00,,28,,,,,,1:Inpatient,-2,10038448,C-9999= Other significant complication,Renal function decline,Renal failure NOS,,1:Yes,99.99= Unclassified,Kayexalate,15.00-15.99= Electrolytes,Na Cl,.,,.,,.,,.,,.,,.,,.,,.,,.,,.,,.,,.,,.,,.,,.,,.,,.,,.,,.,,.,,.,,.,,.,,.,,.,,.,,.,,.,,.,,,,,1:Yes,PIV started in Lt. foot 35 ml bolus Na Cl over 60 mins.,1:Yes,07.00-07.99= Antithrombotics,-2,.,,19,,09.00-09.99= Biologics,Tri-Vi-Sol,.,,20,,09.00-09.99= Biologics,Folic Acid,.,,20,,17.00-17.99= Glycosides,-2,.,,22,28,"22.00-22.99= Sedatives, hypnotics, anesthetics, analgesics",-2,.,,16,,.,,.,,,,.,,.,,,,.,,.,,,,.,,.,,,,.,,.,,,,.,,.,,,,.,,.,,,,.,,.,,,,.,,.,,,,.,,.,,,,.,,.,,,,.,,.,,,,.,,.,,,,.,,.,,,,.,,.,,,,.,,.,,,,.,,.,,,,.,,.,,,,.,,.,,,,,,,,,2:Possibly Related,2,-1:NA,-1,-1:NA,-1,2:Possibly Related,17.02,-2,-1:NA,-1:NA,1:Not Associated,-2,1:Yes,3:Serious,,2:No,,,,,,1:Yes
1023,82,15:30,3:24-Hour,15:30,,83,,,,,,2:Outpatient,1:Yes,90004084,C-1701= Respiratory failure,-2,Pulmonary/upper respiratory -respiratory distress,,1:Yes,19.00-19.99= Inotropic Agents,-2,19.00-19.99= Inotropic Agents,-2,"22.00-22.99= Sedatives, hypnotics, anesthetics, analgesics",-2,15.00-15.99= Electrolytes,-2,03.00-03.99= Antibiotics,-2,05.00-05.99= Antiemetics,-2,21.00-21.99= Neuromuscular Blocking Agents,-2,09.00-09.99= Biologics,ALBUMIN,.,,.,,.,,.,,.,,.,,.,,.,,.,,.,,.,,.,,.,,.,,.,,.,,.,,.,,.,,.,,.,,.,,.,,,,,1:Yes,CENTRAL LINE AND ARTERIAL LINE TO SUPPORT PATIENT ECHOCARDIOGRAM,1:Yes,14.00-14.99= Diuretics,-2,.,,11,,07.00-07.99= Antithrombotics,-2,.,,19,,16.00-16.99= Gastrointestinals,-2,.,,51,,15.00-15.99= Electrolytes,CALCIUM CARBONATE,.,,22,,.,,.,,,,.,,.,,,,.,,.,,,,.,,.,,,,.,,.,,,,.,,.,,,,.,,.,,,,.,,.,,,,.,,.,,,,.,,.,,,,.,,.,,,,.,,.,,,,.,,.,,,,.,,.,,,,.,,.,,,,.,,.,,,,.,,.,,,,.,,.,,,,.,,.,,,,.,,.,,,,,,,,,2:Possibly Related,2,2:No,2,-1:NA,-1,1:Not Related,,-2,-2,-2,1:Not Associated,-2,2:No,3:Serious,,2:No,,,,,,1:Yes
427,38,19:00,3:24-Hour,19:00,,41,,,,,,2:Outpatient,1:Yes,10048038,C-2201= Wound infection,-2,Wound infection,,1:Yes,03.00-03.99= Antibiotics,-2,.,,.,,.,,.,,.,,.,,.,,.,,.,,.,,.,,.,,.,,.,,.,,.,,.,,.,,.,,.,,.,,.,,.,,.,,.,,.,,.,,.,,.,,.,,,,,1:Yes,"Swab for C&S, Peripheral IV started for fluid maintenance and for administration of antibiotics. The patient will be (sent)seen to C.V. surgery and the wound will be debrided if necessary.",1:Yes,03.00-03.99= Antibiotics,-2,.,,24,,07.00-07.99= Antithrombotics,-2,.,,8,,16.00-16.99= Gastrointestinals,-2,.,,15,,.,,.,,,,.,,.,,,,.,,.,,,,.,,.,,,,.,,.,,,,.,,.,,,,.,,.,,,,.,,.,,,,.,,.,,,,.,,.,,,,.,,.,,,,.,,.,,,,.,,.,,,,.,,.,,,,.,,.,,,,.,,.,,,,.,,.,,,,.,,.,,,,.,,.,,,,.,,.,,,,.,,.,,,,,,,,,1:Not Related,1,-2,-2,-2,-2,1:Not Related,,-2,-2,-2,1:Not Associated,-2,1:Yes,3:Serious,,2:No,,,,,,2:No
427,122,13:00,3:24-Hour,13:00,,125,,,,,,2:Outpatient,1:Yes,10021143,C-9999= Other significant complication,Cyanosis and low oxygen saturation,Hypoxia,,1:Yes,16.00-16.99= Gastrointestinals,Domperidone,.,,.,,.,,.,,.,,.,,.,,.,,.,,.,,.,,.,,.,,.,,.,,.,,.,,.,,.,,.,,.,,.,,.,,.,,.,,.,,.,,.,,.,,.,,,,,1:Yes,CBC check haemoglobin level,1:Yes,07.00-07.99= Antithrombotics,-2,.,,8,,16.00-16.99= Gastrointestinals,-2,.,,15,,16.00-16.99= Gastrointestinals,Omeprazole,.,,119,,.,,.,,,,.,,.,,,,.,,.,,,,.,,.,,,,.,,.,,,,.,,.,,,,.,,.,,,,.,,.,,,,.,,.,,,,.,,.,,,,.,,.,,,,.,,.,,,,.,,.,,,,.,,.,,,,.,,.,,,,.,,.,,,,.,,.,,,,.,,.,,,,.,,.,,,,.,,.,,,,.,,.,,,,,,,,,1:Not Related,-2,-2,-2,-2,-2,1:Not Related,,-2,-2,-2,1:Not Associated,-2,1:Yes,3:Serious,,1:Yes,125,,,,,2:No
427,220,-9,3:24-Hour,-9:,,232,,,,,,2:Outpatient,2:No,90004050,C-0601= Gastrointestinal complication (includes necrotizing enterocolitis [NEC]),-2,GI other: bloody stool,3,2:No,,,,,,,,,,,,,,,,,,,,,,,,,,,,,,,,,,,,,,,,,,,,,,,,,,,,,,,,,,,,,,,2,,,1:Yes,MOM STOPPED DRINKING AND EATING MILK AND MILK PRODUCTS.,1:Yes,.,,16.99,LOSEC,119,,.,,.,,,,.,,.,,,,.,,.,,,,.,,.,,,,.,,.,,,,.,,.,,,,.,,.,,,,.,,.,,,,.,,.,,,,.,,.,,,,.,,.,,,,.,,.,,,,.,,.,,,,.,,.,,,,.,,.,,,,.,,.,,,,.,,.,,,,.,,.,,,,.,,.,,,,.,,.,,,,.,,.,,,,.,,.,,,,.,,.,,,,220,08:00,3,0.200,1.70,,1,,-2,,-2,1:Not Related,,-2,-2,-2,1:Not Associated,-2,1:Yes,1:Not Serious,,1:Yes,230,,,,,2:No
427,275,10:00,3:24-Hour,10:00,,279,,,,,,2:Outpatient,2:No,10030220,C-0601= Gastrointestinal complication (includes necrotizing enterocolitis [NEC]),-2,Oseophagitis NOS,3,2:No,,,,,,,,,,,,,,,,,,,,,,,,,,,,,,,,,,,,,,,,,,,,,,,,,,,,,,,,,,,,,,,2,,,1:Yes,Change formula from EBM to Neocate- a hypoallergenic formula.,1:Yes,.,,16.99,Losec,119,,.,,16.06,-2,269,,.,,.,,,,.,,.,,,,.,,.,,,,.,,.,,,,.,,.,,,,.,,.,,,,.,,.,,,,.,,.,,,,.,,.,,,,.,,.,,,,.,,.,,,,.,,.,,,,.,,.,,,,.,,.,,,,.,,.,,,,.,,.,,,,.,,.,,,,.,,.,,,,.,,.,,,,.,,.,,,,.,,.,,,,.,,.,,,,275,09:00,3,0.200,1.80,,1,,-2,,-2,1:Not Related,,-2,-2,-2,1:Not Associated,-2,1:Yes,1:Not Serious,,2:No,,,,,,2:No
427,372,09:00,3:24-Hour,09:00,,372,,,,,,2:Outpatient,2:No,90030426,C-9999= Other significant complication,Cold symptoms with otitis media,otitis media w/ unknown ANC,6,1:Yes,03.00-03.99= Antibiotics,-2,.,,.,,.,,.,,.,,.,,.,,.,,.,,.,,.,,.,,.,,.,,.,,.,,.,,.,,.,,.,,.,,.,,.,,.,,.,,.,,.,,.,,.,,.,,2,,,2:No,-2,1:Yes,.,,13.99,Study drug,14,,.,,16.99,Losec,78,,.,,22.01,-2,369,,.,,.,,,,.,,.,,,,.,,.,,,,.,,.,,,,.,,.,,,,.,,.,,,,.,,.,,,,.,,.,,,,.,,.,,,,.,,.,,,,.,,.,,,,.,,.,,,,.,,.,,,,.,,.,,,,.,,.,,,,.,,.,,,,.,,.,,,,.,,.,,,,.,,.,,,,.,,.,,,,.,,.,,,,371,09:00,3,0.200,2.00,,1,,-2,,-2,1:Not Related,,-2,-2,-2,1:Not Associated,-2,1:Yes,2:Moderately Serious,,2:No,,,,,,2:No
522,64,07:00,3:24-Hour,07:00,,65,,,,,,1:Inpatient,-2,10007617,C-0201= Cardiopulmonary arrest,-2,Cardiopulmanory arrest,,1:Yes,18.00-18.99= Hormonal Agents,-2,15.00-15.99= Electrolytes,-2,19.00-19.99= Inotropic Agents,-2,09.00-09.99= Biologics,Alblumin,.,,.,,.,,.,,.,,.,,.,,.,,.,,.,,.,,.,,.,,.,,.,,.,,.,,.,,.,,.,,.,,.,,.,,.,,.,,.,,.,,,,,1:Yes,"Patient was intubated, transferred to the pediatric intensive care unit(PICU) and placed on ECMO-extracorporeal membrame oxygenation.",1:Yes,19.00-19.99= Inotropic Agents,-2,.,,49,,13.00-13.99= Converting Enzyme Inhibitors,-2,.,,44,,14.00-14.99= Diuretics,-2,.,,50,,15.00-15.99= Electrolytes,-2,.,,52,,15.00-15.99= Electrolytes,Calcium carbonate,.,,50,,16.00-16.99= Gastrointestinals,-2,.,,27,,07.00-07.99= Antithrombotics,-2,.,,11,,.,,.,,,,.,,.,,,,.,,.,,,,.,,.,,,,.,,.,,,,.,,.,,,,.,,.,,,,.,,.,,,,.,,.,,,,.,,.,,,,.,,.,,,,.,,.,,,,.,,.,,,,.,,.,,,,.,,.,,,,.,,.,,,,.,,.,,,,,,,,,1:Not Related,1,-2,-2,-2,-2,1:Not Related,,-2,-2,-2,1:Not Associated,-2,2:No,3:Serious,,2:No,,,,,,2:No
522,53,14:57,3:24-Hour,14:57,,54,,,,,,1:Inpatient,-2,10040741,C-0201= Cardiopulmonary arrest,-2,sinus bradycardia- HR = 63,,1:Yes,15.00-15.99= Electrolytes,-2,18.00-18.99= Hormonal Agents,-2,19.00-19.99= Inotropic Agents,-2,.,,.,,.,,.,,.,,.,,.,,.,,.,,.,,.,,.,,.,,.,,.,,.,,.,,.,,.,,.,,.,,.,,.,,.,,.,,.,,.,,.,,,,,1:Yes,PATIENT WAS INTUBATED. AN ECHCOCARDIOGRAM WAS DONE IN THE PICU,1:Yes,08.00-08.99= Beta Blockers,-2,.,,52,,07.00-07.99= Antithrombotics,-2,.,,11,,13.00-13.99= Converting Enzyme Inhibitors,-2,.,,44,,14.00-14.99= Diuretics,-2,.,,52,,16.00-16.99= Gastrointestinals,-2,.,,27,,16.00-16.99= Gastrointestinals,DOMPERIDONE,.,,42,,15.00-15.99= Electrolytes,CALCIUM CARBONATE,.,,50,,.,,.,,,,.,,.,,,,.,,.,,,,.,,.,,,,.,,.,,,,.,,.,,,,.,,.,,,,.,,.,,,,.,,.,,,,.,,.,,,,.,,.,,,,.,,.,,,,.,,.,,,,.,,.,,,,.,,.,,,,.,,.,,,,.,,.,,,,,,,,,1:Not Related,1,-2,-2,-2,-2,1:Not Related,,-2,-2,-2,1:Not Associated,-2,2:No,3:Serious,,2:No,,,,,,2:No
522,78,15:00,3:24-Hour,15:00,,84,,,,,,1:Inpatient,-2,10006487,C-1701= Respiratory failure,-2,Bronchostenosis,,1:Yes,18.00-18.99= Hormonal Agents,-2,19.00-19.99= Inotropic Agents,-2,15.00-15.99= Electrolytes,-2,15.00-15.99= Electrolytes,CALCIUM CARBONATE,21.00-21.99= Neuromuscular Blocking Agents,-2,"22.00-22.99= Sedatives, hypnotics, anesthetics, analgesics",-2,.,,.,,.,,.,,.,,.,,.,,.,,.,,.,,.,,.,,.,,.,,.,,.,,.,,.,,.,,.,,.,,.,,.,,.,,.,,,,,1:Yes,BRONCHOSCOPY DONE XX/XX/XX,1:Yes,19.00-19.99= Inotropic Agents,-2,.,,49,,07.00-07.99= Antithrombotics,-2,.,,11,,14.00-14.99= Diuretics,-2,.,,52,,99.99= Unclassified,PHENOXYBENZAMINE,.,,77,,13.00-13.99= Converting Enzyme Inhibitors,-2,.,,44,,16.00-16.99= Gastrointestinals,-2,.,,27,,16.00-16.99= Gastrointestinals,DOMPERIDONE,.,,42,,"22.00-22.99= Sedatives, hypnotics, anesthetics, analgesics",-2,.,,64,,15.00-15.99= Electrolytes,-2,.,,64,,"22.00-22.99= Sedatives, hypnotics, anesthetics, analgesics",-2,.,,70,,.,,.,,,,.,,.,,,,.,,.,,,,.,,.,,,,.,,.,,,,.,,.,,,,.,,.,,,,.,,.,,,,.,,.,,,,.,,.,,,,.,,.,,,,.,,.,,,,.,,.,,,,.,,.,,,,,,,,,1:Not Related,1,-2,-2,-2,-2,1:Not Related,,-2,-2,-2,1:Not Associated,-2,2:No,3:Serious,,2:No,,,,,,2:No
522,43,01:50,3:24-Hour,01:50,,43,,,,,,2:Outpatient,1:Yes,10010971,C-2103= Ventricular dysfunction,-2,RV dysfunction,,1:Yes,03.00-03.99= Antibiotics,-2,03.00-03.99= Antibiotics,-2,09.00-09.99= Biologics,ALBUMIN,19.00-19.99= Inotropic Agents,-2,19.00-19.99= Inotropic Agents,-2,21.00-21.99= Neuromuscular Blocking Agents,-2,"22.00-22.99= Sedatives, hypnotics, anesthetics, analgesics",-2,18.00-18.99= Hormonal Agents,-2,.,,.,,.,,.,,.,,.,,.,,.,,.,,.,,.,,.,,.,,.,,.,,.,,.,,.,,.,,.,,.,,.,,.,,,,,1:Yes,ECHOCARDIOGRAM DONE IN PICU,1:Yes,07.00-07.99= Antithrombotics,-2,.,,11,,16.00-16.99= Gastrointestinals,-2,.,,27,,16.00-16.99= Gastrointestinals,DOMPERIDONE,.,,42,,09.00-09.99= Biologics,-2,.,,34,,.,,.,,,,.,,.,,,,.,,.,,,,.,,.,,,,.,,.,,,,.,,.,,,,.,,.,,,,.,,.,,,,.,,.,,,,.,,.,,,,.,,.,,,,.,,.,,,,.,,.,,,,.,,.,,,,.,,.,,,,.,,.,,,,.,,.,,,,.,,.,,,,.,,.,,,,.,,.,,,,,,,,,2:Possibly Related,2,2:No,2,-1:NA,-1,1:Not Related,,-2,-2,-2,1:Not Associated,-2,2:No,3:Serious,,2:No,,,,,,1:Yes
485,43,02:45,3:24-Hour,02:45,,44,,,,,,1:Inpatient,-2,10021143,C-1701= Respiratory failure,-2,Hypoxia,,1:Yes,15.00-15.99= Electrolytes,-2,15.00-15.99= Electrolytes,Normal saline,.,,.,,.,,.,,.,,.,,.,,.,,.,,.,,.,,.,,.,,.,,.,,.,,.,,.,,.,,.,,.,,.,,.,,.,,.,,.,,.,,.,,.,,,,,1:Yes,Continuous positive pressure ventilation.  Echo done on ward-BT shunt patent.,1:Yes,14.00-14.99= Diuretics,-2,.,,17,,16.00-16.99= Gastrointestinals,Domperidone,.,,37,,07.00-07.99= Antithrombotics,-2,.,,17,,16.00-16.99= Gastrointestinals,-2,.,,38,,13.00-13.99= Converting Enzyme Inhibitors,-2,.,,38,,09.00-09.99= Biologics,D-Vi-Sol,.,,39,,.,,.,,,,.,,.,,,,.,,.,,,,.,,.,,,,.,,.,,,,.,,.,,,,.,,.,,,,.,,.,,,,.,,.,,,,.,,.,,,,.,,.,,,,.,,.,,,,.,,.,,,,.,,.,,,,.,,.,,,,.,,.,,,,.,,.,,,,.,,.,,,,,,,,,1:Not Related,-2,-2,-2,-2,-2,1:Not Related,,-2,-2,-2,1:Not Associated,-2,2:No,3:Serious,,1:Yes,44,,,,,2:No
485,25,07:40,3:24-Hour,07:40,,26,,,,,,2:Outpatient,1:Yes,10021143,C-1701= Respiratory failure,-2,Hypoxia,,1:Yes,03.00-03.99= Antibiotics,-2,03.00-03.99= Antibiotics,-2,15.00-15.99= Electrolytes,-2,21.00-21.99= Neuromuscular Blocking Agents,-2,"22.00-22.99= Sedatives, hypnotics, anesthetics, analgesics",-2,09.00-09.99= Biologics,590 Albumin,.,,.,,.,,.,,.,,.,,.,,.,,.,,.,,.,,.,,.,,.,,.,,.,,.,,.,,.,,.,,.,,.,,.,,.,,.,,,,,1:Yes,"Started on CPAP continuous positive airway pressure, then intubated by sick kids team. Peripheral IV and aterial line inserted.",1:Yes,07.00-07.99= Antithrombotics,-2,.,,17,,14.00-14.99= Diuretics,-2,.,,17,25,.,,.,,,,.,,.,,,,.,,.,,,,.,,.,,,,.,,.,,,,.,,.,,,,.,,.,,,,.,,.,,,,.,,.,,,,.,,.,,,,.,,.,,,,.,,.,,,,.,,.,,,,.,,.,,,,.,,.,,,,.,,.,,,,.,,.,,,,.,,.,,,,.,,.,,,,.,,.,,,,.,,.,,,,.,,.,,,,,,,,,2:Possibly Related,1,2:No,-2,-1:NA,-2,1:Not Related,,-2,-2,-2,1:Not Associated,-2,2:No,3:Serious,,2:No,,,,,,1:Yes
485,128,21:40,3:24-Hour,21:40,,135,,,,,,1:Inpatient,-2,10010971,C-2103= Ventricular dysfunction,-2,Cor pulmonale NOS,,1:Yes,19.00-19.99= Inotropic Agents,-2,15.00-15.99= Electrolytes,Normal saline,18.00-18.99= Hormonal Agents,-2,21.00-21.99= Neuromuscular Blocking Agents,-2,"22.00-22.99= Sedatives, hypnotics, anesthetics, analgesics",-2,.,,.,,.,,.,,.,,.,,.,,.,,.,,.,,.,,.,,.,,.,,.,,.,,.,,.,,.,,.,,.,,.,,.,,.,,.,,.,,,,,1:Yes,Endo-tracheal intubation echo cardiogram,1:Yes,14.00-14.99= Diuretics,-2,.,,17,,19.00-19.99= Inotropic Agents,-2,.,,59,,16.00-16.99= Gastrointestinals,Domperidone,.,,37,,16.00-16.99= Gastrointestinals,-2,.,,38,,07.00-07.99= Antithrombotics,-2,.,,17,,14.00-14.99= Diuretics,-2,.,,124,,15.00-15.99= Electrolytes,Calcium Carbonate,.,,126,,.,,.,,,,.,,.,,,,.,,.,,,,.,,.,,,,.,,.,,,,.,,.,,,,.,,.,,,,.,,.,,,,.,,.,,,,.,,.,,,,.,,.,,,,.,,.,,,,.,,.,,,,.,,.,,,,.,,.,,,,.,,.,,,,.,,.,,,,,,,,,1:Not Related,-2,-2,-2,-2,-2,1:Not Related,,-2,-2,-2,1:Not Associated,-2,1:Yes,3:Serious,,1:Yes,135,,,,,2:No
485,62,15:30,3:24-Hour,15:30,,60,,,,,,1:Inpatient,-2,10021143,C-1701= Respiratory failure,-2,Hypoxia,,1:Yes,14.00-14.99= Diuretics,-2,19.00-19.99= Inotropic Agents,-2,19.00-19.99= Inotropic Agents,-2,.,,.,,.,,.,,.,,.,,.,,.,,.,,.,,.,,.,,.,,.,,.,,.,,.,,.,,.,,.,,.,,.,,.,,.,,.,,.,,.,,.,,,,,2:No,-2,1:Yes,16.00-16.99= Gastrointestinals,Domperidone,.,,37,,14.00-14.99= Diuretics,-2,.,,17,,08.00-08.99= Beta Blockers,-2,.,,56,,13.00-13.99= Converting Enzyme Inhibitors,-2,.,,38,,07.00-07.99= Antithrombotics,-2,.,,17,,.,,.,,,,.,,.,,,,.,,.,,,,.,,.,,,,.,,.,,,,.,,.,,,,.,,.,,,,.,,.,,,,.,,.,,,,.,,.,,,,.,,.,,,,.,,.,,,,.,,.,,,,.,,.,,,,.,,.,,,,.,,.,,,,.,,.,,,,.,,.,,,,.,,.,,,,,,,,,1:Not Related,-2,-2,-2,-2,-2,1:Not Related,,-2,-2,-2,1:Not Associated,-2,2:No,3:Serious,,1:Yes,77,,,,,2:No
485,129,02:00,3:24-Hour,02:00,,135,,,,,,1:Inpatient,-2,90004050,C-0601= Gastrointestinal complication (includes necrotizing enterocolitis [NEC]),-2,GI other: bloody stool,,1:Yes,03.00-03.99= Antibiotics,-2,03.00-03.99= Antibiotics,-2,03.00-03.99= Antibiotics,-2,.,,.,,.,,.,,.,,.,,.,,.,,.,,.,,.,,.,,.,,.,,.,,.,,.,,.,,.,,.,,.,,.,,.,,.,,.,,.,,.,,.,,,,,1:Yes,Immunosupressive drug opn hold /dcd,1:Yes,14.00-14.99= Diuretics,-2,.,,17,,19.00-19.99= Inotropic Agents,-2,.,,59,,16.00-16.99= Gastrointestinals,Domperidone,.,,37,,16.00-16.99= Gastrointestinals,-2,.,,38,,07.00-07.99= Antithrombotics,-2,.,,17,,14.00-14.99= Diuretics,-2,.,,124,,15.00-15.99= Electrolytes,Calcium carbonate,.,,126,,.,,.,,,,.,,.,,,,.,,.,,,,.,,.,,,,.,,.,,,,.,,.,,,,.,,.,,,,.,,.,,,,.,,.,,,,.,,.,,,,.,,.,,,,.,,.,,,,.,,.,,,,.,,.,,,,.,,.,,,,.,,.,,,,.,,.,,,,,,,,,1:Not Related,-2,-2,-2,-2,-2,2:Possibly Related,99.99,Mycophenolate mofetil,1:Yes,-1:NA,1:Not Associated,-2,1:Yes,2:Moderately Serious,,1:Yes,135,,,,,2:No
485,66,-9,-9,-9:,,68,,,,,,1:Inpatient,-2,10010971,C-2103= Ventricular dysfunction,-2,RV dysfunction,,2:No,,,,,,,,,,,,,,,,,,,,,,,,,,,,,,,,,,,,,,,,,,,,,,,,,,,,,,,,,,,,,,,,,,1:Yes,PLAN IS TO LIST PATIENT FOR HEART TRANSPLANT,1:Yes,19.00-19.99= Inotropic Agents,-2,.,,59,,16.00-16.99= Gastrointestinals,DOMPERIDONE,.,,37,,14.00-14.99= Diuretics,-2,.,,17,,13.00-13.99= Converting Enzyme Inhibitors,-2,.,,38,,07.00-07.99= Antithrombotics,-2,.,,17,,.,,.,,,,.,,.,,,,.,,.,,,,.,,.,,,,.,,.,,,,.,,.,,,,.,,.,,,,.,,.,,,,.,,.,,,,.,,.,,,,.,,.,,,,.,,.,,,,.,,.,,,,.,,.,,,,.,,.,,,,.,,.,,,,.,,.,,,,.,,.,,,,.,,.,,,,,,,,,1:Not Related,1,-2,-2,-2,-2,1:Not Related,,-2,-2,-2,1:Not Associated,-2,1:Yes,3:Serious,,2:No,,,,,,2:No
232,68,15:30,3:24-Hour,15:30,,71,,,,,,2:Outpatient,1:Yes,90004050,C-9999= Other significant complication,Decreased intake-oral and output,GI other: Poor feeding,,2:No,,,,,,,,,,,,,,,,,,,,,,,,,,,,,,,,,,,,,,,,,,,,,,,,,,,,,,,,,,,,,,,,,,1:Yes,Dietician changed formula,1:Yes,07.00-07.99= Antithrombotics,-2,.,,15,,07.00-07.99= Antithrombotics,-2,.,,20,,.,,.,,,,.,,.,,,,.,,.,,,,.,,.,,,,.,,.,,,,.,,.,,,,.,,.,,,,.,,.,,,,.,,.,,,,.,,.,,,,.,,.,,,,.,,.,,,,.,,.,,,,.,,.,,,,.,,.,,,,.,,.,,,,.,,.,,,,.,,.,,,,.,,.,,,,.,,.,,,,.,,.,,,,.,,.,,,,,,,,,1:Not Related,-2,-2,-2,-2,-2,1:Not Related,,-2,-2,-2,1:Not Associated,-2,1:Yes,3:Serious,,1:Yes,69,,,,,2:No
232,130,07:00,3:24-Hour,07:00,,132,,,,,,1:Inpatient,-2,10040741,C-0201= Cardiopulmonary arrest,-2,sinus bradycardia- HR = 80,1,1:Yes,19.00-19.99= Inotropic Agents,-2,18.00-18.99= Hormonal Agents,-2,15.00-15.99= Electrolytes,-2,15.00-15.99= Electrolytes,cALCIUM,07.00-07.99= Antithrombotics,-2,21.00-21.99= Neuromuscular Blocking Agents,-2,"22.00-22.99= Sedatives, hypnotics, anesthetics, analgesics",-2,15.00-15.99= Electrolytes,-2,.,,.,,.,,.,,.,,.,,.,,.,,.,,.,,.,,.,,.,,.,,.,,.,,.,,.,,.,,.,,.,,.,,.,,1,,,1:Yes,ECHOCARDIOGRAM DONE THAT SHOWED POOR RIGHT VENTRICULAR FUNCTION PATIENT INTUBATED,1:Yes,.,,22.16,-2,130,,.,,22.13,-2,130,,.,,03.37,-2,131,,.,,03.17,-2,127,,.,,03.23,-2,131,,.,,14.08,-2,121,,.,,99.99,PHENOXYBENZAMINE,131,,.,,99.99,TEARS NATURALE,130,,.,,.,,,,.,,.,,,,.,,.,,,,.,,.,,,,.,,.,,,,.,,.,,,,.,,.,,,,.,,.,,,,.,,.,,,,.,,.,,,,.,,.,,,,.,,.,,,,.,,.,,,,.,,.,,,,.,,.,,,,.,,.,,,,86,07:00,3,0.200,1.00,,1,,-2,,-2,1:Not Related,,-2,-2,-2,1:Not Associated,-2,1:Yes,3:Serious,,2:No,,,,,,2:No
232,153,-9,-9,-9:,,159,,,,,,1:Inpatient,-2,90030486,C-9999= Other significant complication,RSV resulting in death,Infection: Upper airway NOS- RSV,10,1:Yes,03.00-03.99= Antibiotics,-2,03.00-03.99= Antibiotics,-2,03.00-03.99= Antibiotics,-2,09.00-09.99= Biologics,Red blood cells,"22.00-22.99= Sedatives, hypnotics, anesthetics, analgesics",-2,99.99= Unclassified,Phenoxybenzamine,.,,.,,.,,.,,.,,.,,.,,.,,.,,.,,.,,.,,.,,.,,.,,.,,.,,.,,.,,.,,.,,.,,.,,.,,.,,2,,,1:Yes,"Chest x-rays, nasal swab, different positions to achieve maximum ventilation, cardiac catheterization.",1:Yes,.,,19.07,-2,158,158,.,,22.07,-2,148,158,.,,07.08,-2,148,158,.,,10.99,Nitric oxide,154,158,.,,19.03,-2,148,158,.,,22.13,-2,148,158,.,,04.02,-2,134,158,.,,.,,,,.,,.,,,,.,,.,,,,.,,.,,,,.,,.,,,,.,,.,,,,.,,.,,,,.,,.,,,,.,,.,,,,.,,.,,,,.,,.,,,,.,,.,,,,.,,.,,,,.,,.,,,,.,,.,,,,.,,.,,,,.,,.,,,,86,07:00,3,0.200,1.00,,1,,-2,,-2,1:Not Related,,-2,-2,-2,1:Not Associated,-2,1:Yes,4:Death,158,-2,,,,,,2:No
232,86,13:30,3:24-Hour,13:30,,86,,,,,,2:Outpatient,1:Yes,10010971,C-2103= Ventricular dysfunction,-2,RV dysfunction,1,1:Yes,13.00-13.99= Converting Enzyme Inhibitors,-2,.,,.,,.,,.,,.,,.,,.,,.,,.,,.,,.,,.,,.,,.,,.,,.,,.,,.,,.,,.,,.,,.,,.,,.,,.,,.,,.,,.,,.,,.,,2,,,1:Yes,echocardiogram,1:Yes,.,,07.06,-2,15,,.,,07.02,-2,20,,.,,.,,,,.,,.,,,,.,,.,,,,.,,.,,,,.,,.,,,,.,,.,,,,.,,.,,,,.,,.,,,,.,,.,,,,.,,.,,,,.,,.,,,,.,,.,,,,.,,.,,,,.,,.,,,,.,,.,,,,.,,.,,,,.,,.,,,,.,,.,,,,.,,.,,,,.,,.,,,,.,,.,,,,.,,.,,,,86,07:00,3,0.200,1.00,,2,,2,,-1,1:Not Related,,-2,-2,-2,1:Not Associated,-2,1:Yes,3:Serious,,2:No,,,,,,2:No
232,90,06:40,3:24-Hour,06:40,,91,,,,,,1:Inpatient,-2,10007617,C-0201= Cardiopulmonary arrest,-2,Cardio-respiratory arrest,1,1:Yes,19.00-19.99= Inotropic Agents,-2,15.00-15.99= Electrolytes,Calcium,15.00-15.99= Electrolytes,-2,"22.00-22.99= Sedatives, hypnotics, anesthetics, analgesics",-2,21.00-21.99= Neuromuscular Blocking Agents,-2,03.00-03.99= Antibiotics,-2,19.00-19.99= Inotropic Agents,-2,.,,.,,.,,.,,.,,.,,.,,.,,.,,.,,.,,.,,.,,.,,.,,.,,.,,.,,.,,.,,.,,.,,.,,.,,1,,,1:Yes,"Patient was intubated, intra-venous line, atrial line started-echo",1:Yes,.,,07.06,-2,15,,.,,07.02,-2,20,,.,,13.02,-2,86,,.,,.,,,,.,,.,,,,.,,.,,,,.,,.,,,,.,,.,,,,.,,.,,,,.,,.,,,,.,,.,,,,.,,.,,,,.,,.,,,,.,,.,,,,.,,.,,,,.,,.,,,,.,,.,,,,.,,.,,,,.,,.,,,,.,,.,,,,.,,.,,,,.,,.,,,,.,,.,,,,.,,.,,,,86,07:00,3,0.200,1.00,,1,,-2,,-2,1:Not Related,,-2,-2,-2,1:Not Associated,-2,2:No,3:Serious,,2:No,,,,,,2:No
363,26,04:55,3:24-Hour,04:55,,26,,,,,,1:Inpatient,-2,90030092,C-0601= Gastrointestinal complication (includes necrotizing enterocolitis [NEC]),-2,Necrosis GI: Small bowel NOS,,1:Yes,14.00-14.99= Diuretics,-2,16.00-16.99= Gastrointestinals,GLYCERIN SUPPOSITORY,.,,.,,.,,.,,.,,.,,.,,.,,.,,.,,.,,.,,.,,.,,.,,.,,.,,.,,.,,.,,.,,.,,.,,.,,.,,.,,.,,.,,.,,,,,1:Yes,N-G TUBE TO LOW SUCTION. TPN(TOTOAL PARENTERAL NUTRITION) DAILY ABDOMINAL X-RAYS. PATIENT MADE NPO SO STUDY DRUG IS STOPPED AND PUT ON HOLD FOR 7 DAYS.,1:Yes,07.00-07.99= Antithrombotics,-2,.,,7,,03.00-03.99= Antibiotics,-2,.,,25,,03.00-03.99= Antibiotics,-2,.,,24,,14.00-14.99= Diuretics,-2,.,,7,,16.00-16.99= Gastrointestinals,-2,.,,26,,03.00-03.99= Antibiotics,-2,.,,24,,"22.00-22.99= Sedatives, hypnotics, anesthetics, analgesics",-2,.,,26,,.,,.,,,,.,,.,,,,.,,.,,,,.,,.,,,,.,,.,,,,.,,.,,,,.,,.,,,,.,,.,,,,.,,.,,,,.,,.,,,,.,,.,,,,.,,.,,,,.,,.,,,,.,,.,,,,.,,.,,,,.,,.,,,,.,,.,,,,,,,,,1:Not Related,1,-2,-2,-2,-2,1:Not Related,,-2,-2,-2,1:Not Associated,-2,2:No,3:Serious,,2:No,,,,,,2:No