blind_id,EVENTNO,CODE_SITE_P,CODE_SITE,CDNAM_SITE,onset_age,review_age,AGREE,AGREE_C,SPECIFY_P,SPECIFY,EVTNAM_P,EVTNAM,EVTNAM_SITE,SERIOUS,EXPECTED,REL_DRUG,REL_TEST,TEST_SPEC,final_age
1023,24,,C9999,renal function decline,28,571,1,2,-2,C0001,-2,acute renal dysfunction,-2,3,1,2,1,-2,1558
1023,39,90004084,,respiratory failure,,1656,2,,10010971,,RV failure,,,3,1,1,1,-2,1656
427,43,10048038,,-2,,1530,1,,-2,,-2,,,3,1,1,1,-2,1530
427,73,10021143,,-2,,1544,1,,-2,,-2,,,3,1,1,1,-2,1544
522,51,10007617,,-2,,1522,2,,10010971,,RV failure,,,3,1,2,1,-2,1593
522,49,10040741,,-2,,1522,2,,10010971,,RV failure,,,3,1,1,1,-2,1522
522,59,10006487,,-2,,1522,1,,-2,,-2,,,3,1,1,1,-2,1593
522,48,10010971,,-2,,1522,1,,-2,,-2,,,3,1,1,1,-2,1522
485,50,10021143,,-2,,1512,2,,10003504,,aspiration,,,3,1,1,1,-2,1512
485,46,10021143,,-2,,1512,2,,10010971,,RV failure,,,3,1,1,1,-2,1512
485,52,10021143,,-2,,1512,2,,10010971,,RV failure,,,3,1,1,1,-2,1512
485,81,10010971,,-2,,1526,1,,-2,,-2,,,3,1,1,1,-2,1583
485,57,10010971,,-2,,1512,1,,-2,,-2,,,3,1,1,1,-2,1512
232,74,90004050,,poor feeding,,1487,1,,-2,,-2,,,3,1,1,1,-2,1487
232,91,10040741,,-2,,1487,2,,10010971,,RV dysfunction,,,3,1,1,1,-2,1487
232,104,90030486,,-2,,1488,2,,90030370,,RSV bronchiolitis,,,3,1,1,1,-2,1488
232,79,10010971,,-2,,1487,1,,-2,,-2,,,3,1,2,1,-2,1487
232,80,10007617,,-2,,1487,2,,10010971,,RV dysfunction,,,3,1,2,1,-2,1487
363,55,90030092,,-2,,1471,1,,-2,,-2,,,3,1,2,1,-2,1471
363,72,10010004,,-2,,1485,1,,-2,,-2,,,3,1,1,1,-2,1485
363,78,90004050,,NEC,,1485,2,,10014878,,NEC,,,3,1,1,1,-2,1485
34,113,90004050,,vomiting and diarrhea,,1430,1,,-2,,-2,,,3,1,1,1,-2,1430
785,129,90030982,,coarctation of aorta,,1279,1,,-2,,-2,,,3,1,1,1,-2,1279
785,132,90004050,,difficulty feeding,,1304,1,,-2,,-2,,,3,1,1,1,-2,1304
785,148,,C9999,Restrictive ASD,57,99,1,1,-2,-2,-2,-2,-2,3,1,1,1,-2,1299
785,246,90030478,,-2,,446,2,,90004068,,rotavirus gastroenteritis,,,3,1,1,1,-2,446
1047,190,,C9999,hypoxia,178,206,1,2,-2,C0708,-2,-2,-2,3,1,1,1,-2,206
1240,194,,C1901,-2,111,146,1,1,-2,-2,-2,-2,-2,3,1,1,1,-2,146
1240,283,90030492,,-2,,436,1,,-2,,-2,,,3,1,1,1,-2,1150
351,178,,C0201,-2,56,67,1,1,-2,-2,-2,-2,-2,4,1,1,1,-2,67
938,171,,C2201,-2,28,60,1,1,-2,-2,-2,-2,-2,3,1,1,1,-2,60
938,173,,C9999,cerebral infarction,30,60,1,2,-2,C1901,-2,-2,-2,3,1,1,1,-2,1215
938,189,,C9999,conduit and RPA stenosis,83,113,1,1,-2,-2,-2,-2,-2,3,1,1,1,-2,113
938,7,,C9999,hypoxia,109,144,1,2,-2,C0708,-2,-2,-2,1,1,2,1,-2,144
938,235,10014878,,gi bleed - necrotising enterocolitis,133,244,1,,-2,,-2,,-2,3,1,1,1,-2,244
986,236,10021099,,hypotension,15,41,1,,-2,,-2,,-2,3,1,3,1,-2,41
29,331,10021143,,-2,,123,1,,-2,,-2,,,3,1,1,1,-2,123
1190,326,90004028,,restrictive ASD,,84,1,,-2,,-2,,,3,1,1,1,-2,84
1190,334,90030294,,-2,,113,1,,-2,,-2,,,3,1,1,1,-2,113
1190,338,10021143,,-2,,113,1,,-2,,-2,,,3,1,1,1,-2,113
1190,343,90030294,,-2,,148,2,,90030492,,UTI - unknown wbc,,,3,1,1,1,-2,148
1190,363,10021143,,-2,,177,2,,10030220,,reflux,,,3,1,1,1,-2,225
1190,386,10021143,,-2,,225,1,,-2,,-2,,,3,1,1,1,-2,643
1190,375,10021143,,-2,,225,2,,90004018,,anemia,,,3,1,1,1,-2,225
1190,387,10051228,,-2,,225,1,,-2,,-2,,,3,1,1,1,-2,643
1190,390,10051228,,-2,,242,1,,-2,,-2,,,3,1,1,1,-2,309
1190,398,10040050,,-2,,344,1,,-2,,-2,,,3,1,1,1,-2,394
1190,399,10021143,,-2,,379,2,,10040050,,possible sepsis,,,3,1,1,1,-2,394
1190,403,10048038,,-2,,449,1,,-2,,-2,,,3,1,1,1,-2,449
1190,402,90030418,,-2,,438,1,,-2,,-2,,,3,1,1,1,-2,506
1190,411,90004028,,pulmonary vein obstruction,,541,2,,90030976,,pulmonary vein obstruction from atrial stent,,,3,1,1,1,-2,541
412,344,10040050,,-2,,90,1,,-2,,-2,,,3,1,1,1,-2,167
412,354,10035598,,-2,,90,1,,-2,,-2,,,3,1,1,1,-2,119
412,361,10010971,,-2,,91,1,,-2,,-2,,,3,1,1,1,-2,585
412,369,10038448,,-2,,119,1,,-2,,-2,,,3,1,1,1,-2,119
412,378,10007617,,-2,,167,1,,-2,,-2,,,3,1,1,1,-2,167
412,376,10010971,,-2,,167,1,,-2,,-2,,,3,1,1,1,-2,
412,385,10035598,,-2,,167,1,,-2,,-2,,,3,1,1,1,-2,167
412,384,10037394,,-2,,167,2,,90030774,,lung injury due to operative procedure,,,3,1,1,1,-2,167
412,379,10021143,,-2,,167,2,,10013968,,respiratory distress,,,3,1,1,1,-2,448
412,393,10007617,,-2,,251,2,,10050816,,upper airway obstruction,,,3,1,1,1,-2,585
412,408,10040050,,-2,,448,1,,-2,,-2,,,3,1,1,1,-2,448
412,401,90004084,,respiratory failure,,380,1,,-2,,-2,,,3,1,1,1,-2,448
412,406,90030370,,-2,,448,1,,-2,,-2,,,3,1,1,1,-2,448
412,405,10053491,,-2,,448,1,,-2,,-2,,,3,1,1,1,-2,448
412,407,10038448,,-2,,448,1,,-2,,-2,,,3,1,1,1,-2,448
412,409,10017089,,-2,,448,1,,-2,,-2,,,3,1,1,1,-2,448
412,410,90030370,,-2,,559,1,,-2,,-2,,,3,1,1,1,-2,559
909,364,10021099,,-2,,53,1,,-2,,-2,,,3,1,2,1,-2,101
909,365,10043607,,-2,,101,2,,10051094,,femoral artery occlusion from catheter,,,3,1,1,1,-2,101
909,374,10042434,,-2,,101,2,,10003504,,pulmonary aspiration,,,3,1,1,1,-2,544
511,11,,C9999,increased vomiting and decreased sats,61,678,2,2,10021143,C0601,hypoxia,-2,-2,3,1,1,1,-2,1775
511,34,,C9999,urinary tract infection,179,691,1,1,-2,-2,-2,-2,-2,3,1,1,1,-2,691
134,31,,C9999,upper respiratory infection,109,627,2,2,90030486,C0601,URTI,-2,-2,3,1,1,1,-2,627
134,42,90030370,,-2,,1640,1,,-2,,-2,,,3,1,1,1,-2,1640
183,17,,C2201,-2,24,599,1,1,-2,-2,-2,-2,-2,3,1,1,1,-2,599
983,21,,C0201,-2,44,584,1,1,-2,-2,-2,-2,-2,3,1,2,1,-2,584
983,27,,C0601,-2,56,595,1,1,-2,-2,-2,-2,-2,3,1,1,1,-2,595
983,28,,C9999,lung infiltrate vs atelectasis,62,596,1,2,-2,C0708,-2,-2,-2,3,1,1,1,-2,596
983,29,,C0601,-2,67,596,2,2,10040050,C1802,Infection: Sepsis NOS,-2,-2,3,1,1,1,-2,596
983,35,,C0601,-2,87,596,1,1,-2,-2,-2,-2,-2,3,1,1,1,-2,596
1203,38,10048038,,-2,,1528,1,,-2,,-2,,,3,1,1,1,-2,1528
1203,71,10021099,,-2,,1542,2,,90030982,,shunt stenosis,,,3,1,1,1,-2,1599
118,60,10021143,,-2,,1449,1,,-2,,-2,,,3,1,1,1,-2,1449
118,110,90004050,,poor feeding,,1464,1,,-2,,-2,,,3,1,1,1,-2,1464
118,111,90004050,,vomiting and diarrhea,,1464,2,,10014866,,gastroenteritis,,,3,1,1,1,-2,1464
118,117,90004050,,poor feeding,,1464,1,,-2,,-2,,,3,1,1,1,-2,1464
808,77,10042434,,-2,,1446,1,,-2,,-2,,,3,1,2,1,-2,1456
666,84,10021143,,-2,,1429,1,,-2,,-2,,,3,1,1,1,-2,1429
666,133,10048038,,-2,,1430,1,,-2,,-2,,,3,1,1,1,-2,1430
711,122,90004028,,shunt occlusion,,1438,2,,90030982,,shunt occlusion,,,3,1,1,1,-2,1494
61,121,90030982,,aortic coarctation,,1426,1,,-2,,-2,,,3,1,1,1,-2,1426
61,140,90004028,,cardiac - general,,1426,2,,90030982,,coarctation of aorta and PA stenosis,,,3,1,1,1,-2,1482
61,143,,C0708,-2,183,246,1,1,-2,-2,-2,-2,-2,3,1,1,1,-2,1446
259,90,90030360,,-2,,1384,1,,-2,,-2,,,3,1,1,1,-2,1384
128,146,,C0201,-2,100,140,2,1,10042434,-2,Sudden death,-2,-2,4,2,2,1,-2,1340
529,123,90004050,,poor feeding,,1311,1,,-2,,-2,,,3,1,1,1,-2,1311
529,126,10040741,,-2,,1311,1,,-2,,-2,,,3,1,1,1,-2,1311
529,128,10003598,,-2,,1311,1,,-2,,-2,,,3,1,1,1,-2,1311
529,149,,C9999,HYPOXIA SECONDARY TO FEVERS AND RPA STENOSIS AND,82,131,2,2,90030982,C0708,RPA and pulmonary vein stenoses,-2,-2,3,1,1,1,-2,1331
529,154,10013968,,-2,,1320,1,,-2,,-2,,,3,1,1,1,-2,1320
529,165,,C9999,ectopic atrial tachycardia,145,212,1,2,-2,C1806,-2,-2,-2,3,1,1,1,-2,212
529,181,,C9999,tachypnea,206,233,1,2,-2,C0708,-2,hypoxia,-2,3,1,1,1,-2,1269
529,182,,C1802,-2,214,233,1,1,-2,-2,-2,-2,-2,3,1,1,1,-2,1269
529,206,,C1808,-2,245,281,1,1,-2,-2,-2,-2,-2,3,1,1,1,-2,1269
529,215,,C9999,hypernatremia,264,318,1,1,-2,-2,-2,-2,-2,3,1,1,1,-2,347
529,216,,C9999,recurrent pulmonary vein stenosis,278,318,1,2,-2,C2101,-2,-2,-2,3,1,1,1,-2,347
529,217,,C1808,-2,297,318,1,1,-2,-2,-2,-2,-2,3,1,1,1,-2,347
529,260,10021143,,-2,,478,2,,90030982,,pulmonary vein stenosis,,,3,1,1,1,-2,478
911,273,10007617,,-2,,278,1,,-2,,-2,,,3,1,1,1,-2,278
1019,255,90030351,,-2,,202,2,,10048038,,wound infection - unknown ANC,,,3,1,1,1,-2,202
1019,303,90004084,,croup,,369,1,,-2,,-2,,,3,1,1,1,-2,369
755,270,10021099,,-2,,178,2,,10010971,,RV dysfunction,,,3,1,1,1,-2,962
755,269,10021143,,-2,,171,2,,90030982,,LPA stenosis,,,3,1,1,1,-2,962
755,274,10043607,,-2,,235,2,,90030960,,right femoral artery thrombosis,,,3,1,1,1,-2,1013
755,14,10035598,,-2,,313,1,,-2,,-2,,,3,1,1,1,-2,313
780,332,90004084,,pneumonia,,383,2,,90030418,,pneumonia,,,3,1,1,1,-2,383
400,3,90004084,,bronchiolitis,,132,1,,-2,,-2,,,3,1,1,1,-2,162
400,12,10021143,,-2,,162,1,,-2,,-2,,,3,1,1,1,-2,278
400,13,10047290,,-2,,162,2,,90030700,,RV-PA conduit laceration,,,3,1,1,1,-2,162
400,296,10035598,,-2,,161,1,,-2,,-2,,,3,1,1,1,-2,
1092,281,90004050,,pneumotosis intestinalis,,39,2,,10014878,,necrotizing enterocolitis,,,3,1,1,1,-2,766
628,285,90004084,,pulmonary - upper respiratory infection,,40,1,,-2,,-2,,,3,1,1,1,-2,40
628,321,10035598,,-2,,221,1,,-2,,-2,,,3,1,1,1,-2,
958,313,90004028,,narrowing of aortic arch,,80,2,,90030982,,aortic arch stenosis and conduit stenosis,,,3,1,1,1,-2,
503,342,10021143,,-2,,41,2,,10010971,,RV failure,,,3,1,1,1,-2,76
503,356,10010971,,-2,,77,1,,-2,,-2,,,3,1,1,1,-2,77
1244,1,,C0708,-2,64,820,1,1,-2,-2,-2,-2,-2,3,1,2,1,-2,820
1244,4,,C2103,-2,164,820,1,1,-2,-2,-2,-2,-2,3,1,1,1,-2,820
868,15,,C9999,cough/URI,192,791,2,2,10021143,C0708,Hypoxia,-2,-2,3,1,1,1,-2,791
868,18,,C9999,hypoxia,223,791,1,2,-2,C0708,-2,-2,-2,3,1,1,1,-2,791
1227,2,,C1701,-2,103,792,2,2,10010971,C2103,RV dysfunction,-2,-2,3,1,1,1,-2,792
729,5,,C9999,hypoxia,112,769,2,2,10021143,C0708,Hypoxia,-2,-2,3,1,1,1,-2,769
729,62,90030982,,LPA stenosis,,1795,1,,-2,,-2,,,3,1,1,1,-2,1795
1064,22,,C9999,LPA stenosis,111,644,1,2,-2,C2101,-2,-2,-2,3,1,1,1,-2,644
1064,9,,C9999,LPA stenosis,13,643,1,2,-2,C2101,-2,-2,-2,3,1,1,1,-2,643
928,16,,C0601,-2,11,584,1,1,-2,-2,-2,-2,-2,3,1,1,1,-2,584
928,32,,C9999,desaturation,81,596,2,2,90030982,C2101,Vascular - Other (shunt stenosis),-2,-2,3,1,1,1,-2,596
366,40,90004068,,sepsis,,1547,1,,-2,,-2,,,3,1,1,1,-2,1547
366,66,10021143,,-2,,1547,1,,-2,,-2,,,3,1,1,1,-2,1547
109,75,10021143,,-2,,1527,2,,90030982,,shunt stenosis and pa hypoplasia,,,3,1,1,1,-2,1527
109,83,10040050,,-2,,1527,1,,-2,,-2,,,3,1,1,1,-2,1527
109,82,10035598,,-2,,1527,1,,-2,,-2,,,3,1,1,1,-2,1527
109,94,10037660,,-2,,1527,1,,-2,,-2,,,3,1,1,1,-2,1527
109,124,90004084,,bronchomalacia,,1528,1,,-2,,-2,,,3,1,1,1,-2,1528
109,147,,C9999,hypoxia,308,348,1,2,-2,C0708,-2,-2,-2,3,1,1,1,-2,1548
597,67,10021143,,-2,,1528,2,,90030370,,RSV bronchiolitis,,,3,1,1,1,-2,1528
597,70,90030486,,-2,,1528,1,,-2,,-2,,,3,1,1,1,-2,1528
597,76,10021143,,-2,,1542,2,,90030370,,RSV bronchiolitis,,,3,1,1,1,-2,1542
699,98,90030486,,-2,,1480,1,,-2,,-2,,,3,1,1,1,-2,1480
328,103,10021143,,-2,,1479,1,,-2,,-2,,,3,1,1,1,-2,1479
1058,186,,C1508,-2,358,382,1,1,-2,-2,-2,-2,-2,3,1,1,1,-2,382
1058,196,,C1508,-2,384,402,1,1,-2,-2,-2,-2,-2,3,1,1,1,-2,415
1058,213,,C1508,-2,412,452,1,1,-2,-2,-2,-2,-2,3,1,1,1,-2,1403
1058,247,10021143,,-2,,612,2,,90030486,,upper respiratory tract infection,,,3,1,1,1,-2,612
451,115,10021143,,-2,,1405,1,,-2,,-2,,,3,1,1,1,-2,1405
451,144,,C1508,-2,171,225,1,1,-2,-2,-2,-2,-2,2,1,1,1,-2,1425
1194,89,90004068,,suspected sepsis,,1418,1,,-2,,-2,,,3,1,1,1,-2,1418
842,86,10040050,,-2,,1396,1,,-2,,-2,,,3,1,1,1,-2,1396
842,135,10021143,,-2,,1397,1,,-2,,-2,,,3,1,1,1,-2,1397
1084,118,90030294,,-2,,1369,2,,90030486,,URTI,,,3,1,1,1,-2,1425
1084,136,90004068,,post vaccination fever,,1369,2,,10037660,,fever post vaccination,,,3,1,1,1,-2,1369
79,134,90030122,,-2,,1349,1,,-2,,-2,,,3,1,1,1,-2,1349
79,159,90030492,,-2,,1358,1,,-2,,-2,,,3,1,1,1,-2,1358
79,166,,C0601,-2,192,250,1,1,-2,-2,-2,-2,-2,3,1,1,1,-2,250
124,414,90004028,,cardiac - general,,1350,1,,-2,,-2,,,3,1,1,1,-2,1397
124,212,,C9999,middle ear infection,290,348,1,1,-2,-2,-2,-2,-2,3,1,1,1,-2,348
495,160,,C9999,hypoxia,169,242,1,2,-2,C0708,-2,-2,-2,3,1,1,1,-2,242
236,229,,C9999,pneumonia,119,355,1,1,-2,-2,-2,-2,-2,3,1,1,1,-2,355
657,175,,C9999,ventricular dysfunction,76,106,1,2,-2,C2103,-2,-2,-2,3,1,1,1,-2,241
657,191,,C0601,-2,135,159,2,2,10021143,C0708,Hypoxia,-2,-2,3,1,1,1,-2,159
799,218,,C9999,hypoxia/LPA stenosis,159,179,1,2,-2,C0708,-2,-2,-2,3,1,1,1,-2,179
75,185,,C1808,-2,56,82,1,2,-2,C1802,-2,sepsis with positive blood cultures,-2,3,1,1,1,-2,152
75,220,,C9999,vomiting/GE reflux,110,152,1,2,-2,C0601,-2,-2,-2,3,1,1,1,-2,181
75,232,90004068,,Infection - other,,1201,1,,-2,,-2,,,3,1,1,1,-2,1201
75,15,10021143,,-2,,454,2,,10049083,,Type A flu URTI,,,3,1,1,1,-2,454
75,252,10021143,,-2,,312,1,,-2,,-2,,,3,1,1,1,-2,1103
75,256,90004094,,SVC syndrome,,312,2,,90004028,,edema post op,,,3,1,1,1,-2,312
75,417,10021143,,-2,,1154,2,,90030486,,RSV bronchiolitis,,,3,1,1,1,-2,1154
75,16,90004068,,ventricular tachycardia,,494,2,,10040050,,sepsis with multi-organ failure,,,3,1,1,1,-2,570
1087,203,,C1802,-2,46,60,2,1,10048038,-2,wound infection,-2,-2,3,1,1,1,-2,126
1087,219,,C9999,hypoxia,70,97,1,2,-2,C0708,-2,hypoxia,-2,3,1,1,1,-2,97
1087,228,,C9999,rotavirus infection,97,126,1,2,-2,C0601,-2,-2,-2,3,1,1,1,-2,1048
1087,230,,C2101,-2,101,126,1,1,-2,-2,-2,-2,-2,3,1,1,1,-2,130
1087,251,10035725,,-2,,257,2,,90030418,,pneumonia with unknown ANC,,,3,1,1,1,-2,257
437,241,90030486,,-2,,216,1,,-2,,-2,,,3,1,1,1,-2,216
437,242,10021143,,-2,,216,2,,90030982,,shunt stenosis - inadequate pulmonary blood flow,,,3,1,1,1,-2,216
437,243,10046574,,-2,,216,2,,90030492,,UTI with unknown ANC,,,3,1,1,1,-2,216
664,245,10047706,,-2,,136,1,,-2,,-2,,,3,1,1,1,-2,136
664,2,10021099,,-2,,213,2,,90030956,,aortic dissection,,,3,1,1,1,-2,213
566,249,10047706,,-2,,123,2,,90004068,,gastroenteritis,,,3,1,1,1,-2,123
566,250,10047706,,-2,,123,2,,10017636,,gall bladder obstruction by stone,,,3,1,2,1,-2,123
566,275,10047706,,-2,,187,1,,-2,,-2,,,3,1,1,1,-2,187
566,8,10047706,,-2,,235,1,,-2,,-2,,,3,1,1,1,-2,235
566,10,10047706,,-2,,235,1,,-2,,-2,,,3,1,1,1,-2,265
566,306,10042604,,-2,,290,1,,-2,,-2,,,3,1,1,1,-2,327
566,329,10042604,,-2,,381,1,,-2,,-2,,,3,1,1,1,-2,965
1158,282,90030982,,cardiac - general,,61,1,,-2,,-2,,,3,1,1,1,-2,886
399,317,10035725,,-2,,202,1,,-2,,-2,,,3,1,1,1,-2,256
399,391,90004050,,abdominal situs inversus,,397,1,,-2,,-2,,,3,1,1,1,-2,397
1061,412,90030122,,-2,,762,1,,-2,,-2,,,3,1,1,1,-2,813
1229,318,90030982,,shunt stenosis,,125,1,,-2,,-2,,,3,1,1,1,-2,179
926,370,10021143,,-2,,270,1,,-2,,-2,,,3,1,2,1,-2,270
361,358,10051094,,-2,,208,2,,90030960,,right femoral arterial pseudoaneurysm,,,3,1,1,1,-2,702
361,368,10051094,,-2,,236,2,,90030960,,femoral artery pseudoaneurysm,,,3,1,1,1,-2,236
1216,347,10035598,,-2,,193,2,,10051228,,chylothorax,,,3,1,1,1,-2,193
1216,373,10021143,,-2,,222,2,,90030486,,URTI,,,3,1,1,1,-2,713
1081,330,10021143,,-2,,51,1,,-2,,-2,,,3,1,3,1,-2,
375,372,90004084,,diaphragm hemiparesis,,51,2,,10012725,,phrenic nerve palsy,,,3,1,1,1,-2,99
837,25,,C2103,-2,184,726,1,2,-2,C1702,-2,-2,-2,3,1,1,1,-2,726
441,7,,C0201,-2,15,642,1,1,-2,-2,-2,-2,-2,3,1,3,1,-2,642
441,8,,C1801,-2,17,642,1,1,-2,-2,-2,-2,-2,3,1,1,1,-2,642
441,12,,C1904,-2,19,642,1,1,-2,-2,-2,-2,-2,3,1,1,1,-2,642
441,13,,C0201,-2,27,643,2,2,10043607,C1904,Thrombosis- shunt,-2,-2,3,1,1,1,-2,643
441,23,,C9999,airway obstruction,108,654,1,2,-2,C1903,-2,-2,-2,3,1,1,1,-2,654
441,64,10021143,,-2,,1668,2,,10050816,,tracheal obstruction,,,3,1,1,1,-2,1668
441,87,10007617,,-2,,1682,1,,-2,,-2,,,3,1,1,1,-2,1682
441,97,10028154,,-2,,1682,1,,-2,,-2,,,3,1,1,1,-2,1682
588,36,,C9999,fever,14,516,1,1,-2,-2,-2,-2,-2,3,1,1,1,-2,516
588,41,10003668,,-2,,1529,2,,10003662,,atrial flutter,,,3,1,1,1,-2,1529
588,47,10021143,,-2,,1529,2,,10043607,,shunt thrombosis,,,3,1,1,1,-2,1529
588,58,10021143,,-2,,1529,2,,10013968,,respiratory distress with URTI,,,3,1,1,1,-2,1529
588,65,10021143,,-2,,1529,2,,10013968,,upper respiratory infection with distress,,,3,1,1,1,-2,1529
655,425,10034474,,-2,,1537,1,,-2,,-2,,,3,1,1,1,-2,1537
634,101,10021143,,-2,,1421,2,,10018876,,relative anemia,,,3,1,1,1,-2,1421
1097,138,,C1702,-2,96,258,1,1,-2,-2,-2,-2,-2,3,1,1,1,-2,258
1097,137,10007617,,-2,,1356,2,,10010971,,RV dysfunction,,,3,1,1,1,-2,1356
1097,131,,,-2,,1356,2,,10010971,,RV dysfunction,,,3,1,1,1,-2,1356
1097,130,10021143,,-2,,1356,2,,10018876,,relative anemia,,,3,1,1,1,-2,1356
1097,205,,C0601,-2,287,326,1,1,-2,-2,-2,-2,-2,3,1,1,1,-2,1314
1097,234,90030486,,fever and uri symptoms,377,441,1,,-2,,-2,,-2,3,1,1,1,-2,441
422,116,10040050,,-2,,1340,1,,-2,,-2,,,3,1,1,1,-2,1340
776,150,,C9999,Gastroenteritis,107,145,1,2,-2,C0601,-2,-2,-2,3,1,1,1,-2,1345
907,172,,C0601,-2,68,108,1,1,-2,-2,-2,-2,-2,3,1,1,1,-2,108
907,180,,C9999,cyanosis,102,115,1,1,-2,-2,-2,-2,-2,3,1,1,1,-2,115
907,183,,C1702,-2,109,144,1,1,-2,-2,-2,-2,-2,3,1,2,1,-2,161
907,257,10047706,,-2,,374,1,,-2,,-2,,,3,1,1,1,-2,374
527,207,,C0708,-2,70,93,2,2,90004068,C1808,"Infection - Other (Specify, suspected sepsis)",possible sepsis - no positive culture,-2,3,1,1,1,-2,1081
527,221,,C2101,-2,106,1081,2,1,90030982,-2,shunt stenosis,-2,-2,3,1,1,1,-2,1081
527,261,90030378,,-2,,290,2,,90004068,,rotavirus gastroenteritis,,,3,1,1,1,-2,290
527,312,10049083,,-2,,472,2,,10035755,,pneumonia,,,3,1,1,1,-2,472
700,248,10034474,,-2,,117,1,,-2,,-2,,,3,1,1,1,-2,117
700,258,10018876,,-2,,117,1,,-2,,-2,,,3,1,1,1,-2,181
700,277,90030351,,-2,,181,2,,10048038,,wound infection - unknown ANC,,,3,1,1,1,-2,194
732,279,10047290,,-2,,70,1,,-2,,-2,,,3,1,1,1,-2,797
732,278,90030351,,-2,,70,2,,90030422,,mediastinitis,,,3,1,1,1,-2,797
732,9,90030351,,-2,,118,2,,10011642,,wound infection,,,3,1,1,1,-2,118
732,297,10012745,,-2,,147,1,,-2,,-2,,,3,1,1,1,-2,173
1132,322,90030982,,shunt stenosis,,220,1,,-2,,-2,,,3,1,1,1,-2,244
850,382,10021143,,-2,,689,1,,-2,,-2,,,3,1,3,1,-2,689
98,400,90004068,,r/o infection,,347,1,,-2,,-2,,,3,1,1,1,-2,347
701,395,10017089,,-2,,243,1,,-2,,-2,,,3,1,1,1,-2,243
340,348,10021143,,-2,,67,2,,90030982,,RPA stenosis,,,3,1,1,1,-2,67
340,392,10021143,,-2,,161,1,,-2,,-2,,,3,1,1,1,-2,161
1171,3,,C9999,pneumonia,129,798,1,1,-2,-2,-2,-2,-2,3,1,1,1,-2,798
136,10,,C0601,-2,40,670,1,1,-2,-2,-2,-2,-2,3,1,1,1,-2,670
999,45,10012174,,-2,,1569,1,,-2,,-2,,,3,1,2,1,-2,1569
999,88,10010971,,-2,,1583,1,,-2,,-2,,,3,1,1,1,-2,1583
567,30,,C9999,respiratory distress,12,536,1,2,-2,C1503,-2,-2,-2,3,1,1,1,-2,536
567,37,,C9999,Sano shunt failure,33,536,1,2,-2,C2101,-2,-2,-2,3,1,1,1,-2,536
567,61,10021143,,-2,,1549,2,,10006487,,bronchomalacia,,,3,1,1,1,-2,1549
567,96,90030486,,-2,,1563,1,,-2,,-2,,,3,1,1,1,-2,1563
567,108,90004078,,spinal muscle atrophy,,1564,2,,10028351,,spinal muscle atrophy,,,3,1,1,1,-2,1564
567,107,10017089,,-2,,1564,1,,-2,,-2,,,3,1,1,1,-2,1564
567,112,10042434,,-2,,1564,1,,-2,,-2,,,4,1,1,1,-2,1564
541,93,10037660,,-2,,1545,1,,-2,,-2,,,3,1,1,1,-2,1545
541,415,90004050,,vomiting,,1555,1,,-2,,-2,,,3,1,1,1,-2,1555
8,142,,C9999,Severe hypoxemia,80,138,1,2,-2,C0708,-2,-2,-2,3,1,2,1,-2,1341
8,158,90030982,,coarctation of aorta,,1321,1,,-2,,-2,,,3,1,1,1,-2,1321
742,141,,C9999,Left lung atelectasis,44,104,1,1,-2,-2,-2,-2,-2,2,1,2,1,-2,1307
742,151,,C0601,-2,81,107,1,1,-2,-2,-2,-2,-2,3,1,1,1,-2,1307
742,157,10021143,,-2,,1287,1,,-2,,-2,,,3,1,1,1,-2,1287
742,167,,C0708,-2,121,188,2,2,90030982,C2101,"Vascular - Other (Specify, possible shunt obstruction)",-2,-2,3,1,1,1,-2,188
742,177,,C0708,-2,177,188,1,1,-2,-2,-2,-2,-2,3,1,1,1,-2,224
742,179,,C0901,-2,182,195,1,1,-2,-2,-2,-2,-2,3,1,1,1,-2,241
742,193,,C1701,-2,186,241,1,2,-2,C1503,-2,-2,-2,3,1,1,1,-2,241
742,208,,C0708,-2,233,323,2,2,90030982,C2101,"Vascular - Other (Specify, possible shunt obstruction)",-2,-2,3,1,1,1,-2,323
1020,170,,C9999,sinus tachycardia,74,90,2,2,90030982,C2101,"Vascular - Other (Specify, possible shunt obstruction)",-2,-2,3,1,1,1,-2,117
1020,162,10013968,,-2,,1216,2,,10012725,,phrenic nerve dysfunction,,,3,1,1,1,-2,1216
1020,201,,C9999,urinary tract infection,148,186,1,1,-2,-2,-2,-2,-2,3,1,1,1,-2,186
1020,202,,C2103,-2,167,186,2,2,90030982,C2101,"Vascular - Other (Specify, possible shunt obstruction)",-2,-2,3,1,1,1,-2,223
273,164,,C0201,-2,22,68,1,1,-2,-2,-2,-2,-2,3,1,1,1,-2,68
273,176,,C9999,hypoglycemia,46,68,1,1,-2,-2,-2,-2,-2,3,1,1,1,-2,1125
273,188,,C9999,possible sepsis,57,121,1,2,-2,C1808,-2,-2,-2,3,1,1,1,-2,121
5,174,,C2103,-2,15,41,1,2,-2,C1101,-2,-2,-2,3,1,1,1,-2,270
1197,253,10048038,,-2,,121,1,,-2,,-2,,,3,1,1,1,-2,121
1197,259,90030982,,shunt stenosis,,121,1,,-2,,-2,,,3,1,1,1,-2,121
1197,276,90030982,,shunt obstruction,,185,1,,-2,,-2,,,3,1,1,1,-2,185
185,237,90030122,,reduced growth velocity,26,67,1,,-2,,-2,,-2,3,1,1,1,-2,67
185,254,90030304,,-2,,149,2,,10048038,,wound infection - unknown ANC,,,3,1,1,1,-2,156
185,271,90030982,,shunt stenosis,,156,1,,-2,,-2,,,3,1,1,1,-2,156
185,272,90004028,,presumed infection,,156,2,,90030396,,presumed endocarditis of shunt,,,3,1,1,1,-2,261
185,7,10049083,,-2,,261,2,,10037660,,fever nyd,,,3,1,1,1,-2,940
185,11,10051228,,-2,,291,1,,-2,,-2,,,3,1,1,1,-2,291
92,239,90030982,,shunt stenosis,64,124,1,,-2,,-2,,-2,3,1,1,1,-2,124
92,289,10047290,,-2,,318,1,,-2,,-2,,,3,1,1,1,-2,318
491,197,,C9999,hypoxia,55,73,1,2,-2,C0708,-2,hypoxia,-2,3,1,2,1,-2,1074
1228,267,10021143,,-2,,111,1,,-2,,-2,,,3,1,2,1,-2,902
1228,335,90004068,,viral infection,,374,1,,-2,,-2,,,3,1,1,1,-2,374
1228,360,90030486,,-2,,434,1,,-2,,-2,,,3,1,1,1,-2,953
151,280,90030984,,-2,,94,2,,10014878,,necrotizing enterocolitis,,,3,1,1,1,-2,142
151,284,90030294,,-2,,107,1,,-2,,-2,,,3,1,1,1,-2,142
151,291,90030984,,-2,,171,1,,-2,,-2,,,3,1,1,1,-2,197
151,304,90004050,,feeding intolerance,,197,1,,-2,,-2,,,3,1,1,1,-2,234
151,328,90004068,,gastroenteritis,,288,2,,10014866,,gastroenteritis,,,3,1,1,1,-2,288
151,367,90004068,,gastronenteritis,,381,2,,10014866,,gastroenteritis,,,3,1,1,1,-2,381
93,327,90030984,,-2,,117,2,,10010971,,RV dysfunction,,,3,1,1,1,-2,117
896,309,10035598,,-2,,35,1,,-2,,-2,,,3,1,1,1,-2,651
896,311,10010922,,-2,,42,1,,-2,,-2,,,3,1,1,1,-2,42
896,346,90004068,,infection,,182,2,,90030470,,rotavirus gastroenteritis,,,3,1,1,1,-2,182
896,359,10018854,,-2,,183,2,,90030872,,right pleural hematoma - intraoperative injury,,,3,1,1,1,-2,183
896,389,10010971,,-2,,259,1,,-2,,-2,,,3,1,1,1,-2,259
764,351,90030982,,shunt stenosis,,122,1,,-2,,-2,,,3,1,1,1,-2,151
764,352,90030982,,air embolus,,617,2,,10010922,,seizure,,,3,1,1,1,-2,617
764,394,10010000,,-2,,283,1,,-2,,-2,,,3,1,1,1,-2,283
238,371,10012745,,-2,,164,1,,-2,,-2,,,3,1,1,1,-2,164
667,333,10021036,,-2,,52,1,,-2,,-2,,,3,1,2,1,-2,52
667,349,10012745,,-2,,116,1,,-2,,-2,,,3,1,1,1,-2,116
667,350,90030982,,RV-PA shunt stenosis,,116,1,,-2,,-2,,,3,1,1,1,-2,145
667,396,10010971,,-2,,312,2,,90030982,,coarctation of the aorta,,,3,1,1,1,-2,347
620,418,10016288,,-2,,1099,1,,-2,,-2,,,3,1,1,1,-2,1099
620,416,90030982,,coarctation of the aorta,,1099,1,,-2,,-2,,,3,1,1,1,-2,1099
620,298,90030486,,-2,,424,2,,90030506,,facial edema,,,3,1,1,1,-2,515
620,305,10010971,,-2,,424,1,,-2,,-2,,,3,1,1,1,-2,515
620,320,10010971,,-2,,515,1,,-2,,-2,,,3,1,1,1,-2,515
339,99,,C9999,failure to thrive; congestive heart failure,40,284,1,2,-2,C0601,-2,-2,-2,3,1,1,1,-2,284
339,102,,C9999,cardiac surgery,49,284,1,1,-2,-2,-2,-2,-2,3,1,2,1,-2,284
339,109,,C1701,-2,55,284,1,1,-2,-2,-2,-2,-2,3,1,1,1,-2,284
339,120,,C9999,surgical intervention,68,284,1,2,-2,C1701,-2,-2,-2,3,1,1,1,-2,284
339,127,,C9999,nothng was specified,115,284,2,2,90004050,C0601,GI other:  dehydration and TP tube clogged,-2,-2,3,1,1,1,-2,284
339,161,,C9999,headache and irritability,214,283,1,1,-2,-2,-2,-2,-2,3,1,2,1,-2,283
339,214,,C1701,-2,333,389,1,1,-2,-2,-2,-2,-2,3,1,1,1,-2,389
523,145,,C0201,-2,26,75,2,2,10010971,C1702,RV dysfunction,-2,-2,3,1,2,1,-2,1275
479,262,10048038,,-2,,168,1,,-2,,-2,,,3,1,1,1,-2,181
479,266,10012174,,-2,,168,2,,10010971,,RV dysfunction,,,3,1,2,1,-2,168
820,325,90030288,,-2,,116,1,,-2,,-2,,,3,1,1,1,-2,145
595,6,,C9999,failure to thrive,51,826,1,1,-2,-2,-2,-2,-2,3,1,1,1,-2,826
964,33,10051228,,-2,,1754,1,,-2,,-2,,,3,1,1,1,-2,1754
1030,14,,C9999,death,62,685,1,2,-2,C0201,-2,-2,-2,3,1,1,1,-2,685
682,56,90004084,,pulmonary event leading to arrest,,1681,2,,10007617,,cardiopulmonary arrest of uncertain cause,,,3,1,1,1,-2,1681
52,19,,C1702,-2,73,632,1,1,-2,-2,-2,-2,-2,3,1,1,1,-2,632