blind_id,VISITNUM,age_fvisit_d,age_comp,FFAILTHRV,FFEDDIFF,FDYSPNEA,FEXINTOL,FEDEMA,FSYNCOPE,FPALPIT,FCHSTPAIN,FTHROEMB,FOTHSYMP,FSYMPSPC,FRHYTHAB,FABATTAC,FABVNTAC,FABBRADY,FABHTBLK,FHOSP,FHOSPNUM,age_fadm_d_0,age_fdis_d_0,FADMIND1_0,FADMSPEC1_0,FADMIND2_0,FADMSPEC2_0,FADMIND3_0,FADMSPEC3_0,FADMIND4_0,FADMSPEC4_0,FADMIND5_0,FADMSPEC5_0,FDOSEINC_0,FCHNGCARD_0,FUSEINO_0,FPROC_NUM_0,FPROC1_0,FPROCSPC1_0,age_fproc_d1_0,FPROC2_0,FPROCSPC2_0,age_fproc_d2_0,FPROC3_0,FPROCSPC3_0,age_fproc_d3_0,age_fadm_d_1,age_fdis_d_1,FADMIND1_1,FADMSPEC1_1,FADMIND2_1,FADMSPEC2_1,FADMIND3_1,FADMSPEC3_1,FADMIND4_1,FADMSPEC4_1,FADMIND5_1,FADMSPEC5_1,FDOSEINC_1,FCHNGCARD_1,FUSEINO_1,FPROC_NUM_1,FPROC1_1,FPROCSPC1_1,age_fproc_d1_1,FPROC2_1,FPROCSPC2_1,age_fproc_d2_1,FPROC3_1,FPROCSPC3_1,age_fproc_d3_1,age_fadm_d_2,age_fdis_d_2,FADMIND1_2,FADMSPEC1_2,FADMIND2_2,FADMSPEC2_2,FADMIND3_2,FADMSPEC3_2,FADMIND4_2,FADMSPEC4_2,FADMIND5_2,FADMSPEC5_2,FDOSEINC_2,FCHNGCARD_2,FUSEINO_2,FPROC_NUM_2,FPROC1_2,FPROCSPC1_2,age_fproc_d1_2,FPROC2_2,FPROCSPC2_2,age_fproc_d2_2,FPROC3_2,FPROCSPC3_2,age_fproc_d3_2,FLASTMED,fmed_0,FMEDNAM_0,FMEDSTAT_0,age_fmedchng_0,FCHNGRES_0,FRESSPEC_0,FMEDDOSED_0,fmed_1,FMEDNAM_1,FMEDSTAT_1,age_fmedchng_1,FCHNGRES_1,FRESSPEC_1,FMEDDOSED_1,fmed_2,FMEDNAM_2,FMEDSTAT_2,age_fmedchng_2,FCHNGRES_2,FRESSPEC_2,FMEDDOSED_2,fmed_3,FMEDNAM_3,FMEDSTAT_3,age_fmedchng_3,FCHNGRES_3,FRESSPEC_3,FMEDDOSED_3,fmed_4,FMEDNAM_4,FMEDSTAT_4,age_fmedchng_4,FCHNGRES_4,FRESSPEC_4,FMEDDOSED_4,fmed_5,FMEDNAM_5,FMEDSTAT_5,age_fmedchng_5,FCHNGRES_5,FRESSPEC_5,FMEDDOSED_5,fmed_6,FMEDNAM_6,FMEDSTAT_6,age_fmedchng_6,FCHNGRES_6,FRESSPEC_6,FMEDDOSED_6,fmed_7,FMEDNAM_7,FMEDSTAT_7,age_fmedchng_7,FCHNGRES_7,FRESSPEC_7,FMEDDOSED_7,fmed_8,FMEDNAM_8,FMEDSTAT_8,age_fmedchng_8,FCHNGRES_8,FRESSPEC_8,FMEDDOSED_8,fmed_9,FMEDNAM_9,FMEDSTAT_9,age_fmedchng_9,FCHNGRES_9,FRESSPEC_9,FMEDDOSED_9,fmed_10,FMEDNAM_10,FMEDSTAT_10,age_fmedchng_10,FCHNGRES_10,FRESSPEC_10,FMEDDOSED_10,fmed_11,FMEDNAM_11,FMEDSTAT_11,age_fmedchng_11,FCHNGRES_11,FRESSPEC_11,FMEDDOSED_11,fmed_12,FMEDNAM_12,FMEDSTAT_12,age_fmedchng_12,FCHNGRES_12,FRESSPEC_12,FMEDDOSED_12,FECHAGE,FROSCLAS,FR2TACHY,FR2DIAPH,FR2DYSPEX,FR3TACHY,FR3DIAPH,FR4TACHY,FR4RETRC,FR4GRUNT,FR4DIAPH,FNYHCLAS,FAICD,FTRNWAIT,FTRNSTAT,age_ftrn_d,FECHOEF,age_fechoefd,FECHLVEF,FMUGADON,age_fmuga_d,FMUGALVEF,FMRIDONE,age_fmridate,FMRILVEF,FCATHDON,age_fcath_d,FLVEDP,FPCWP,FCARDIND,FEXTEST,age_fexdate,FEXTYPE,FHT_EXER,FWT_EXER,FMAXEFFT,FPEAKVO2,FATVO2,FBNPDONE,FBNPSTND,age_fbnp_d,FBNPRSLT,FSTNDU,FNTPBNP,age_fntp_d,FNTPRSLT,FNTPU,NEXTECHO
3,1:Follow-up visit 1,9.83,9.86,-1:NA,-1:NA,1:Yes,1:Yes,1:Yes,2:No,2:No,2:No,2:No,2:No,-2,1:Yes,2:No,2:No,1:Yes,2:No,1:Yes,1,9.82,9.86,013: Cardiovascular; IV pressors,-2,,-2,,-2,,-2,,-2,1:Yes,1:Yes,1:Yes,3,2,-2,9.82,101,-2,9.82,203,-2,9.82,,,,.,,.,,.,,.,,.,,,,,,.,,,.,,,.,,,,,.,,.,,.,,.,,.,,,,,,.,,,.,,,.,,2,,,,,,,,,,,,,,,,,,,,,,,,,,,,,,,,,,,,,,,,,,,,,,,,,,,,,,,,,,,,,,,,,,,,,,,,,,,,,,,,,,,,,,,,,,,,2:>=5 years,-2,-2:Skipped,-2:Skipped,-2:Skipped,-2:Skipped,-2:Skipped,-2:Skipped,-2:Skipped,-2:Skipped,-2:Skipped,4:Class IV,2:No,1:Yes,"1:1A (US) / 2, 3, 3.5, 4 (Canada)",9.82,2:No,,-2,2:No,,-2,2:No,,-2,1:Yes,9.82,-9,-9,-9.00,2:No,,-2,-2.0,-2.00,-2:Skipped,-2.0,-2.0,2:No,-2:Skipped,,-2.0,-2,-2:Skipped,,-2.0,-2,2
16,1:Follow-up visit 1,6.41,6.43,-1:NA,-1:NA,1:Yes,1:Yes,2:No,1:Yes,1:Yes,1:Yes,2:No,1:Yes,loss of apetite,1:Yes,2:No,1:Yes,2:No,2:No,1:Yes,1,6.16,6.19,099: Cardiovascular; Other,Chest Pain,999: Other,Decreased Activity,199: Respiratory; Other,Shortness of Breath,,-2,,-2,1:Yes,1:Yes,1:Yes,0,,-2,,,-2,,,-2,,,,,.,,.,,.,,.,,.,,,,,,.,,,.,,,.,,,,,.,,.,,.,,.,,.,,,,,,.,,,.,,,.,,1,02.02,-2,3:On > 6 Months,,-2,-2,200,08.09,-2,1:New drug,6.05,5,-2,6.2,01.02,-2,3:On > 6 Months,,-2,-2,25,01.02,-2,2:Dose change,6.19,5,-2,37.5,14.13,-2,3:On > 6 Months,,-2,-2,100,14.13,-2,2:Dose change,6.12,5,-2,25,17.02,-2,3:On > 6 Months,,-2,-2,0.13,17.02,-2,2:Dose change,6.12,99,Decrease in cardiac symptoms,0,07.02,-2,2:Dose change,6.19,5,-2,0.13,14.08,-2,3:On > 6 Months,,-2,-2,80,14.08,-2,2:Dose change,6.12,5,-2,40,08.09,-2,2:Dose change,6.12,5,-2,12.5,,.,,,,.,,2:>=5 years,-2,-2:Skipped,-2:Skipped,-2:Skipped,-2:Skipped,-2:Skipped,-2:Skipped,-2:Skipped,-2:Skipped,-2:Skipped,2:Class II,2:No,2:No,-2,,1:Yes,6.24,27,2:No,,-2,2:No,,-2,1:Yes,6.06,15,14,2.70,2:No,,-2,-2.0,-2.00,-2:Skipped,-2.0,-2.0,2:No,-2:Skipped,,-2.0,-2,-2:Skipped,,-2.0,-2,1
16,2:Follow-up visit 2,7.11,7.15,-1:NA,-1:NA,1:Yes,1:Yes,2:No,1:Yes,1:Yes,1:Yes,2:No,1:Yes,"loss of appetite, weight loss",2:No,-2:Skipped,-2:Skipped,-2:Skipped,-2:Skipped,1:Yes,1,7.1,7.11,199: Respiratory; Other,shortness of breath,999: Other,weakness,099: Cardiovascular; Other,chest pain,,-2,,-2,2:No,2:No,1:Yes,0,,-2,,,-2,,,-2,,,,,.,,.,,.,,.,,.,,,,,,.,,,.,,,.,,,,,.,,.,,.,,.,,.,,,,,,.,,,.,,,.,,1,02.02,-2,3:On > 6 Months,,-2,-2,200,08.09,-2,2:Dose change,7.11,4,-2,1.56,14.08,-2,3:On > 6 Months,,-2,-2,80,17.02,-2,3:On > 6 Months,,-2,-2,0.13,14.13,-2,3:On > 6 Months,,-2,-2,25,01.02,-2,3:On > 6 Months,,-2,-2,37.5,,.,,,,.,,,.,,,,.,,,.,,,,.,,,.,,,,.,,,.,,,,.,,,.,,,,.,,,.,,,,.,,2:>=5 years,-2,-2:Skipped,-2:Skipped,-2:Skipped,-2:Skipped,-2:Skipped,-2:Skipped,-2:Skipped,-2:Skipped,-2:Skipped,2:Class II,2:No,2:No,-2,,1:Yes,7.03,28,2:No,,-2,2:No,,-2,2:No,,-2,-2,-2.00,2:No,,-2,-2.0,-2.00,-2:Skipped,-2.0,-2.0,2:No,-2:Skipped,,-2.0,-2,-2:Skipped,,-2.0,-2,2
17,1:Follow-up visit 1,7.62,7.63,-1:NA,-1:NA,2:No,2:No,2:No,2:No,2:No,2:No,2:No,2:No,-2,2:No,-2:Skipped,-2:Skipped,-2:Skipped,-2:Skipped,2:No,-2,,,,,,,,,,,,,,,,,,,,,,,,,,,,,,,,,,,,,,,,,,,,,,,,,,,,,,,,,,,,,,,,,,,,,,,,,,,,1,08.09,-2,3:On > 6 Months,,-2,-2,16,13.04,-2,3:On > 6 Months,,-2,-2,10,,.,,,,.,,,.,,,,.,,,.,,,,.,,,.,,,,.,,,.,,,,.,,,.,,,,.,,,.,,,,.,,,.,,,,.,,,.,,,,.,,,.,,,,.,,,.,,,,.,,2:>=5 years,-2,-2:Skipped,-2:Skipped,-2:Skipped,-2:Skipped,-2:Skipped,-2:Skipped,-2:Skipped,-2:Skipped,-2:Skipped,1:Class I,2:No,2:No,-2,,2:No,,-2,2:No,,-2,2:No,,-2,2:No,,-2,-2,-2.00,2:No,,-2,-2.0,-2.00,-2:Skipped,-2.0,-2.0,2:No,-2:Skipped,,-2.0,-2,-2:Skipped,,-2.0,-2,2
17,2:Follow-up visit 2,8.22,8.23,2:No,2:No,2:No,2:No,2:No,2:No,2:No,2:No,2:No,2:No,-2,2:No,-2:Skipped,-2:Skipped,-2:Skipped,-2:Skipped,2:No,-2,,,,,,,,,,,,,,,,,,,,,,,,,,,,,,,,,,,,,,,,,,,,,,,,,,,,,,,,,,,,,,,,,,,,,,,,,,,,1,08.09,-2,2:Dose change,8.22,1,-2,20,13.04,-2,2:Dose change,8.22,1,-2,12,,.,,,,.,,,.,,,,.,,,.,,,,.,,,.,,,,.,,,.,,,,.,,,.,,,,.,,,.,,,,.,,,.,,,,.,,,.,,,,.,,,.,,,,.,,,.,,,,.,,2:>=5 years,-2,-2:Skipped,-2:Skipped,-2:Skipped,-2:Skipped,-2:Skipped,-2:Skipped,-2:Skipped,-2:Skipped,-2:Skipped,1:Class I,2:No,2:No,-2,,2:No,,-2,2:No,,-2,2:No,,-2,2:No,,-2,-2,-2.00,2:No,,-2,-2.0,-2.00,-2:Skipped,-2.0,-2.0,1:Yes,1:Yes,8.22,26.0,1:PG/ML,2:No,,-2.0,-2,2
18,1:Follow-up visit 1,11.86,11.93,2:No,2:No,1:Yes,1:Yes,2:No,1:Yes,1:Yes,1:Yes,2:No,2:No,-2,2:No,-2:Skipped,-2:Skipped,-2:Skipped,-2:Skipped,1:Yes,2,11.53,11.54,199: Respiratory; Other,shortness of breath,,-2,,-2,,-2,,-2,1:Yes,1:Yes,2:No,1,2,-2,11.54,,-2,,,-2,,11.45,11.45,199: Respiratory; Other,shortness of breath,099: Cardiovascular; Other,chest pain,,-2,,-2,,-2,2:No,2:No,2:No,0,,-2,,,-2,,,-2,,,,,.,,.,,.,,.,,.,,,,,,.,,,.,,,.,,1,17.02,-2,2:Dose change,,9,-2,0,14.08,-2,3:On > 6 Months,,-2,-2,50,07.02,-2,3:On > 6 Months,,-2,-2,81,13.07,-2,3:On > 6 Months,,-2,-2,50,14.13,-2,3:On > 6 Months,,-2,-2,50,08.04,-2,1:New drug,,9,-2,30,08.14,-2,2:Dose change,,9,-2,0,,.,,,,.,,,.,,,,.,,,.,,,,.,,,.,,,,.,,,.,,,,.,,,.,,,,.,,2:>=5 years,-2,-2:Skipped,-2:Skipped,-2:Skipped,-2:Skipped,-2:Skipped,-2:Skipped,-2:Skipped,-2:Skipped,-2:Skipped,2:Class II,2:No,2:No,-2,,1:Yes,11.51,34,2:No,,-2,2:No,,-2,1:Yes,11.54,14,14,4.16,2:No,,-2,-2.0,-2.00,-2:Skipped,-2.0,-2.0,1:Yes,1:Yes,11.86,471.0,1:PG/ML,2:No,,-2.0,-2,2
19,1:Follow-up visit 1,16.97,16.97,2:No,2:No,2:No,2:No,2:No,2:No,2:No,2:No,2:No,2:No,-2,2:No,-2:Skipped,-2:Skipped,-2:Skipped,-2:Skipped,2:No,-2,,,,,,,,,,,,,,,,,,,,,,,,,,,,,,,,,,,,,,,,,,,,,,,,,,,,,,,,,,,,,,,,,,,,,,,,,,,,1,17.02,-2,3:On > 6 Months,,-2,-2,0.25,02.02,-2,3:On > 6 Months,,-2,-2,300,14.08,-2,3:On > 6 Months,,-2,-2,80,14.13,-2,3:On > 6 Months,,-2,-2,100,13.11,-2,3:On > 6 Months,,-2,-2,10,08.09,-2,3:On > 6 Months,,-2,-2,50,07.02,-2,3:On > 6 Months,,-2,-2,81,,.,,,,.,,,.,,,,.,,,.,,,,.,,,.,,,,.,,,.,,,,.,,,.,,,,.,,2:>=5 years,-2,-2:Skipped,-2:Skipped,-2:Skipped,-2:Skipped,-2:Skipped,-2:Skipped,-2:Skipped,-2:Skipped,-2:Skipped,1:Class I,2:No,2:No,-2,,2:No,,-2,2:No,,-2,2:No,,-2,2:No,,-2,-2,-2.00,2:No,,-2,-2.0,-2.00,-2:Skipped,-2.0,-2.0,1:Yes,1:Yes,16.77,1.0,-9,2:No,,-2.0,-2,2
20,1:Follow-up visit 1,15.18,15.21,2:No,1:Yes,1:Yes,1:Yes,1:Yes,2:No,2:No,2:No,2:No,2:No,-2,1:Yes,2:No,1:Yes,2:No,2:No,1:Yes,2,14.88,14.89,013: Cardiovascular; IV pressors,-2,,-2,,-2,,-2,,-2,2:No,1:Yes,1:Yes,0,,-2,,,-2,,,-2,,15.04,,013: Cardiovascular; IV pressors,-2,012: Cardiovascular; Hypotension,-2,,-2,,-2,,-2,1:Yes,1:Yes,1:Yes,0,,-2,,,-2,,,-2,,,,,.,,.,,.,,.,,.,,,,,,.,,,.,,,.,,1,14.08,-2,3:On > 6 Months,,-2,-2,10,08.09,-2,3:On > 6 Months,,-2,-2,50,17.02,-2,3:On > 6 Months,,-2,-2,0.3,07.02,-2,3:On > 6 Months,,-2,-2,81,13.07,-2,3:On > 6 Months,,-2,-2,20,14.08,-2,2:Dose change,15.16,5,-2,80,08.09,-2,2:Dose change,15.18,5,-2,25,17.02,-2,2:Dose change,15.04,5,-2,0.13,14.13,-2,1:New drug,15.15,5,-2,50,19.07,-2,1:New drug,15.04,5,-2,43.2,19.02,-2,1:New drug,15.18,5,-2,259.2,,.,,,,.,,,.,,,,.,,2:>=5 years,-2,-2:Skipped,-2:Skipped,-2:Skipped,-2:Skipped,-2:Skipped,-2:Skipped,-2:Skipped,-2:Skipped,-2:Skipped,2:Class II,2:No,1:Yes,"1:1A (US) / 2, 3, 3.5, 4 (Canada)",15,1:Yes,15.04,17,2:No,,-2,2:No,,-2,2:No,,-2,-2,-2.00,1:Yes,14.91,2,167.0,60.00,2:No,18.5,10.6,1:Yes,1:Yes,15.15,361.0,1:PG/ML,2:No,,-2.0,-2,2
23,1:Follow-up visit 1,5.78,5.8,2:No,2:No,2:No,2:No,2:No,2:No,2:No,2:No,2:No,2:No,-2,2:No,-2:Skipped,-2:Skipped,-2:Skipped,-2:Skipped,2:No,-2,,,,,,,,,,,,,,,,,,,,,,,,,,,,,,,,,,,,,,,,,,,,,,,,,,,,,,,,,,,,,,,,,,,,,,,,,,,,1,14.13,-2,3:On > 6 Months,,-2,-2,25,13.04,-2,3:On > 6 Months,,-2,-2,5,,.,,,,.,,,.,,,,.,,,.,,,,.,,,.,,,,.,,,.,,,,.,,,.,,,,.,,,.,,,,.,,,.,,,,.,,,.,,,,.,,,.,,,,.,,,.,,,,.,,2:>=5 years,-2,-2:Skipped,-2:Skipped,-2:Skipped,-2:Skipped,-2:Skipped,-2:Skipped,-2:Skipped,-2:Skipped,-2:Skipped,1:Class I,2:No,2:No,-2,,2:No,,-2,2:No,,-2,2:No,,-2,2:No,,-2,-2,-2.00,2:No,,-2,-2.0,-2.00,-2:Skipped,-2.0,-2.0,1:Yes,1:Yes,5.49,93.4,1:PG/ML,2:No,,-2.0,-2,2
24,1:Follow-up visit 1,9.59,9.59,-1:NA,-1:NA,1:Yes,1:Yes,1:Yes,2:No,2:No,2:No,2:No,2:No,-2,2:No,-2:Skipped,-2:Skipped,-2:Skipped,-2:Skipped,1:Yes,1,9.37,9.39,013: Cardiovascular; IV pressors,-2,,-2,,-2,,-2,,-2,1:Yes,1:Yes,1:Yes,1,203,-2,9.37,,-2,,,-2,,,,,.,,.,,.,,.,,.,,,,,,.,,,.,,,.,,,,,.,,.,,.,,.,,.,,,,,,.,,,.,,,.,,1,07.06,-2,3:On > 6 Months,,-2,-2,20,13.04,-2,2:Dose change,9.39,5,-2,10,14.08,-2,2:Dose change,9.39,5,-2,40,17.02,-2,2:Dose change,9.39,5,-2,0.62,08.09,-2,3:On > 6 Months,,-2,-2,19.5,14.99,aldactazide,1:New drug,9.39,5,-2,50,19.07,-2,1:New drug,9.39,5,-2,18,,.,,,,.,,,.,,,,.,,,.,,,,.,,,.,,,,.,,,.,,,,.,,,.,,,,.,,2:>=5 years,-2,-2:Skipped,-2:Skipped,-2:Skipped,-2:Skipped,-2:Skipped,-2:Skipped,-2:Skipped,-2:Skipped,-2:Skipped,3:Class III,2:No,1:Yes,"1:1A (US) / 2, 3, 3.5, 4 (Canada)",9.39,1:Yes,9.35,28,2:No,,-2,2:No,,-2,1:Yes,9.37,28,23,4.10,2:No,,-2,-2.0,-2.00,-2:Skipped,-2.0,-2.0,2:No,-2:Skipped,,-2.0,-2,-2:Skipped,,-2.0,-2,2
27,1:Follow-up visit 1,0.78,0.78,2:No,2:No,2:No,2:No,2:No,2:No,2:No,2:No,2:No,2:No,-2,2:No,-2:Skipped,-2:Skipped,-2:Skipped,-2:Skipped,2:No,-2,,,,,,,,,,,,,,,,,,,,,,,,,,,,,,,,,,,,,,,,,,,,,,,,,,,,,,,,,,,,,,,,,,,,,,,,,,,,1,13.04,-2,3:On > 6 Months,,-2,-2,3,14.08,-2,3:On > 6 Months,,-2,-2,7,17.02,-2,3:On > 6 Months,,-2,-2,0.06,,.,,,,.,,,.,,,,.,,,.,,,,.,,,.,,,,.,,,.,,,,.,,,.,,,,.,,,.,,,,.,,,.,,,,.,,,.,,,,.,,,.,,,,.,,1:< 5years,1:Class I,-2:Skipped,-2:Skipped,-2:Skipped,-2:Skipped,-2:Skipped,-2:Skipped,-2:Skipped,-2:Skipped,-2:Skipped,-2,2:No,2:No,-2,,2:No,,-2,2:No,,-2,2:No,,-2,2:No,,-2,-2,-2.00,2:No,,-2,-2.0,-2.00,-2:Skipped,-2.0,-2.0,2:No,-2:Skipped,,-2.0,-2,-2:Skipped,,-2.0,-2,2
28,1:Follow-up visit 1,4.25,4.27,-1:NA,-1:NA,2:No,2:No,2:No,2:No,-8:Unknown,2:No,2:No,1:Yes,FEBRILE SEIZURE,2:No,-2:Skipped,-2:Skipped,-2:Skipped,-2:Skipped,2:No,-2,,,,,,,,,,,,,,,,,,,,,,,,,,,,,,,,,,,,,,,,,,,,,,,,,,,,,,,,,,,,,,,,,,,,,,,,,,,,2,,,,,,,,,,,,,,,,,,,,,,,,,,,,,,,,,,,,,,,,,,,,,,,,,,,,,,,,,,,,,,,,,,,,,,,,,,,,,,,,,,,,,,,,,,,,1:< 5years,1:Class I,-2:Skipped,-2:Skipped,-2:Skipped,-2:Skipped,-2:Skipped,-2:Skipped,-2:Skipped,-2:Skipped,-2:Skipped,-2,2:No,2:No,-2,,2:No,,-2,2:No,,-2,2:No,,-2,2:No,,-2,-2,-2.00,2:No,,-2,-2.0,-2.00,-2:Skipped,-2.0,-2.0,2:No,-2:Skipped,,-2.0,-2,-2:Skipped,,-2.0,-2,1
28,2:Follow-up visit 2,4.77,4.77,2:No,2:No,2:No,2:No,2:No,2:No,2:No,2:No,2:No,2:No,-2,2:No,-2:Skipped,-2:Skipped,-2:Skipped,-2:Skipped,2:No,-2,,,,,,,,,,,,,,,,,,,,,,,,,,,,,,,,,,,,,,,,,,,,,,,,,,,,,,,,,,,,,,,,,,,,,,,,,,,,2,,,,,,,,,,,,,,,,,,,,,,,,,,,,,,,,,,,,,,,,,,,,,,,,,,,,,,,,,,,,,,,,,,,,,,,,,,,,,,,,,,,,,,,,,,,,1:< 5years,1:Class I,-2:Skipped,-2:Skipped,-2:Skipped,-2:Skipped,-2:Skipped,-2:Skipped,-2:Skipped,-2:Skipped,-2:Skipped,-2,2:No,2:No,-2,,2:No,,-2,2:No,,-2,2:No,,-2,2:No,,-2,-2,-2.00,2:No,,-2,-2.0,-2.00,-2:Skipped,-2.0,-2.0,2:No,-2:Skipped,,-2.0,-2,-2:Skipped,,-2.0,-2,1
34,1:Follow-up visit 1,1.03,1.04,2:No,1:Yes,1:Yes,2:No,2:No,2:No,2:No,2:No,2:No,2:No,-2,2:No,-2:Skipped,-2:Skipped,-2:Skipped,-2:Skipped,2:No,-2,,,,,,,,,,,,,,,,,,,,,,,,,,,,,,,,,,,,,,,,,,,,,,,,,,,,,,,,,,,,,,,,,,,,,,,,,,,,1,13.04,-2,2:Dose change,0.59,1,-2,4.4,,.,,,,.,,,.,,,,.,,,.,,,,.,,,.,,,,.,,,.,,,,.,,,.,,,,.,,,.,,,,.,,,.,,,,.,,,.,,,,.,,,.,,,,.,,,.,,,,.,,,.,,,,.,,1:< 5years,1:Class I,-2:Skipped,-2:Skipped,-2:Skipped,-2:Skipped,-2:Skipped,-2:Skipped,-2:Skipped,-2:Skipped,-2:Skipped,-2,2:No,2:No,-2,,1:Yes,0.59,35,2:No,,-2,2:No,,-2,2:No,,-2,-2,-2.00,2:No,,-2,-2.0,-2.00,-2:Skipped,-2.0,-2.0,1:Yes,1:Yes,0.59,147.9,1:PG/ML,2:No,,-2.0,-2,2
36,1:Follow-up visit 1,5.4,5.41,2:No,-1:NA,2:No,2:No,2:No,2:No,2:No,2:No,2:No,2:No,-2,2:No,-2:Skipped,-2:Skipped,-2:Skipped,-2:Skipped,2:No,-2,,,,,,,,,,,,,,,,,,,,,,,,,,,,,,,,,,,,,,,,,,,,,,,,,,,,,,,,,,,,,,,,,,,,,,,,,,,,1,17.02,-2,3:On > 6 Months,,-2,-2,0.1,13.04,-2,3:On > 6 Months,,-2,-2,2,,.,,,,.,,,.,,,,.,,,.,,,,.,,,.,,,,.,,,.,,,,.,,,.,,,,.,,,.,,,,.,,,.,,,,.,,,.,,,,.,,,.,,,,.,,,.,,,,.,,2:>=5 years,-2,-2:Skipped,-2:Skipped,-2:Skipped,-2:Skipped,-2:Skipped,-2:Skipped,-2:Skipped,-2:Skipped,-2:Skipped,1:Class I,2:No,2:No,-2,,2:No,,-2,2:No,,-2,2:No,,-2,2:No,,-2,-2,-2.00,2:No,,-2,-2.0,-2.00,-2:Skipped,-2.0,-2.0,2:No,-2:Skipped,,-2.0,-2,-2:Skipped,,-2.0,-2,2
37,1:Follow-up visit 1,16.09,16.15,2:No,2:No,2:No,2:No,2:No,2:No,2:No,2:No,2:No,2:No,-2,2:No,-2:Skipped,-2:Skipped,-2:Skipped,-2:Skipped,2:No,-2,,,,,,,,,,,,,,,,,,,,,,,,,,,,,,,,,,,,,,,,,,,,,,,,,,,,,,,,,,,,,,,,,,,,,,,,,,,,1,08.09,-2,3:On > 6 Months,,-2,-2,43.75,07.02,-2,3:On > 6 Months,,-2,-2,81,17.02,-2,3:On > 6 Months,,-2,-2,0.5,13.04,-2,3:On > 6 Months,,-2,-2,20,14.13,-2,1:New drug,15.82,5,-2,25,,.,,,,.,,,.,,,,.,,,.,,,,.,,,.,,,,.,,,.,,,,.,,,.,,,,.,,,.,,,,.,,,.,,,,.,,2:>=5 years,-2,-2:Skipped,-2:Skipped,-2:Skipped,-2:Skipped,-2:Skipped,-2:Skipped,-2:Skipped,-2:Skipped,-2:Skipped,1:Class I,2:No,2:No,-2,,2:No,,-2,2:No,,-2,2:No,,-2,2:No,,-2,-2,-2.00,2:No,,-2,-2.0,-2.00,-2:Skipped,-2.0,-2.0,2:No,-2:Skipped,,-2.0,-2,-2:Skipped,,-2.0,-2,2
45,1:Follow-up visit 1,16.78,16.78,2:No,2:No,2:No,2:No,2:No,2:No,2:No,2:No,2:No,2:No,-2,2:No,-2:Skipped,-2:Skipped,-2:Skipped,-2:Skipped,2:No,-2,,,,,,,,,,,,,,,,,,,,,,,,,,,,,,,,,,,,,,,,,,,,,,,,,,,,,,,,,,,,,,,,,,,,,,,,,,,,1,13.04,-2,3:On > 6 Months,,-2,-2,10,08.09,-2,2:Dose change,16.07,3,-2,50,06.99,eplerenone,1:New drug,16.55,99,blood pressure control,25,,.,,,,.,,,.,,,,.,,,.,,,,.,,,.,,,,.,,,.,,,,.,,,.,,,,.,,,.,,,,.,,,.,,,,.,,,.,,,,.,,,.,,,,.,,2:>=5 years,-2,-2:Skipped,-2:Skipped,-2:Skipped,-2:Skipped,-2:Skipped,-2:Skipped,-2:Skipped,-2:Skipped,-2:Skipped,1:Class I,2:No,2:No,-2,,2:No,,-2,2:No,,-2,2:No,,-2,2:No,,-2,-2,-2.00,2:No,,-2,-2.0,-2.00,-2:Skipped,-2.0,-2.0,2:No,-2:Skipped,,-2.0,-2,-2:Skipped,,-2.0,-2,2
48,1:Follow-up visit 1,4.99,5.01,-1:NA,-1:NA,2:No,-8:Unknown,2:No,2:No,2:No,2:No,2:No,2:No,-2,2:No,-2:Skipped,-2:Skipped,-2:Skipped,-2:Skipped,2:No,-2,,,,,,,,,,,,,,,,,,,,,,,,,,,,,,,,,,,,,,,,,,,,,,,,,,,,,,,,,,,,,,,,,,,,,,,,,,,,2,,,,,,,,,,,,,,,,,,,,,,,,,,,,,,,,,,,,,,,,,,,,,,,,,,,,,,,,,,,,,,,,,,,,,,,,,,,,,,,,,,,,,,,,,,,,1:< 5years,1:Class I,-2:Skipped,-2:Skipped,-2:Skipped,-2:Skipped,-2:Skipped,-2:Skipped,-2:Skipped,-2:Skipped,-2:Skipped,-2,2:No,2:No,-2,,2:No,,-2,2:No,,-2,2:No,,-2,2:No,,-2,-2,-2.00,2:No,,-2,-2.0,-2.00,-2:Skipped,-2.0,-2.0,2:No,-2:Skipped,,-2.0,-2,-2:Skipped,,-2.0,-2,2
51,1:Follow-up visit 1,3.64,3.64,2:No,2:No,2:No,2:No,2:No,2:No,2:No,2:No,2:No,2:No,-2,2:No,-2:Skipped,-2:Skipped,-2:Skipped,-2:Skipped,2:No,-2,,,,,,,,,,,,,,,,,,,,,,,,,,,,,,,,,,,,,,,,,,,,,,,,,,,,,,,,,,,,,,,,,,,,,,,,,,,,1,17.02,-2,3:On > 6 Months,,-2,-2,0.07,07.02,-2,3:On > 6 Months,,-2,-2,40.5,13.04,-2,3:On > 6 Months,,-2,-2,4,08.09,-2,3:On > 6 Months,,-2,-2,12,14.08,-2,3:On > 6 Months,,-2,-2,12,,.,,,,.,,,.,,,,.,,,.,,,,.,,,.,,,,.,,,.,,,,.,,,.,,,,.,,,.,,,,.,,,.,,,,.,,1:< 5years,1:Class I,-2:Skipped,-2:Skipped,-2:Skipped,-2:Skipped,-2:Skipped,-2:Skipped,-2:Skipped,-2:Skipped,-2:Skipped,-2,2:No,2:No,-2,,2:No,,-2,2:No,,-2,2:No,,-2,2:No,,-2,-2,-2.00,2:No,,-2,-2.0,-2.00,-2:Skipped,-2.0,-2.0,2:No,-2:Skipped,,-2.0,-2,-2:Skipped,,-2.0,-2,2
52,1:Follow-up visit 1,6.24,6.25,-1:NA,-1:NA,2:No,2:No,2:No,2:No,2:No,2:No,2:No,2:No,-2,2:No,-2:Skipped,-2:Skipped,-2:Skipped,-2:Skipped,2:No,-2,,,,,,,,,,,,,,,,,,,,,,,,,,,,,,,,,,,,,,,,,,,,,,,,,,,,,,,,,,,,,,,,,,,,,,,,,,,,1,17.02,-2,3:On > 6 Months,,-2,-2,1.25,13.04,-2,3:On > 6 Months,,-2,-2,1,,.,,,,.,,,.,,,,.,,,.,,,,.,,,.,,,,.,,,.,,,,.,,,.,,,,.,,,.,,,,.,,,.,,,,.,,,.,,,,.,,,.,,,,.,,,.,,,,.,,2:>=5 years,-2,-2:Skipped,-2:Skipped,-2:Skipped,-2:Skipped,-2:Skipped,-2:Skipped,-2:Skipped,-2:Skipped,-2:Skipped,2:Class II,2:No,2:No,-2,,2:No,,-2,2:No,,-2,2:No,,-2,2:No,,-2,-2,-2.00,2:No,,-2,-2.0,-2.00,-2:Skipped,-2.0,-2.0,2:No,-2:Skipped,,-2.0,-2,-2:Skipped,,-2.0,-2,2
52,2:Follow-up visit 2,6.95,6.95,2:No,2:No,2:No,2:No,2:No,2:No,2:No,2:No,2:No,2:No,-2,2:No,-2:Skipped,-2:Skipped,-2:Skipped,-2:Skipped,2:No,-2,,,,,,,,,,,,,,,,,,,,,,,,,,,,,,,,,,,,,,,,,,,,,,,,,,,,,,,,,,,,,,,,,,,,,,,,,,,,1,17.02,-2,3:On > 6 Months,,-2,-2,1.25,13.04,-2,2:Dose change,6.51,2,-2,1.25,,.,,,,.,,,.,,,,.,,,.,,,,.,,,.,,,,.,,,.,,,,.,,,.,,,,.,,,.,,,,.,,,.,,,,.,,,.,,,,.,,,.,,,,.,,,.,,,,.,,2:>=5 years,-2,-2:Skipped,-2:Skipped,-2:Skipped,-2:Skipped,-2:Skipped,-2:Skipped,-2:Skipped,-2:Skipped,-2:Skipped,1:Class I,2:No,2:No,-2,,2:No,,-2,2:No,,-2,2:No,,-2,2:No,,-2,-2,-2.00,2:No,,-2,-2.0,-2.00,-2:Skipped,-2.0,-2.0,2:No,-2:Skipped,,-2.0,-2,-2:Skipped,,-2.0,-2,2
58,1:Follow-up visit 1,18,18,2:No,-1:NA,1:Yes,1:Yes,2:No,2:No,2:No,1:Yes,2:No,1:Yes,Fatigue +,2:No,-2:Skipped,-2:Skipped,-2:Skipped,-2:Skipped,2:No,-2,,,,,,,,,,,,,,,,,,,,,,,,,,,,,,,,,,,,,,,,,,,,,,,,,,,,,,,,,,,,,,,,,,,,,,,,,,,,1,13.11,-2,3:On > 6 Months,,-2,-2,2.5,17.02,-2,3:On > 6 Months,,-2,-2,0.13,08.09,-2,3:On > 6 Months,,-2,-2,6.25,08.09,-2,2:Dose change,17.5,3,-2,6.5,08.14,-2,1:New drug,17.5,2,-2,6.5,08.14,-2,2:Dose change,17.52,99,Uptitration,12.5,08.14,-2,2:Dose change,17.54,99,Uptitration,25,,.,,,,.,,,.,,,,.,,,.,,,,.,,,.,,,,.,,,.,,,,.,,,.,,,,.,,2:>=5 years,-2,-2:Skipped,-2:Skipped,-2:Skipped,-2:Skipped,-2:Skipped,-2:Skipped,-2:Skipped,-2:Skipped,-2:Skipped,2:Class II,2:No,2:No,-2,,2:No,,-2,2:No,,-2,2:No,,-2,2:No,,-2,-2,-2.00,2:No,,-2,-2.0,-2.00,-2:Skipped,-2.0,-2.0,2:No,-2:Skipped,,-2.0,-2,-2:Skipped,,-2.0,-2,2
62,1:Follow-up visit 1,5.14,5.14,2:No,2:No,2:No,2:No,2:No,2:No,2:No,2:No,2:No,2:No,-2,2:No,-2:Skipped,-2:Skipped,-2:Skipped,-2:Skipped,2:No,-2,,,,,,,,,,,,,,,,,,,,,,,,,,,,,,,,,,,,,,,,,,,,,,,,,,,,,,,,,,,,,,,,,,,,,,,,,,,,1,13.04,-2,3:On > 6 Months,,-2,-2,10,,.,,,,.,,,.,,,,.,,,.,,,,.,,,.,,,,.,,,.,,,,.,,,.,,,,.,,,.,,,,.,,,.,,,,.,,,.,,,,.,,,.,,,,.,,,.,,,,.,,,.,,,,.,,2:>=5 years,-2,-2:Skipped,-2:Skipped,-2:Skipped,-2:Skipped,-2:Skipped,-2:Skipped,-2:Skipped,-2:Skipped,-2:Skipped,2:Class II,2:No,2:No,-2,,2:No,,-2,2:No,,-2,2:No,,-2,2:No,,-2,-2,-2.00,2:No,,-2,-2.0,-2.00,-2:Skipped,-2.0,-2.0,2:No,-2:Skipped,,-2.0,-2,-2:Skipped,,-2.0,-2,1
62,2:Follow-up visit 2,5.65,5.65,-1:NA,-1:NA,2:No,2:No,2:No,2:No,2:No,2:No,2:No,2:No,-2,2:No,-2:Skipped,-2:Skipped,-2:Skipped,-2:Skipped,2:No,-2,,,,,,,,,,,,,,,,,,,,,,,,,,,,,,,,,,,,,,,,,,,,,,,,,,,,,,,,,,,,,,,,,,,,,,,,,,,,1,13.04,-2,3:On > 6 Months,,-2,-2,10,,.,,,,.,,,.,,,,.,,,.,,,,.,,,.,,,,.,,,.,,,,.,,,.,,,,.,,,.,,,,.,,,.,,,,.,,,.,,,,.,,,.,,,,.,,,.,,,,.,,,.,,,,.,,2:>=5 years,-2,-2:Skipped,-2:Skipped,-2:Skipped,-2:Skipped,-2:Skipped,-2:Skipped,-2:Skipped,-2:Skipped,-2:Skipped,1:Class I,2:No,2:No,-2,,2:No,,-2,2:No,,-2,2:No,,-2,2:No,,-2,-2,-2.00,2:No,,-2,-2.0,-2.00,-2:Skipped,-2.0,-2.0,2:No,-2:Skipped,,-2.0,-2,-2:Skipped,,-2.0,-2,1
62,3:Follow-up visit 3,6.15,6.15,-1:NA,-1:NA,2:No,2:No,2:No,2:No,2:No,2:No,2:No,2:No,-2,2:No,-2:Skipped,-2:Skipped,-2:Skipped,-2:Skipped,2:No,-2,,,,,,,,,,,,,,,,,,,,,,,,,,,,,,,,,,,,,,,,,,,,,,,,,,,,,,,,,,,,,,,,,,,,,,,,,,,,1,13.04,-2,3:On > 6 Months,,-2,-2,10,,.,,,,.,,,.,,,,.,,,.,,,,.,,,.,,,,.,,,.,,,,.,,,.,,,,.,,,.,,,,.,,,.,,,,.,,,.,,,,.,,,.,,,,.,,,.,,,,.,,,.,,,,.,,2:>=5 years,-2,-2:Skipped,-2:Skipped,-2:Skipped,-2:Skipped,-2:Skipped,-2:Skipped,-2:Skipped,-2:Skipped,-2:Skipped,1:Class I,2:No,2:No,-2,,2:No,,-2,2:No,,-2,2:No,,-2,2:No,,-2,-2,-2.00,2:No,,-2,-2.0,-2.00,-2:Skipped,-2.0,-2.0,2:No,-2:Skipped,,-2.0,-2,-2:Skipped,,-2.0,-2,2
64,1:Follow-up visit 1,4.67,4.68,2:No,-1:NA,2:No,2:No,2:No,2:No,2:No,2:No,2:No,2:No,-2,2:No,-2:Skipped,-2:Skipped,-2:Skipped,-2:Skipped,2:No,-2,,,,,,,,,,,,,,,,,,,,,,,,,,,,,,,,,,,,,,,,,,,,,,,,,,,,,,,,,,,,,,,,,,,,,,,,,,,,1,08.09,-2,3:On > 6 Months,,-2,-2,12.5,08.09,-2,2:Dose change,4.03,1,-2,15.63,13.11,-2,3:On > 6 Months,,-2,-2,1.25,,.,,,,.,,,.,,,,.,,,.,,,,.,,,.,,,,.,,,.,,,,.,,,.,,,,.,,,.,,,,.,,,.,,,,.,,,.,,,,.,,,.,,,,.,,1:< 5years,1:Class I,-2:Skipped,-2:Skipped,-2:Skipped,-2:Skipped,-2:Skipped,-2:Skipped,-2:Skipped,-2:Skipped,-2:Skipped,-2,2:No,2:No,-2,,2:No,,-2,2:No,,-2,2:No,,-2,2:No,,-2,-2,-2.00,2:No,,-2,-2.0,-2.00,-2:Skipped,-2.0,-2.0,2:No,-2:Skipped,,-2.0,-2,-2:Skipped,,-2.0,-2,2
74,1:Follow-up visit 1,18.93,18.95,2:No,2:No,2:No,2:No,2:No,1:Yes,2:No,2:No,2:No,2:No,-2,2:No,-2:Skipped,-2:Skipped,-2:Skipped,-2:Skipped,2:No,-2,,,,,,,,,,,,,,,,,,,,,,,,,,,,,,,,,,,,,,,,,,,,,,,,,,,,,,,,,,,,,,,,,,,,,,,,,,,,1,08.09,-2,3:On > 6 Months,,-2,-2,25,13.04,-2,3:On > 6 Months,,-2,-2,10,,.,,,,.,,,.,,,,.,,,.,,,,.,,,.,,,,.,,,.,,,,.,,,.,,,,.,,,.,,,,.,,,.,,,,.,,,.,,,,.,,,.,,,,.,,,.,,,,.,,2:>=5 years,-2,-2:Skipped,-2:Skipped,-2:Skipped,-2:Skipped,-2:Skipped,-2:Skipped,-2:Skipped,-2:Skipped,-2:Skipped,1:Class I,2:No,2:No,-2,,2:No,,-2,2:No,,-2,2:No,,-2,2:No,,-2,-2,-2.00,2:No,,-2,-2.0,-2.00,-2:Skipped,-2.0,-2.0,2:No,-2:Skipped,,-2.0,-2,-2:Skipped,,-2.0,-2,2
77,1:Follow-up visit 1,1.73,1.73,1:Yes,-1:NA,2:No,2:No,2:No,2:No,2:No,2:No,2:No,2:No,-2,2:No,-2:Skipped,-2:Skipped,-2:Skipped,-2:Skipped,2:No,-2,,,,,,,,,,,,,,,,,,,,,,,,,,,,,,,,,,,,,,,,,,,,,,,,,,,,,,,,,,,,,,,,,,,,,,,,,,,,1,17.02,-2,3:On > 6 Months,,-2,-2,0.06,13.02,-2,2:Dose change,1.43,1,-2,21,13.02,-2,2:Dose change,1.73,1,-2,27,,.,,,,.,,,.,,,,.,,,.,,,,.,,,.,,,,.,,,.,,,,.,,,.,,,,.,,,.,,,,.,,,.,,,,.,,,.,,,,.,,,.,,,,.,,1:< 5years,1:Class I,-2:Skipped,-2:Skipped,-2:Skipped,-2:Skipped,-2:Skipped,-2:Skipped,-2:Skipped,-2:Skipped,-2:Skipped,-2,2:No,2:No,-2,,2:No,,-2,2:No,,-2,2:No,,-2,2:No,,-2,-2,-2.00,2:No,,-2,-2.0,-2.00,-2:Skipped,-2.0,-2.0,2:No,-2:Skipped,,-2.0,-2,-2:Skipped,,-2.0,-2,1
77,2:Follow-up visit 2,2.59,2.71,2:No,2:No,2:No,-1:NA,2:No,2:No,-8:Unknown,-8:Unknown,2:No,2:No,-2,2:No,-2:Skipped,-2:Skipped,-2:Skipped,-2:Skipped,2:No,-2,,,,,,,,,,,,,,,,,,,,,,,,,,,,,,,,,,,,,,,,,,,,,,,,,,,,,,,,,,,,,,,,,,,,,,,,,,,,1,13.04,-2,1:New drug,2.21,2,-2,2.5,,.,,,,.,,,.,,,,.,,,.,,,,.,,,.,,,,.,,,.,,,,.,,,.,,,,.,,,.,,,,.,,,.,,,,.,,,.,,,,.,,,.,,,,.,,,.,,,,.,,,.,,,,.,,1:< 5years,1:Class I,-2:Skipped,-2:Skipped,-2:Skipped,-2:Skipped,-2:Skipped,-2:Skipped,-2:Skipped,-2:Skipped,-2:Skipped,-2,2:No,2:No,-2,,1:Yes,2.21,50,2:No,,-2,2:No,,-2,2:No,,-2,-2,-2.00,2:No,,-2,-2.0,-2.00,-2:Skipped,-2.0,-2.0,2:No,-2:Skipped,,-2.0,-2,-2:Skipped,,-2.0,-2,2