blind_id,VISITNUM,age_echo_d,age_comp,lllrint_avg,LLLRINT1,LLLRINT2,LLLRINT3,llliso_avg,LLLISO1,LLLISO2,LLLISO3,LLLSUMWV1,LLLSUMWV2,LLLSUMWV3,lllpedv_avg,LLLPEDV1,LLLPEDV2,LLLPEDV3,lllpadv_avg,LLLPADV1,LLLPADV2,LLLPADV3,lllpksum_avg,LLLPKSUM1,LLLPKSUM2,LLLPKSUM3,lllpksv_avg,LLLPKSV1,LLLPKSV2,LLLPKSV3,lllejct_avg,LLLEJCT1,LLLEJCT2,LLLEJCT3,lllict_avg,LLLICT1,LLLICT2,LLLICT3,lsvrint_avg,LSVRINT1,LSVRINT2,LSVRINT3,lsviso_avg,LSVISO1,LSVISO2,LSVISO3,LSVSUMWV1,LSVSUMWV2,LSVSUMWV3,lsvpedv_avg,LSVPEDV1,LSVPEDV2,LSVPEDV3,lsvpadv_avg,LSVPADV1,LSVPADV2,LSVPADV3,lsvpksum_avg,LSVPKSUM1,LSVPKSUM2,LSVPKSUM3,lsvpksv_avg,LSVPKSV1,LSVPKSV2,LSVPKSV3,lsvejct_avg,LSVEJCT1,LSVEJCT2,LSVEJCT3,lsvict_avg,LSVICT1,LSVICT2,LSVICT3,lrlint_avg,LRLINT1,LRLINT2,LRLINT3,lrliso_avg,LRLISO1,LRLISO2,LRLISO3,LRLSUMWV1,LRLSUMWV2,LRLSUMWV3,lrlpedv_avg,LRLPEDV1,LRLPEDV2,LRLPEDV3,lrlpadv_avg,LRLPADV1,LRLPADV2,LRLPADV3,lrlpksum_avg,LRLPKSUM1,LRLPKSUM2,LRLPKSUM3,lrlpksv_avg,LRLPKSV1,LRLPKSV2,LRLPKSV3,lrlejct_avg,LRLEJCT1,LRLEJCT2,LRLEJCT3,lrlict_avg,LRLICT1,LRLICT2,LRLICT3,lllqrsons_avg,LLLQRSONS1,LLLQRSONS2,LLLQRSONS3,lllqrspk_avg,LLLQRSPK1,LLLQRSPK2,LLLQRSPK3,lsqrsons_avg,LSQRSONS1,LSQRSONS2,LSQRSONS3,lsqrspk_avg,LSQRSPK1,LSQRSPK2,LSQRSPK3,lrlqrsons_avg,LRLQRSONS1,LRLQRSONS2,LRLQRSONS3,lrlqrspk_avg,LRLQRSPK1,LRLQRSPK2,LRLQRSPK3,llltei_avg,llltei1,llltei2,llltei3,lllevav_avg,lllevav1,lllevav2,lllevav3,lsvtei_avg,lsvtei1,lsvtei2,lsvtei3,lsvevav_avg,lsvevav1,lsvevav2,lsvevav3,lrltei_avg,lrltei1,lrltei2,lrltei3,lrlevav_avg,lrlevav1,lrlevav2,lrlevav3,leelvfw_avg,leelvfw1,leelvfw2,leelvfw3,leeseptum_avg,leeseptum1,leeseptum2,leeseptum3,leeavg_avg,leeavg1,leeavg2,leeavg3
2,0:Baseline,11.94,11.95,926.67,905,965,910,,,,,,,,9.6,9.8,10.2,8.8,6.03,7.2,4.8,6.1,,,,,8.67,8.5,8.4,9.1,376.67,385,355,390,453.33,455,435,470,821.67,830,800,835,161,197,166,120,,,,7.1,6.5,7.0,7.8,5.2,5.1,4.6,5.9,,,,,5.97,6.4,5.7,5.8,296.67,290,305,295,433.33,440,425,435,958.33,970,950,955,566.67,679,566,455,,,,8.63,8.9,8.6,8.4,8.13,8.9,7.7,7.8,,,,,13.33,13.8,13.4,12.8,273.33,275,265,280,400,390,395,415,,,,,,,,,,,,,,,,,,,,,,,,,0.21,0.18,0.23,0.21,1.64,1.36,2.13,1.44,0.46,0.52,0.39,0.47,1.37,1.27,1.52,1.32,0.46,0.42,0.49,0.48,1.07,1,1.12,1.08,10.33,9.9,9.51,11.59,13.95,14.92,13.86,13.08,11.82,11.9,11.28,12.29
3,0:Baseline,9.51,9.54,834.67,832,832,840,79.67,84,75,80,2,2,2,4.33,5.0,4.0,4.0,2.67,3.0,3.0,2.0,,,,,4,4.0,4.0,4.0,203,203,211,195,395.67,396,390,401,704.33,716,702,695,64,64,69,59,2,2,2,4,4.0,4.0,4.0,3,3.0,3.0,3.0,,,,,3,3.0,3.0,3.0,221,232,217,214,424.33,436,409,428,699.33,718,705,675,144.33,149,134,150,2,2,2,12,11.0,13.0,12.0,9,8.0,10.0,9.0,,,,,9.67,10.0,10.0,9.0,250.67,248,261,243,353.67,343,351,367,213,211,206,222,269.33,256,277,275,141,140,145,138,265.33,260,269,267,71.67,69,69,77,157,164,156,151,0.95,0.95,0.85,1.06,1.67,1.67,1.33,2,0.92,0.88,0.88,1,1.33,1.33,1.33,1.33,0.41,0.38,0.34,0.51,1.34,1.38,1.3,1.33,21.02,17.8,22.25,23,22.5,22.25,22.25,23,21.68,19.78,22.25,23
3,1:Follow-up visit 1,9.83,9.83,496.33,491,504,494,163.33,134,216,140,2,2,2,3.33,4.0,3.0,3.0,3,3.0,3.0,3.0,,,,,6.67,6.0,7.0,7.0,184.33,188,195,170,411,407,409,417,518.33,504,481,570,153.33,167,132,161,2,2,2,5,5.0,5.0,5.0,3.67,3.0,3.0,5.0,,,,,4.67,5.0,4.0,5.0,192.33,182,200,195,392,396,380,400,539,613,489,515,179.33,193,165,180,1,1,1,,,,,,,,,3.33,3.0,4.0,3.0,6.67,7.0,6.0,7.0,225.33,211,227,238,407,389,417,415,177.67,184,167,182,325,338,325,312,121,140,110,113,329.33,338,316,334,153.67,174,145,142,350.67,351,339,362,1.24,1.16,1.1,1.45,1.11,1.33,1,1,1.04,1.18,0.9,1.05,1.45,1.67,1.67,1,0.81,0.84,0.84,0.74,,,,,14.86,12.25,15.67,16.67,9.73,9.8,9.4,10,11.71,10.89,11.75,12.5
6,0:Baseline,3.02,3.08,665.33,664,664,668,110.67,122,112,98,2,2,2,10.67,11.0,10.0,11.0,3,3.0,3.0,3.0,,,,,4,4.0,4.0,4.0,218.67,224,208,224,326.67,324,328,328,668,669,666,669,52,56,57,43,2,2,2,4,4.0,4.0,4.0,2.67,3.0,2.0,3.0,,,,,3,3.0,3.0,3.0,211.33,210,208,216,341.67,330,338,357,672.67,680,664,674,75.67,77,72,78,2,2,2,9.33,8.0,10.0,10.0,7,7.0,7.0,7.0,,,,,6.33,6.0,6.0,7.0,225.33,218,216,242,354.67,336,352,376,109.33,108,112,108,241.33,240,248,236,151.33,155,152,147,243.33,248,242,240,123.67,133,115,123,176,184,163,181,0.5,0.45,0.58,0.46,3.56,3.67,3.33,3.67,0.62,0.57,0.63,0.65,1.55,1.33,2,1.33,0.57,0.54,0.63,0.55,1.33,1.14,1.43,1.43,7.95,7.36,8.3,8.18,21.17,20.25,20.75,22.5,11.55,10.8,11.86,12
7,0:Baseline,0.5,0.52,417.33,424,416,412,369,369,,,2,2,2,8.5,9.9,6.9,8.7,5.93,5.6,5.8,6.4,,,,,4.1,4.7,3.4,4.2,217.33,236,204,212,254.67,296,240,228,420.67,416,412,434,132.5,,114,151,1,1,1,,,,,,,,,8.23,8.5,9.3,6.9,4.17,4.6,3.4,4.5,201.67,216,176,213,283,280,252,317,432.67,440,429,429,379,379,379,379,1,1,1,,,,,,,,,20.83,20.2,18.1,24.2,10.5,8.4,12.6,10.5,210.33,202,187,242,294,298,286,298,129.33,120,124,144,168,180,156,168,122.67,120,128,120,181.67,164,240,141,79,83,75,79,131,127,123,143,0.17,0.25,0.18,0.08,1.44,1.77,1.19,1.36,0.41,0.3,0.43,0.49,,,,,0.41,0.48,0.53,0.23,,,,,,,,,,,,,,,,
8,0:Baseline,6.3,6.32,656.67,676,652,642,157.67,228,135,110,2,2,2,15.33,15.1,14.8,16.1,3.57,3.4,3.7,3.6,,,,,8.27,8.7,7.8,8.3,257.33,254,264,254,370.33,364,372,375,730,732,713,745,152.33,139,157,161,2,2,2,11.87,11.8,12.4,11.4,6.4,6.7,6.0,6.5,,,,,7.9,7.6,8.4,7.7,264,269,259,264,393.67,399,383,399,670,671,668,671,180.67,172,202,168,2,2,2,14.33,14.2,14.6,14.2,7.8,8.2,7.8,7.4,,,,,13.57,14.0,14.2,12.5,272.33,283,288,246,361.67,372,367,346,73.33,69,66,85,115.33,111,119,116,71,71,71,71,195.33,190,203,193,86.33,90,77,92,197,198,190,203,0.44,0.43,0.41,0.48,4.3,4.44,4,4.47,0.49,0.48,0.48,0.51,1.86,1.76,2.07,1.75,0.33,0.31,0.27,0.41,1.84,1.73,1.87,1.92,5.83,5.76,6.15,5.59,7.53,7.37,7.34,7.89,6.57,6.47,6.69,6.55
14,0:Baseline,0.83,0.83,415,421,412,412,479.33,470,626,342,2,2,2,12.57,11.2,13.6,12.9,6.5,6.6,6.2,6.7,,,,,5.5,5.2,5.8,5.5,130.33,114,150,127,236,243,243,222,498.33,504,535,456,329.67,239,256,494,2,2,2,6.97,7.2,6.8,6.9,5.7,5.9,5.6,5.6,,,,,4.23,4.3,4.3,4.1,180.33,199,192,150,314.67,345,338,261,446.67,435,449,456,467.33,386,560,456,1,1,1,,,,,,,,,13.83,13.7,12.8,15.0,8.47,8.5,8.4,8.5,190,202,201,167,261.33,276,269,239,133.33,114,143,143,208.33,199,218,208,71,70,71,72,200.33,194,192,215,57.67,62,56,55,97,118,76,97,0.83,1.13,0.62,0.75,1.94,1.7,2.19,1.93,0.74,0.73,0.76,0.74,1.22,1.22,1.21,1.23,0.38,0.37,0.34,0.43,,,,,,,,,,,,,,,,
16,0:Baseline,6.05,6.05,755,760,755,750,88,97,94,73,,,,10.8,10.4,11.2,10.8,5.67,5.3,5.5,6.2,,,,,4.13,3.9,4.1,4.4,216.67,220,230,200,433.33,435,425,440,735,735,735,735,,,,,,,,14.63,15.3,13.5,15.1,6.07,5.8,6.3,6.1,,,,,4.3,4.3,4.3,4.3,246.67,260,225,255,410,420,400,410,771.67,765,760,790,150.67,158,152,142,,,,13.43,15.9,12.9,11.5,11.97,11.5,12.9,11.5,,,,,7.37,8.1,6.8,7.2,280,270,285,285,471.67,485,465,465,,,,,,,,,,,,,,,,,,,,,,,,,1.01,0.98,0.85,1.2,1.91,1.96,2.04,1.74,0.67,0.62,0.78,0.61,2.42,2.64,2.14,2.48,0.69,0.8,0.63,0.63,1.13,1.38,1,1,9.97,9.9,9.64,10.37,7.38,6.73,8,7.42,8.47,8.02,8.74,8.65
16,1:Follow-up visit 1,6.41,6.42,684.33,687,679,687,145.33,166,108,162,,,,5.87,6.2,6.3,5.1,4.8,4.8,4.8,4.8,,,,,2.87,2.8,2.8,3.0,194.67,203,201,180,360,359,359,362,691,689,692,692,126.33,101,140,138,,,,5.47,6.2,5.5,4.7,4.53,5.3,4.3,4.0,,,,,3.6,3.8,3.9,3.1,254.33,248,254,261,479,481,470,486,686,695,684,679,132,129,143,124,,,,11.4,10.8,12.2,11.2,8.67,9.3,8.2,8.5,,,,,8.33,8.5,7.9,8.6,235.67,224,243,240,388.33,357,388,420,,,,,,,,,,,,,,,,,,,,,,,,,0.86,0.77,0.79,1.01,1.22,1.29,1.31,1.06,0.88,0.94,0.85,0.86,1.21,1.17,1.28,1.18,0.65,0.59,0.6,0.75,1.32,1.16,1.49,1.32,,,,,,,,,,,,
16,2:Follow-up visit 2,7.11,7.12,566,568,560,570,151,92,94,267,1,1,1,,,,,,,,,14.2,16.8,13.2,12.6,5.43,6.2,5.9,4.2,206.67,206,227,187,408.33,401,412,412,551,544,565,544,,,,,1,1,1,,,,,,,,,8.1,8.9,7.7,7.7,5.1,5.5,4.9,4.9,233.33,230,235,235,395.33,391,396,399,554.33,565,562,536,379.33,423,352,363,1,1,1,,,,,,,,,16.17,16.2,16.3,16.0,10.17,10.2,9.8,10.5,200.33,195,195,211,403.67,364,388,459,105.67,108,98,111,142.67,151,132,145,91.67,106,100,69,188.33,195,193,177,99.67,106,95,98,176,185,166,177,0.99,0.95,0.81,1.2,,,,,0.7,0.7,0.69,0.7,,,,,1.01,0.87,0.99,1.18,,,,,,,,,,,,,,,,
17,0:Baseline,7.15,7.17,820.33,861,824,776,186,167,204,187,2,2,2,10,10.0,10.0,10.0,5,5.0,5.0,5.0,,,,,4,4.0,4.0,4.0,237.67,251,232,230,422.67,428,425,415,775.33,739,829,758,170.67,165,184,163,2,2,2,8,8.0,8.0,8.0,5,5.0,5.0,5.0,,,,,5,5.0,5.0,5.0,238.67,232,240,244,431.33,433,428,433,733.67,687,761,753,199,190,211,196,2,2,2,10.33,11.0,10.0,10.0,7.33,8.0,7.0,7.0,,,,,12.67,13.0,13.0,12.0,289.67,306,275,288,384.67,393,375,386,128.33,124,132,129,285.33,293,284,279,110,116,106,108,226,232,219,227,77.67,77,77,79,188,187,190,187,0.78,0.71,0.83,0.8,2,2,2,2,0.81,0.87,0.78,0.77,1.6,1.6,1.6,1.6,0.33,0.28,0.36,0.34,1.41,1.38,1.43,1.43,11.6,11.2,12,11.6,14.5,14,15,14.5,12.89,12.44,13.33,12.89
17,1:Follow-up visit 1,7.62,7.63,881.67,876,887,882,107.67,104,113,106,2,2,2,9.33,9.0,10.0,9.0,4,4.0,4.0,4.0,,,,,5,5.0,5.0,5.0,266.67,267,264,269,454.33,454,455,454,841.67,927,845,753,145.33,139,147,150,2,2,2,8,7.0,8.0,9.0,5.67,6.0,6.0,5.0,,,,,5.33,5.0,6.0,5.0,262,269,261,256,430.33,430,431,430,810,803,925,702,167.33,164,168,170,2,2,2,11.33,12.0,11.0,11.0,10,10.0,10.0,10.0,,,,,12,12.0,13.0,11.0,246.33,256,243,240,381.33,398,383,363,102.67,106,103,99,141,143,140,140,94.33,88,95,100,208.67,203,208,215,104.67,108,103,103,190.67,185,192,195,0.7,0.7,0.72,0.69,2.33,2.25,2.5,2.25,0.64,0.6,0.65,0.68,1.43,1.17,1.33,1.8,0.55,0.55,0.58,0.51,1.13,1.2,1.1,1.1,11.63,12.22,11,11.67,13.71,15.71,13.75,11.67,12.55,13.75,12.22,11.67
17,2:Follow-up visit 2,8.22,8.23,779.67,771,829,739,169.33,163,165,180,2,2,2,10.33,10.0,11.0,10.0,4.33,4.0,5.0,4.0,,,,,5,5.0,5.0,5.0,288.67,275,290,301,440.33,446,439,436,721,787,732,644,133,128,140,131,2,2,2,8.33,8.0,9.0,8.0,5,5.0,5.0,5.0,,,,,5,5.0,5.0,5.0,263,259,261,269,442.67,449,436,443,759,762,758,757,153.33,147,161,152,2,2,2,10.33,10.0,10.0,11.0,11,11.0,11.0,11.0,,,,,10.33,10.0,10.0,11.0,265.33,264,261,271,429.33,430,422,436,79.33,90,79,69,118.67,119,121,116,114.67,110,114,120,221,227,214,222,105,103,106,106,184.67,177,187,190,0.53,0.62,0.51,0.45,2.4,2.5,2.2,2.5,0.68,0.73,0.67,0.65,1.67,1.6,1.8,1.6,0.62,0.63,0.62,0.61,0.94,0.91,0.91,1,10.86,10.9,10.27,11.4,13.48,13.63,12.56,14.25,12.03,12.11,11.3,12.67
18,0:Baseline,11.36,11.36,729.67,693,733,763,,,,,,,,14.43,12.5,16.0,14.8,5.8,4.1,6.0,7.3,,,,,7.8,7.5,8.9,7.0,232,223,240,233,371.33,367,370,377,735.67,687,743,777,127.33,100,155,127,,,,9.77,11.1,8.4,9.8,6.17,6.0,6.0,6.5,,,,,5.5,4.1,5.7,6.7,256.67,250,267,253,374.33,373,373,377,664.33,670,673,650,164.67,190,156,148,,,,11.43,10.8,11.9,11.6,6.3,6.8,6.7,5.4,,,,,8.93,8.7,9.4,8.7,218.67,223,220,213,382,380,383,383,,,,,,,,,,,,,,,,,,,,,,,,,0.6,0.65,0.54,0.62,2.58,3.05,2.67,2.03,0.46,0.49,0.4,0.49,1.59,1.85,1.4,1.51,0.75,0.7,0.74,0.8,1.84,1.59,1.78,2.15,5.4,5.28,5.31,5.61,8.18,5.95,10.12,8.47,6.44,5.59,6.97,6.75
18,1:Follow-up visit 1,11.86,11.93,552,552,539,565,183,236,154,159,2,2,2,17.17,19.0,16.1,16.4,6.07,6.0,5.9,6.3,,,,,6.97,6.9,6.9,7.1,254.33,248,261,254,383.67,378,380,393,553,555,552,552,102.33,132,94,81,2,2,2,6.43,6.5,6.4,6.4,8.73,8.3,8.8,9.1,,,,,5.37,5.3,5.3,5.5,232.33,232,235,230,383,375,383,391,575.33,578,570,578,161.33,164,205,115,1,1,1,,,,,,,,,27.13,28.2,25.9,27.3,13.7,14.5,13.0,13.6,264,277,259,256,417.33,420,420,412,90.67,90,95,87,185.67,182,185,190,87.33,90,82,90,140,153,135,132,81,82,82,79,138,129,140,145,0.51,0.52,0.46,0.55,2.83,3.17,2.73,2.6,0.65,0.62,0.63,0.7,0.74,0.78,0.73,0.7,0.58,0.52,0.62,0.61,,,,,,,,,,,,,,,,
19,0:Baseline,16.77,16.83,1120,1084,1152,1124,89.33,65,88,115,2,2,2,12,12.0,12.0,12.0,2,2.0,2.0,2.0,,,,,6,6.0,6.0,6.0,269.33,284,248,276,416,428,404,416,1048,1028,1032,1084,68.67,77,56,73,2,2,2,11,11.0,11.0,11.0,2.33,2.0,2.0,3.0,,,,,7,7.0,7.0,7.0,284,292,292,268,470.67,464,468,480,1045.33,996,1096,1044,114.67,113,142,89,2,2,2,8.67,9.0,8.0,9.0,3,3.0,4.0,2.0,,,,,9.67,9.0,10.0,10.0,272,276,276,264,466.67,452,456,492,109.33,108,124,96,233.33,248,244,208,120,112,124,124,253.33,256,268,236,132,116,124,156,240,216,244,260,0.55,0.51,0.63,0.51,6,6,6,6,0.66,0.59,0.6,0.79,4.89,5.5,5.5,3.67,0.72,0.64,0.65,0.86,3.17,3,2,4.5,,,,,,,,,,,,
19,1:Follow-up visit 1,16.97,17.16,970.67,944,940,1028,79.67,106,92,41,2,2,2,11,10.0,10.0,13.0,1.67,1.0,2.0,2.0,,,,,5.67,5.0,5.0,7.0,277.33,296,280,256,405.33,412,396,408,998.67,1024,980,992,71,63,73,77,2,2,2,8.67,9.0,9.0,8.0,5,5.0,5.0,5.0,,,,,7.67,8.0,8.0,7.0,320,328,320,312,530.67,532,532,528,1126.67,1100,1100,1180,85.67,72,105,80,2,2,2,7,7.0,7.0,7.0,4.67,5.0,5.0,4.0,,,,,10.33,10.0,11.0,10.0,308,328,304,292,546.67,572,524,544,97.33,84,76,132,222.67,232,216,220,152,148,160,148,257.33,284,248,240,140,144,136,140,252,268,228,260,0.46,0.39,0.41,0.59,7.17,10,5,6.5,0.66,0.62,0.66,0.69,1.73,1.8,1.8,1.6,0.77,0.74,0.72,0.86,1.52,1.4,1.4,1.75,4.92,5.7,5.2,3.85,6.12,6.33,5.78,6.25,5.41,6,5.47,4.76
20,0:Baseline,14.87,14.89,907.33,908,933,881,,,,,,,,10.43,10.9,10.2,10.2,2.17,2.1,2.3,2.1,,,,,3.83,3.5,3.9,4.1,267.33,254,258,290,397,397,397,397,961.33,884,972,1028,,,,,,,,10.5,10.4,10.2,10.9,3.73,4.0,3.9,3.3,,,,,3.9,3.7,3.7,4.3,255,239,251,275,456.67,442,458,470,951.67,936,1064,855,243.67,266,261,204,,,,7,6.3,7.5,7.2,4.17,3.9,4.3,4.3,,,,,6.67,6.1,6.9,7.0,262.33,257,281,249,446,466,426,446,,,,,,,,,,,,,,,,,,,,,,,,,0.49,0.56,0.54,0.37,4.83,5.19,4.43,4.86,0.79,0.85,0.82,0.71,2.84,2.6,2.62,3.3,0.71,0.81,0.52,0.79,1.68,1.62,1.74,1.67,8.99,8.53,8.53,9.9,8.91,8.94,8.53,9.27,8.94,8.73,8.53,9.57
20,1:Follow-up visit 1,15.18,15.23,592,592,592,592,,,,,1,1,1,,,,,,,,,8.57,7.5,9.9,8.3,4.1,4.2,4.4,3.7,188,184,188,192,248,240,256,248,594,594,594,594,,,,,1,1,1,,,,,,,,,7.17,7.6,6.7,7.2,7.07,6.8,7.2,7.2,265,273,273,249,295,312,319,254,592,592,592,592,141,132,159,132,1,1,1,,,,,,,,,11.03,10.5,10.3,12.3,9.6,9.2,9.8,9.8,294.67,284,284,316,334.67,300,340,364,157.33,152,156,164,276,252,292,284,82.67,76,68,104,223.67,217,221,233,37.33,40,40,32,197.33,196,196,200,0.32,0.3,0.36,0.29,,,,,0.11,0.14,0.17,0.02,,,,,0.14,0.06,0.2,0.15,,,,,,,,,,,,,,,,
22,0:Baseline,3.58,4.17,634,639,605,658,207,240,196,185,2,2,2,15.4,14.8,15.4,16.0,3.37,3.2,3.7,3.2,,,,,6,5.8,6.3,5.9,266.67,248,269,283,389,393,396,378,836.67,959,621,930,197,190,184,217,2,2,2,13.17,13.0,13.0,13.5,4.17,3.5,4.2,4.8,,,,,6.97,6.8,7.3,6.8,288.67,285,288,293,380,380,372,388,623,615,639,615,376,299,348,481,2,2,2,16.47,17.1,16.4,15.9,11.5,11.7,10.9,11.9,,,,,8.97,8.5,9.5,8.9,286.33,288,288,283,377.33,388,364,380,54.33,63,45,55,132,140,121,135,44,45,42,45,148,153,151,140,49.33,45,50,53,145.33,143,158,135,0.46,0.58,0.47,0.34,4.6,4.63,4.16,5,0.31,0.33,0.29,0.32,3.21,3.71,3.1,2.81,0.32,0.35,0.26,0.34,1.43,1.46,1.5,1.34,6.52,6.55,6.95,6.06,7.63,7.46,8.23,7.19,7.03,6.98,7.54,6.58
23,0:Baseline,5.49,6.15,671.33,670,668,676,130,128,132,130,2,2,2,27.33,28.0,27.0,27.0,5,5.0,5.0,5.0,,,,,8.67,9.0,9.0,8.0,270.67,272,268,272,373.33,374,370,376,599.33,600,596,602,130.67,138,128,126,2,2,2,12.33,13.0,12.0,12.0,4.33,4.0,5.0,4.0,,,,,6,6.0,6.0,6.0,264.67,258,268,268,372,372,368,376,652,646,670,640,195.33,196,200,190,2,2,2,16.33,17.0,16.0,16.0,6.67,6.0,7.0,7.0,,,,,13.33,14.0,13.0,13.0,242.67,232,256,240,346.67,362,328,350,78,78,80,76,216.67,210,220,220,73.33,70,78,72,146,162,138,138,82.67,86,78,84,172,170,168,178,0.38,0.38,0.38,0.38,5.47,5.6,5.4,5.4,0.4,0.44,0.37,0.4,2.88,3.25,2.4,3,0.43,0.56,0.28,0.46,2.47,2.83,2.29,2.29,4.02,4,4.07,4,8.93,8.62,9.17,9,5.55,5.46,5.64,5.54
23,1:Follow-up visit 1,5.78,5.88,741.33,748,744,732,148.33,176,148,121,2,2,2,24.67,26.0,25.0,23.0,5.67,6.0,6.0,5.0,,,,,8.67,9.0,8.0,9.0,296,288,296,304,396,396,404,388,665.33,688,692,616,280.67,295,269,278,2,2,2,16.33,15.0,17.0,17.0,4,4.0,4.0,4.0,,,,,6,6.0,6.0,6.0,266.67,268,272,260,396,408,392,388,696,720,696,672,360.67,365,396,321,2,2,2,14.33,14.0,15.0,14.0,7.33,8.0,8.0,6.0,,,,,13.33,13.0,13.0,14.0,266.67,276,264,260,368,360,352,392,81.33,84,96,64,114.67,116,124,104,82.67,88,80,80,165.33,148,160,188,89.33,80,88,100,185.33,172,184,200,0.34,0.38,0.36,0.28,4.37,4.33,4.17,4.6,0.48,0.52,0.44,0.49,4.08,3.75,4.25,4.25,0.38,0.3,0.33,0.51,1.99,1.75,1.88,2.33,4.51,4.31,4.56,4.65,6.82,7.47,6.71,6.29,5.41,5.46,5.43,5.35
24,0:Baseline,9.27,9.29,669,660,684,663,130.67,139,121,132,2,2,2,6,5.0,6.0,7.0,3.33,4.0,3.0,3.0,,,,,3.67,3.0,4.0,4.0,246.67,243,254,243,434.67,401,449,454,641.67,652,642,631,130,125,146,119,2,2,2,4,4.0,4.0,4.0,2,2.0,2.0,2.0,,,,,3.67,3.0,4.0,4.0,188.33,195,180,190,356.67,359,343,368,653,660,655,644,138.33,136,137,142,2,2,2,11,10.0,11.0,12.0,4.33,4.0,5.0,4.0,,,,,7.33,8.0,7.0,7.0,212.33,217,201,219,372.33,396,357,364,149,156,143,148,323.67,327,322,322,146.67,153,148,139,224.67,217,222,235,120.67,111,127,124,226,224,222,232,0.76,0.65,0.77,0.87,1.86,1.25,2,2.33,0.9,0.84,0.91,0.94,2,2,2,2,0.75,0.82,0.78,0.66,2.57,2.5,2.2,3,18.65,22,18.67,15.29,27.42,27.5,28,26.75,22.1,24.44,22.4,19.45
24,1:Follow-up visit 1,9.59,9.59,550,547,544,559,152,137,160,159,2,2,2,8,6.0,9.0,9.0,3.67,4.0,4.0,3.0,,,,,3.67,3.0,4.0,4.0,207.67,216,204,203,342,343,345,338,556.33,565,557,547,161.67,144,161,180,1,1,1,,,,,,,,,2.67,3.0,3.0,2.0,3.67,4.0,4.0,3.0,175,185,175,165,443,428,441,460,558.67,549,559,568,149.67,147,155,147,1,1,1,,,,,,,,,8.67,10.0,8.0,8.0,7,7.0,7.0,7.0,233.33,224,240,236,386.33,365,393,401,130.33,137,127,127,224.67,230,226,218,200.33,200,200,201,329,336,327,324,61.33,63,61,60,155.67,169,150,148,0.65,0.59,0.69,0.67,2.25,1.5,2.25,3,1.54,1.31,1.52,1.79,,,,,0.66,0.63,0.64,0.7,,,,,13.09,16.83,11.33,11.11,,,,,,,,
27,0:Baseline,0.56,0.59,428.67,454,420,412,194.67,190,192,202,2,2,1,10.7,10.2,11.2,,8.9,10.5,7.3,,9.4,,,9.4,8.7,6.9,9.4,9.8,182,177,195,174,245.67,227,267,243,431.33,436,428,430,298.33,249,312,334,2,2,2,6.4,6.1,6.2,6.9,9.47,9.4,9.6,9.4,,,,,4.9,4.9,4.5,5.3,177.67,164,182,187,286,280,285,293,402.33,407,407,393,395.33,513,418,255,1,1,1,,,,,,,,,17.83,17.8,17.7,18.0,9.33,9.0,9.0,10.0,176.67,174,182,174,268.33,269,261,275,36.33,48,29,32,68.67,71,74,61,44,45,42,45,96.67,100,90,100,28.33,29,32,24,94.33,92,85,106,0.35,0.28,0.37,0.4,1.25,0.97,1.53,,0.62,0.71,0.57,0.57,0.68,0.65,0.65,0.73,0.52,0.55,0.43,0.58,,,,,,,,,,,,,,,,
27,1:Follow-up visit 1,0.78,0.83,,,,,236,203,182,323,2,2,2,10.73,11.7,10.2,10.3,5.6,5.5,5.1,6.2,,,,,5.13,5.6,4.8,5.0,210.33,211,209,211,318,312,320,322,,,,,248.33,173,295,277,2,2,2,6.43,6.7,6.6,6.0,6.33,6.4,6.5,6.1,,,,,5.1,4.9,5.4,5.0,204.33,206,198,209,317.67,327,306,320,,,,,438,501,386,427,2,2,2,9.3,9.4,9.9,8.6,11.97,12.1,12.2,11.6,,,,,,,,,209.67,209,203,217,310.33,306,317,308,,,,,,,,,,,,,,,,,,,,,,,,,0.51,0.48,0.53,0.53,1.93,2.13,2,1.66,0.56,0.59,0.55,0.53,1.02,1.05,1.02,0.98,0.48,0.46,0.56,0.42,0.78,0.78,0.81,0.74,9.16,7.86,9.71,9.9,15.24,13.73,15,17,11.44,10,11.79,12.52
28,0:Baseline,3.81,3.84,745.67,755,729,753,147,146,101,194,2,2,2,13.37,12.6,14.6,12.9,3.2,3.0,3.3,3.3,,,,,7.07,6.9,7.3,7.0,291.33,290,304,280,394.33,393,399,391,806.33,702,753,964,208.67,216,174,236,2,2,2,9.13,9.7,8.5,9.2,3.67,4.0,4.0,3.0,,,,,6.37,6.5,6.2,6.4,281.67,280,269,296,383,370,386,393,860.33,798,790,993,233,231,221,247,2,2,2,19.2,19.4,18.8,19.4,7.13,7.4,7.6,6.4,,,,,13.03,12.6,12.6,13.9,277.33,277,283,272,382,382,386,378,93,92,92,95,243,230,251,248,83.67,82,95,74,223.67,211,230,230,91,91,90,92,220.33,213,224,224,0.36,0.36,0.31,0.4,4.18,4.2,4.42,3.91,0.36,0.32,0.43,0.33,2.54,2.43,2.13,3.07,0.38,0.38,0.36,0.39,2.71,2.62,2.47,3.03,11.24,11.59,10.41,11.71,16.45,15.05,17.88,16.41,13.31,13.09,13.16,13.67
28,1:Follow-up visit 1,4.25,4.31,875.33,777,1075,774,206.33,240,184,195,2,2,2,12.6,13.3,10.6,13.9,3.23,3.4,2.8,3.5,,,,,6.23,6.3,5.7,6.7,318,318,318,318,395.67,389,399,399,759.33,683,730,865,158.67,193,176,107,2,2,2,6.83,5.9,7.7,6.9,3.63,4.1,3.2,3.6,,,,,5.83,5.9,5.9,5.7,269.33,254,277,277,388.67,379,392,395,886.67,804,1072,784,125.67,147,125,105,2,2,2,10.5,10.9,11.7,8.9,5.83,6.0,5.5,6.0,,,,,9.47,8.9,9.5,10.0,282.67,291,297,260,399,399,399,399,72.33,54,85,78,243.67,247,254,230,96,98,105,85,227.67,220,233,230,85,85,85,85,214,213,233,196,0.24,0.22,0.25,0.25,3.89,3.91,3.79,3.97,0.45,0.49,0.42,0.43,1.92,1.44,2.41,1.92,0.41,0.37,0.34,0.53,1.81,1.82,2.13,1.48,,,,,,,,,,,,
28,2:Follow-up visit 2,4.77,4.8,1011.67,798,1122,1115,164,141,141,210,2,2,2,18.2,17.7,18.0,18.9,2.8,3.2,2.6,2.6,,,,,9.13,9.3,9.2,8.9,286.33,291,260,308,401,399,375,429,1011.67,1122,821,1092,204,216,216,180,2,2,2,9,8.3,9.8,8.9,3.5,3.5,3.3,3.7,,,,,6.77,6.8,6.9,6.6,308.67,311,304,311,419.33,423,409,426,1123.33,1014,1146,1210,248.67,301,142,303,2,2,2,11.9,11.9,13.4,10.4,5.87,5.9,6.4,5.3,,,,,11.6,12.5,11.7,10.6,267,260,277,264,395.33,392,399,395,86.67,64,128,68,217.67,203,237,213,71,71,74,68,233.33,230,220,250,73.33,78,74,68,179.33,189,210,139,0.4,0.37,0.44,0.39,6.57,5.53,6.92,7.27,0.36,0.36,0.35,0.37,2.58,2.37,2.97,2.41,0.48,0.51,0.44,0.5,2.02,2.02,2.09,1.96,7.78,8.42,7.5,7.41,15.82,17.95,13.78,15.73,10.41,11.46,9.71,10.07
29,0:Baseline,2.88,2.92,769,749,797,761,,,,,,,,11.7,12.0,11.8,11.3,4.7,5.1,4.6,4.4,,,,,5.3,5.5,5.1,5.3,243,243,247,239,389,367,398,402,699.33,733,705,660,197,249,196,146,,,,12.37,12.8,11.4,12.9,5.27,5.2,5.2,5.4,,,,,6.17,5.9,6.3,6.3,226,227,227,224,404,402,402,408,748,768,712,764,225.33,155,327,194,,,,16.6,16.3,16.9,16.6,9.97,9.3,9.7,10.9,,,,,12.8,12.9,12.4,13.1,246.67,244,252,244,394.67,404,388,392,,,,,,,,,,,,,,,,,,,,,,,,,0.6,0.51,0.61,0.68,2.5,2.35,2.57,2.57,0.79,0.77,0.77,0.82,2.35,2.46,2.19,2.39,0.6,0.66,0.54,0.61,1.67,1.75,1.74,1.52,9.41,9.08,9.58,9.56,8.93,8.52,9.91,8.37,9.15,8.79,9.74,8.93
30,0:Baseline,10.97,10.98,633.33,616,645,639,375.67,377,357,393,,,,11.67,11.1,11.8,12.1,6.5,5.4,7.5,6.6,,,,,10.43,10.3,10.2,10.8,261.33,262,260,262,362.33,354,371,362,657.33,651,648,673,167.33,176,163,163,,,,7.8,8.0,8.2,7.2,9.87,9.8,9.8,10.0,,,,,6.97,6.9,6.9,7.1,243.67,243,248,240,389,385,394,388,634.33,639,648,616,416,475,411,362,,,,11.7,11.7,12.0,11.4,10.9,11.2,11.4,10.1,,,,,10.8,10.9,11.2,10.3,240.67,240,237,245,389,399,391,377,,,,,,,,,,,,,,,,,,,,,,,,,0.39,0.35,0.43,0.38,1.82,2.06,1.57,1.83,0.6,0.58,0.59,0.62,0.79,0.82,0.84,0.72,0.62,0.66,0.65,0.54,1.07,1.04,1.05,1.13,,,,,,,,,,,,
32,0:Baseline,17.02,17.05,907,901,901,919,129.33,127,134,127,2,2,2,17.53,17.9,17.5,17.2,2.77,2.8,2.6,2.9,,,,,9.57,9.8,9.9,9.0,327,327,327,327,464,462,465,465,874,858,885,879,132,112,152,,2,2,2,13.97,14.7,13.3,13.9,4.17,3.8,4.6,4.1,,,,,7.83,8.2,7.7,7.6,314.33,312,314,317,425.33,478,420,378,744,755,724,753,137.33,149,154,109,1,1,1,,,,,,,,,13.37,13.2,13.8,13.1,15.03,15.5,15.0,14.6,254.33,243,251,269,415.33,409,417,420,85.33,79,98,79,136.67,151,135,124,75,69,77,79,231.33,227,235,232,146.33,140,151,148,250,243,248,259,0.42,0.41,0.42,0.42,6.35,6.39,6.73,5.93,0.35,0.53,0.34,0.19,3.38,3.87,2.89,3.39,0.63,0.68,0.66,0.56,,,,,6.07,5.81,6.06,6.34,7.63,7.07,7.97,7.84,6.76,6.38,6.88,7.01
33,0:Baseline,10.39,10.41,593.33,591,593,596,190,230,180,160,,,,14,14.0,13.7,14.3,4.33,4.2,3.8,5.0,,,,,7.37,7.5,7.5,7.1,271.33,271,278,265,376.33,371,379,379,614,636,576,630,180,200,150,190,,,,10.5,10.1,11.6,9.8,5.93,6.3,5.8,5.7,,,,,7.77,8.0,6.9,8.4,234.67,222,237,245,380.33,371,391,379,582,588,579,579,313.33,320,310,310,,,,11.93,12.2,11.7,11.9,12.97,13.3,12.4,13.2,,,,,14.87,15.2,15.2,14.2,238.67,240,234,242,334.67,345,342,317,,,,,,,,,,,,,,,,,,,,,,,,,0.39,0.37,0.36,0.43,3.27,3.33,3.61,2.86,0.62,0.67,0.65,0.55,1.77,1.6,2,1.72,0.4,0.44,0.46,0.31,0.92,0.92,0.94,0.9,,,,,,,,,,,,
34,0:Baseline,0.15,0.19,420,420,420,420,152,146,169,141,2,1,1,9,9.0,,,4,4.0,,,8.5,,9.0,8.0,4.67,4.0,5.0,5.0,176.67,175,194,161,308.67,313,315,298,372.67,377,369,372,233,214,271,214,1,1,1,,,,,,,,,11.67,13.0,11.0,11.0,5.33,5.0,6.0,5.0,186.67,183,183,194,271.33,270,276,268,383,383,380,386,226.33,285,197,197,1,1,1,,,,,,,,,18,18.0,17.0,19.0,9.67,10.0,10.0,9.0,191.33,191,197,186,252.67,256,253,249,99.33,87,107,104,160.33,152,158,171,51.33,56,42,56,160.33,132,180,169,46.67,39,53,48,101.33,96,98,110,0.75,0.79,0.62,0.85,2.25,2.25,,,0.46,0.48,0.51,0.38,,,,,0.32,0.34,0.28,0.34,,,,,,,,,,,,,,,,