blind_id,VISIT,MOTHER_AGE_YEARS,FATHER_AGE_YEARS,MOM_CAR_DEF,MOM_CARDIAC,mom_card_1_1,mom_card_1_2,mcardi_1_sp1,mcardi_1_sp2,MOM_M_PROB,MOM_HOSPITAL,MOM_SURGERY,DAD_CAR_DEF,DAD_CARDIAC,dad_card_1_1,dad_card_1_2,dcardi_1_sp1,dcardi_1_sp2,DAD_M_PROB,DAD_HOSPITAL,DAD_SURGERY,RELATIVE,relat_code1,relat_code2,relat_code3,relat_code4,relat_code_s1,relat_code_s2,relat_code_s3,relat_code_s4,relat_car_c1,relat_car_c2,relat_car_c3,relat_car_c4,relat_car_sp1,relat_car_sp2,relat_car_sp3,relat_car_sp4,COMP_TIME
2,Genetics visit,30.85,36.27,No,,,,,,No,No,No,No,,,,,,No,No,No,0,,,,,,,,,,,,,,,,,5
4,Genetics visit,30.95,33.97,No,,,,,,No,No,Yes,No,,,,,,No,No,No,3,03 Maternal uncle,11 Maternal grandfather,12 Maternal grandmother,,,,,,05 ASD,19 Mitral valve prolapse,19 Mitral valve prolapse,,,,,,5
5,Genetics visit,39.85,40.3,No,,,,,,No,Yes,No,No,,,,,,No,No,No,0,,,,,,,,,,,,,,,,,10
6,Genetics visit,,,No,,,,,,Yes,Yes,Yes,No,,,,,,No,No,Yes,0,,,,,,,,,,,,,,,,,10
7,Genetics visit,28.02,31.27,No,,,,,,No,Yes,No,No,,,,,,Yes,No,Yes,0,,,,,,,,,,,,,,,,,15
9,Genetics visit,23.99,25.12,No,,,,,,No,Yes,No,Yes,1,10 Coarctation,,,,No,No,Yes,0,,,,,,,,,,,,,,,,,15
12,Genetics visit,29.92,41.93,No,,,,,,No,No,No,No,,,,,,No,No,Yes,0,,,,,,,,,,,,,,,,,5
23,Genetics visit,29.03,31.69,No,,,,,,No,No,Yes,No,,,,,,Yes,Yes,Yes,3,10 Paternal grandmother,"99 Other, specify","99 Other, specify",,,COUSIN,COUSIN,,99 Other,1 6HLHS,"02 Aortic outflow abnormalities (valvular AS, AR)",,HEART ATTACK TRIPLE BYPASS SURG,,,,20
32,Genetics visit,22.68,31.9,No,,,,,,No,No,No,No,,,,,,No,No,No,1,"99 Other, specify",,,,aunt's daughter,,,,1 6HLHS,,,,,,,,30
36,Genetics visit,35.74,36.22,No,,,,,,Yes,No,Yes,Yes,1,06 Bicuspid aortic valve,,,,No,No,Yes,0,,,,,,,,,,,,,,,,,20
38,Genetics visit,36.49,35.84,No,,,,,,No,Yes,Yes,No,,,,,,No,No,Yes,0,,,,,,,,,,,,,,,,,10
40,Genetics visit,40.18,34.86,No,,,,,,No,No,No,No,,,,,,No,No,No,0,,,,,,,,,,,,,,,,,5
46,Genetics visit,37.72,43.91,No,,,,,,No,No,Yes,No,,,,,,No,No,No,2,09 Paternal grandfather,11 Maternal grandfather,,,,,,,99 Other,99 Other,,,Defective heart valve,Defective heart valve,,,10
52,Genetics visit,34.83,33.41,No,,,,,,No,No,Yes,No,,,,,,No,No,No,0,,,,,,,,,,,,,,,,,10
58,Genetics visit,40.68,42.29,Yes,1,99 Other,,HEART MURMUR,,No,No,Yes,No,,,,,,No,No,No,0,,,,,,,,,,,,,,,,,20
61,Genetics visit,40.22,36.31,Yes,1,99 Other,,Murmur,,No,Yes,Yes,Yes,1,99 Other,,irregular heart beat,,No,Yes,Yes,0,,,,,,,,,,,,,,,,,60
62,Genetics visit,32.26,,No,,,,,,No,Yes,No,No,,,,,,No,Unknown,Unknown,1,03 Maternal uncle,,,,,,,,99 Other,,,,HOLE IS HEART,,,,10
69,Genetics visit,34.19,34.83,No,,,,,,No,No,No,No,,,,,,No,No,Yes,0,,,,,,,,,,,,,,,,,30
72,Genetics visit,36.71,37.28,No,,,,,,No,No,Yes,No,,,,,,No,Yes,No,0,,,,,,,,,,,,,,,,,5
74,Genetics visit,40.79,31.96,No,,,,,,No,No,No,No,,,,,,No,Yes,No,1,09 Paternal grandfather,,,,,,,,-9 Missing,,,,,,,,20
77,Genetics visit,25.26,26.34,No,,,,,,Yes,Yes,Yes,No,,,,,,No,No,Yes,0,,,,,,,,,,,,,,,,,15
78,Genetics visit,41,44.33,No,,,,,,No,No,Yes,No,,,,,,No,No,No,3,03 Maternal uncle,04 Maternal aunt,12 Maternal grandmother,,,,,,99 Other,06 Bicuspid aortic valve,"02 Aortic outflow abnormalities (valvular AS, AR)",,"""HOLE IN HEART"" DIED IN EARLY INFANCY",,,,20
83,Genetics visit,28.34,28.1,No,,,,,,No,No,No,No,,,,,,No,No,No,2,11 Maternal grandfather,"99 Other, specify",,,,MATERNAL GREAT GRANDFATHER,,,19 Mitral valve prolapse,99 Other,,,,UNKNOWN,,,5
87,Genetics visit,32.05,31.49,Yes,1,19 Mitral valve prolapse,,,,No,No,No,No,,,,,,No,No,No,1,11 Maternal grandfather,,,,,,,,19 Mitral valve prolapse,,,,,,,,5
91,Genetics visit,33.97,32.92,No,,,,,,No,No,Yes,No,,,,,,No,No,Yes,2,"99 Other, specify","99 Other, specify",,,maternal cousin,paternal aunt,,,99 Other,99 Other,,,Hypoplastic heart- unknown side.,Hypoplastic heart- unknown side.,,,45
92,Genetics visit,39.24,63.04,No,,,,,,No,No,No,No,,,,,,Yes,No,Yes,1,10 Paternal grandmother,,,,,,,,05 ASD,,,,,,,,5
95,Genetics visit,37.69,41.52,No,,,,,,Yes,Yes,Yes,No,,,,,,No,No,No,0,,,,,,,,,,,,,,,,,10
101,Genetics visit,35.26,,No,,,,,,Yes,No,Yes,No,,,,,,Yes,No,No,0,,,,,,,,,,,,,,,,,20
106,Genetics visit,29.78,36.94,No,,,,,,No,No,No,No,,,,,,No,No,Yes,0,,,,,,,,,,,,,,,,,5
114,Genetics visit,46.49,56.82,No,,,,,,No,Yes,Yes,No,,,,,,No,Yes,No,0,,,,,,,,,,,,,,,,,7
127,Genetics visit,24.91,30.02,No,,,,,,No,No,No,No,,,,,,No,No,Yes,1,"99 Other, specify",,,,paternal grandaunt,,,,99 Other,,,,The family was told she had cardiac problem. She died at age of 4 days old.,,,,20
134,Genetics visit,27.15,31.15,No,,,,,,No,No,Yes,No,,,,,,No,No,Yes,1,10 Paternal grandmother,,,,,,,,19 Mitral valve prolapse,,,,,,,,25
139,Genetics visit,25.11,,Unknown,,,,,,Yes,Yes,Yes,Unknown,,,,,,Unknown,Unknown,Unknown,1,"99 Other, specify",,,,Mother's 2nd cousin's son,,,,26 Single ventricle,,,,,,,,30
141,Genetics visit,23.3,30.72,No,,,,,,Yes,Yes,Yes,No,,,,,,Yes,No,Yes,1,12 Maternal grandmother,,,,,,,,35 VSD,,,,,,,,10
142,Genetics visit,28.68,28.68,No,,,,,,No,No,No,No,,,,,,Yes,No,No,0,,,,,,,,,,,,,,,,,15
143,Genetics visit,44.6,52.07,No,,,,,,Yes,No,Yes,No,,,,,,No,No,No,0,,,,,,,,,,,,,,,,,10
147,Genetics visit,37.78,37.59,No,,,,,,No,No,Yes,No,,,,,,No,No,Yes,0,,,,,,,,,,,,,,,,,20
149,Genetics visit,32.34,34.83,No,,,,,,No,No,No,No,,,,,,No,No,No,0,,,,,,,,,,,,,,,,,15
154,Genetics visit,43.84,44.27,No,,,,,,No,No,Yes,No,,,,,,Yes,No,Yes,0,,,,,,,,,,,,,,,,,45
156,Genetics visit,30.74,40.21,No,,,,,,Yes,No,Yes,No,,,,,,Yes,No,Yes,1,,,,,,,,,,,,,,,,,15
161,Genetics visit,33.94,34.49,No,,,,,,No,No,No,No,,,,,,No,No,No,0,,,,,,,,,,,,,,,,,10
165,Genetics visit,31.39,28.68,No,,,,,,No,No,No,No,,,,,,No,No,No,1,"99 Other, specify",,,,Maternal great grandfather,,,,"04Arrhythmias (WPW; prolonged Q-T syndrome; SVT; VT; CHB; SSS; 1ST, 2ND heart block; sinus bradycard",,,,,,,,5
166,Genetics visit,45.31,49.14,No,,,,,,No,No,Yes,No,,,,,,No,No,No,0,,,,,,,,,,,,,,,,,20
168,Genetics visit,32.65,38.58,No,,,,,,Yes,Yes,No,No,,,,,,No,No,No,0,,,,,,,,,,,,,,,,,10
169,Genetics visit,39.09,58.57,No,,,,,,No,No,No,No,,,,,,Yes,No,Yes,0,,,,,,,,,,,,,,,,,2
176,Genetics visit,28.25,30.97,No,,,,,,No,No,No,No,,,,,,No,No,No,0,,,,,,,,,,,,,,,,,45
184,Genetics visit,36.79,43.2,No,,,,,,Yes,No,Yes,No,,,,,,Yes,No,Yes,0,,,,,,,,,,,,,,,,,10
187,Genetics visit,24.83,25.05,No,,,,,,No,No,Yes,No,,,,,,No,No,No,0,,,,,,,,,,,,,,,,,5
196,Genetics visit,39.61,41.05,No,,,,,,No,Yes,Yes,Yes,2,10 Coarctation,06 Bicuspid aortic valve,,,No,No,Yes,1,10 Paternal grandmother,,,,,,,,99 Other,,,,ICD placed,,,,10
197,Genetics visit,37.02,34.74,No,,,,,,No,No,Yes,No,,,,,,No,No,No,0,,,,,,,,,,,,,,,,,40
203,Genetics visit,31.18,32.92,No,,,,,,No,No,No,No,,,,,,No,No,No,0,,,,,,,,,,,,,,,,,30
204,Genetics visit,29.56,29.03,No,,,,,,No,No,No,No,,,,,,No,No,Yes,1,11 Maternal grandfather,,,,,,,,99 Other,,,,He doesn't know the name of cardiac defect.,,,,20
206,Genetics visit,47.24,55.77,Yes,1,19 Mitral valve prolapse,,,,Yes,No,Yes,Yes,1,"04Arrhythmias (WPW; prolonged Q-T syndrome; SVT; VT; CHB; SSS; 1ST, 2ND heart block; sinus bradycard",,,,Yes,Yes,No,0,,,,,,,,,,,,,,,,,10
210,Genetics visit,24.43,25.42,No,,,,,,Yes,No,No,No,,,,,,Yes,Yes,No,4,01 Paternal uncle,01 Paternal uncle,10 Paternal grandmother,12 Maternal grandmother,,,,,"04Arrhythmias (WPW; prolonged Q-T syndrome; SVT; VT; CHB; SSS; 1ST, 2ND heart block; sinus bradycard","04Arrhythmias (WPW; prolonged Q-T syndrome; SVT; VT; CHB; SSS; 1ST, 2ND heart block; sinus bradycard","04Arrhythmias (WPW; prolonged Q-T syndrome; SVT; VT; CHB; SSS; 1ST, 2ND heart block; sinus bradycard",12 Coronary artery disease,,,,,10
211,Genetics visit,22.48,25.55,No,,,,,,No,Yes,Yes,No,,,,,,No,No,No,2,09 Paternal grandfather,"99 Other, specify",,,,mother's cousin,,,99 Other,99 Other,,,heart condition unspecificied,only knows had open heart surgery as child,,,45
214,Genetics visit,29.2,,No,,,,,,No,No,Yes,No,,,,,,Unknown,Unknown,Unknown,2,"99 Other, specify","99 Other, specify",,,maternal great grandmother,maternal great grandfather,,,99 Other,99 Other,,,valve replacement,valve replacement,,,30
216,Genetics visit,43.99,41.89,No,,,,,,No,No,Yes,Unknown,,,,,,No,Yes,Yes,0,,,,,,,,,,,,,,,,,40
218,Genetics visit,23.13,25.57,No,,,,,,Yes,Yes,No,No,,,,,,No,No,No,1,12 Maternal grandmother,,,,,,,,19 Mitral valve prolapse,,,,,,,,120
222,Genetics visit,37.72,43.25,No,,,,,,No,No,Yes,No,,,,,,No,No,Yes,0,,,,,,,,,,,,,,,,,6
225,Genetics visit,27.31,31.7,No,,,,,,No,No,Yes,No,,,,,,No,No,No,0,,,,,,,,,,,,,,,,,8
231,Genetics visit,35.27,37.15,No,,,,,,Yes,Yes,No,No,,,,,,No,No,Yes,0,,,,,,,,,,,,,,,,,10
247,Genetics visit,33.9,39.66,No,,,,,,Yes,Yes,Yes,No,,,,,,No,No,No,1,11 Maternal grandfather,,,,,,,,-9 Missing,,,,,,,,10
250,Genetics visit,48.82,57.89,No,,,,,,No,No,Yes,No,,,,,,Yes,Yes,Yes,1,04 Maternal aunt,,,,,,,,17 IAA/VSD,,,,,,,,7
253,Genetics visit,31.18,32.13,No,,,,,,Yes,No,Yes,No,,,,,,No,Yes,No,1,"99 Other, specify",,,,Paternal first cousin,,,,99 Other,,,,"""hole in heart""--they did not know if asd or vsd--no treatment or followup needed.",,,,15
273,Genetics visit,24.34,24.91,No,,,,,,No,No,No,No,,,,,,No,No,No,0,,,,,,,,,,,,,,,,,20
277,Genetics visit,34.24,39.12,No,,,,,,No,No,Yes,No,,,,,,No,No,No,0,,,,,,,,,,,,,,,,,20
279,Genetics visit,24.77,,No,,,,,,Yes,No,Yes,No,,,,,,Unknown,Unknown,Unknown,2,"99 Other, specify","99 Other, specify",,,maternal distant 'other adults',maternal distant cousin,,,99 Other,99 Other,,,died from enlarged hearts,"enlarged heart, received transplant but died soon after.",,,4
286,Genetics visit,38.02,48.64,No,,,,,,No,Yes,Yes,No,,,,,,No,No,Yes,3,01 Paternal uncle,09 Paternal grandfather,10 Paternal grandmother,,,,,,"04Arrhythmias (WPW; prolonged Q-T syndrome; SVT; VT; CHB; SSS; 1ST, 2ND heart block; sinus bradycard","04Arrhythmias (WPW; prolonged Q-T syndrome; SVT; VT; CHB; SSS; 1ST, 2ND heart block; sinus bradycard",99 Other,,,,HEART FAILURE,,20
287,Genetics visit,33.77,40.29,Yes,1,05 ASD,,,,Yes,No,Yes,No,,,,,,Yes,No,No,0,,,,,,,,,,,,,,,,,15
292,Genetics visit,41.33,41.34,No,,,,,,No,No,No,No,,,,,,Yes,Yes,Yes,0,,,,,,,,,,,,,,,,,10
293,Genetics visit,43.62,45.19,No,,,,,,No,No,Yes,Yes,1,12 Coronary artery disease,,,,No,Yes,Yes,4,"99 Other, specify","99 Other, specify","99 Other, specify","99 Other, specify",brother,brother-Diagnosed in utero family terminated pregnancy,great cousin,cousin,06 Bicuspid aortic valve,1 6HLHS,1 6HLHS,"02 Aortic outflow abnormalities (valvular AS, AR)",,,,,20
298,Genetics visit,45.69,50.23,Yes,1,19 Mitral valve prolapse,,,,No,No,No,No,,,,,,No,No,Yes,0,,,,,,,,,,,,,,,,,10
301,Genetics visit,35.58,34.45,No,,,,,,Yes,Yes,Yes,No,,,,,,No,No,No,1,11 Maternal grandfather,,,,,,,,06 Bicuspid aortic valve,,,,,,,,20
302,Genetics visit,29.62,29.63,No,,,,,,No,No,No,No,,,,,,No,No,No,0,,,,,,,,,,,,,,,,,10
304,Genetics visit,35.92,,No,,,,,,No,No,No,No,,,,,,Unknown,Unknown,Unknown,0,,,,,,,,,,,,,,,,,5
306,Genetics visit,34,31.97,No,,,,,,No,No,Yes,No,,,,,,Yes,No,Yes,0,,,,,,,,,,,,,,,,,2
312,Genetics visit,40.35,39.94,No,,,,,,Yes,Yes,Yes,No,,,,,,Yes,Yes,Yes,0,,,,,,,,,,,,,,,,,13
318,Genetics visit,36.09,38.32,No,,,,,,No,No,Yes,No,,,,,,No,Yes,Yes,0,,,,,,,,,,,,,,,,,10
322,Genetics visit,36.33,38.45,No,,,,,,No,No,Yes,No,,,,,,No,No,Yes,0,,,,,,,,,,,,,,,,,3
323,Genetics visit,34.68,35.43,No,,,,,,No,Yes,Yes,No,,,,,,No,No,No,0,,,,,,,,,,,,,,,,,5
329,Genetics visit,27.45,29.99,No,,,,,,Yes,Yes,Yes,No,,,,,,No,No,Yes,3,02 Paternal aunt,10 Paternal grandmother,"99 Other, specify",,,,Maternal great-grandmother,,99 Other,99 Other,99 Other,,Heart problem - unknown.  Subject's mom couldn't provide any specific information.,"Heart problem - unknown. Subject's mom couldn't provide any specific information other than ""something was blocked.""","Unknown heart problem.  She had 3 open heart surgeries and a pig valve put in.  Subject's mom said ""a valve was blocked..and leaky.""",,30
331,Genetics visit,31.3,,Yes,1,99 Other,,MURMUR INNOCENT,,Yes,Yes,No,No,,,,,,No,No,No,4,03 Maternal uncle,11 Maternal grandfather,12 Maternal grandmother,"99 Other, specify",,,,COUSIN,99 Other,99 Other,99 Other,99 Other,HOLE IN HEART,UNKNOWN,MURMUR,MURMUR,10
342,Genetics visit,41.77,47.47,No,,,,,,No,No,No,No,,,,,,No,No,Yes,0,,,,,,,,,,,,,,,,,30
343,Genetics visit,33.63,37.93,No,,,,,,Yes,Yes,No,No,,,,,,Yes,Yes,Yes,2,12 Maternal grandmother,"99 Other, specify",,,,cousin (maternal),,,99 Other,35 VSD,,,Murmor,,,,15
344,Genetics visit,35.57,35.01,No,,,,,,No,No,Yes,No,,,,,,No,No,No,0,,,,,,,,,,,,,,,,,5
350,Genetics visit,45.84,45.96,No,,,,,,No,Yes,Yes,No,,,,,,Yes,No,No,0,,,,,,,,,,,,,,,,,5
356,Genetics visit,25.11,29.72,No,,,,,,No,Yes,Yes,No,,,,,,No,No,No,0,,,,,,,,,,,,,,,,,15
358,Genetics visit,40.39,42.37,No,,,,,,No,No,No,No,,,,,,No,No,No,0,,,,,,,,,,,,,,,,,45
362,Genetics visit,45.12,45.87,No,,,,,,No,Yes,Yes,No,,,,,,No,No,Yes,1,09 Paternal grandfather,,,,,,,,99 Other,,,,R-on-T Phenomenon,,,,10
364,Genetics visit,43.64,44.22,No,,,,,,No,Yes,Yes,No,,,,,,Yes,Yes,Yes,0,,,,,,,,,,,,,,,,,30
365,Genetics visit,33.34,36.14,No,,,,,,Yes,Yes,Yes,Refused,,,,,,No,No,Yes,1,06 Maternal half-brother,,,,,,,,06 Bicuspid aortic valve,,,,,,,,10
366,Genetics visit,27.43,37.98,No,,,,,,Yes,No,No,No,,,,,,No,No,Yes,2,"99 Other, specify","99 Other, specify",,,MATERNAL GREAT GRANDMOTHER,MATERNAL COUSIN,,,99 Other,99 Other,,,HOLE IN HEART,HOLE IN HEART,,,5
375,Genetics visit,36.17,35.55,Yes,1,10 Coarctation,,,,No,Unknown,Yes,No,,,,,,No,Unknown,Unknown,0,,,,,,,,,,,,,,,,,5
383,Genetics visit,25.63,27.7,No,,,,,,Yes,No,No,No,,,,,,No,No,No,0,,,,,,,,,,,,,,,,,10
388,Genetics visit,30.23,26.52,Yes,1,99 Other,,twisted heart vessels,,No,No,No,No,,,,,,No,Unknown,Unknown,0,,,,,,,,,,,,,,,,,10
391,Genetics visit,31.43,31.39,No,,,,,,No,No,Yes,Yes,1,99 Other,,irregular heart beat,,No,No,Yes,3,01 Paternal uncle,11 Maternal grandfather,12 Maternal grandmother,,,,,,99 Other,19 Mitral valve prolapse,99 Other,,tachycardia,,tachycardia,,20
393,Genetics visit,31.98,27.72,No,,,,,,Yes,Yes,Yes,No,,,,,,No,No,No,0,,,,,,,,,,,,,,,,,10
397,Genetics visit,28.27,27.6,No,,,,,,No,Yes,No,No,,,,,,Yes,Yes,Yes,1,"99 Other, specify",,,,paternal great uncle,,,,99 Other,,,,unknown cardiac defect.  Surgery performed in childhood (1970's).  Also had down's syndrome.  Died age at 44 years.,,,,5
399,Genetics visit,25.55,44.37,Yes,1,99 Other,,HEART MURMUR,,Yes,No,No,No,,,,,,No,Yes,No,0,,,,,,,,,,,,,,,,,15
400,Genetics visit,32.97,33.23,No,,,,,,No,No,Yes,No,,,,,,No,No,No,0,,,,,,,,,,,,,,,,,1
403,Genetics visit,34.9,33.77,No,,,,,,No,No,Yes,No,,,,,,Yes,No,Yes,0,,,,,,,,,,,,,,,,,10
404,Genetics visit,29.6,34.12,No,,,,,,No,No,Yes,No,,,,,,No,No,Yes,0,,,,,,,,,,,,,,,,,15
409,Genetics visit,39.7,41.33,No,,,,,,No,No,No,No,,,,,,No,No,No,0,,,,,,,,,,,,,,,,,10
411,Genetics visit,39.75,38.16,No,,,,,,Yes,Yes,No,No,,,,,,Yes,No,No,1,"99 Other, specify",,,,GREAT GRANDFATHER,,,,99 Other,,,,UNK - VALVE REPLACEMENT?,,,,15
412,Genetics visit,39.39,33.49,No,,,,,,No,No,Yes,No,,,,,,No,No,Yes,2,"99 Other, specify","99 Other, specify",,,Maternal Great uncle,Another maternal great-uncle,,,99 Other,99 Other,,,Blue Baby,Blue Baby,,,10
415,Genetics visit,31.13,35.08,No,,,,,,No,Yes,No,No,,,,,,No,No,Unknown,1,"99 Other, specify",,,,Maternal cousin,,,,35 VSD,,,,,,,,7
416,Genetics visit,30.46,34.6,No,,,,,,No,No,Yes,No,,,,,,No,No,Yes,0,,,,,,,,,,,,,,,,,10
417,Genetics visit,33.39,33.88,No,,,,,,No,No,No,No,,,,,,No,No,No,0,,,,,,,,,,,,,,,,,5
418,Genetics visit,39.05,43.75,No,,,,,,No,No,No,No,,,,,,Yes,Yes,Yes,0,,,,,,,,,,,,,,,,,15
424,Genetics visit,36.08,38.12,No,,,,,,No,Yes,No,No,,,,,,No,No,Yes,0,,,,,,,,,,,,,,,,,20
429,Genetics visit,40.38,39.27,No,,,,,,No,No,Yes,Yes,1,99 Other,,murmur,,Yes,No,Yes,1,04 Maternal aunt,,,,,,,,-9 Missing,,,,,,,,5
445,Genetics visit,35.06,30.57,No,,,,,,No,No,No,No,,,,,,No,No,No,0,,,,,,,,,,,,,,,,,5
446,Genetics visit,32.3,31.97,No,,,,,,No,No,Yes,No,,,,,,No,No,No,1,10 Paternal grandmother,,,,,,,,99 Other,,,,HEART MURMUR- ~11 YRS AGO AND HAD SURGERY.,,,,45
450,Genetics visit,31.07,31.52,No,,,,,,No,No,No,No,,,,,,No,No,No,0,,,,,,,,,,,,,,,,,5
452,Genetics visit,29.92,29.36,Yes,1,19 Mitral valve prolapse,,,,Yes,No,Yes,No,,,,,,Yes,Yes,No,2,04 Maternal aunt,10 Paternal grandmother,,,,,,,35 VSD,"04Arrhythmias (WPW; prolonged Q-T syndrome; SVT; VT; CHB; SSS; 1ST, 2ND heart block; sinus bradycard",,,,,,,20
458,Genetics visit,24.57,36.78,No,,,,,,No,No,No,No,,,,,,No,No,No,0,,,,,,,,,,,,,,,,,10
466,Genetics visit,40.81,42.32,No,,,,,,No,No,Yes,No,,,,,,Yes,No,Yes,0,,,,,,,,,,,,,,,,,45
472,Genetics visit,39.5,38.21,No,,,,,,No,No,No,No,,,,,,No,No,No,3,09 Paternal grandfather,11 Maternal grandfather,12 Maternal grandmother,,,,,,99 Other,99 Other,99 Other,,Heart murmur,Late Hypertension,Palpitations,,20
475,Genetics visit,26.62,37.62,No,,,,,,Yes,No,No,Unknown,,,,,,Unknown,Unknown,Unknown,0,,,,,,,,,,,,,,,,,5
483,Genetics visit,39.13,41.9,Yes,1,99 Other,,NEUROCARDIOGENIC SYNCOPE,,Yes,No,Yes,No,,,,,,No,No,Yes,0,,,,,,,,,,,,,,,,,30
485,Genetics visit,37.82,40.34,No,,,,,,Yes,Yes,Yes,No,,,,,,No,No,No,0,,,,,,,,,,,,,,,,,4
487,Genetics visit,43.27,46.38,Yes,1,99 Other,,murmur,,Yes,Yes,Yes,No,,,,,,No,No,No,1,11 Maternal grandfather,,,,,,,,99 Other,,,,Heart Attack,,,,5
495,Genetics visit,26.43,31.37,No,,,,,,Yes,Yes,No,No,,,,,,No,No,No,0,,,,,,,,,,,,,,,,,15
503,Genetics visit,29.9,30.09,No,,,,,,Yes,No,Yes,No,,,,,,No,No,No,0,,,,,,,,,,,,,,,,,15
508,Genetics visit,34.92,38.01,No,,,,,,Yes,No,Yes,No,,,,,,Yes,Yes,No,2,"99 Other, specify","99 Other, specify",,,father's uncle,mother's cousin,,,-9 Missing,14 DORV,,,,,,,20
514,Genetics visit,32.44,30.5,No,,,,,,Yes,No,Yes,No,,,,,,No,Yes,No,1,03 Maternal uncle,,,,,,,,23 Pulmonary stenosis,,,,,,,,45
525,Genetics visit,34.95,36.06,No,,,,,,Yes,No,Yes,No,,,,,,No,No,No,0,,,,,,,,,,,,,,,,,9
541,Genetics visit,29.87,30.58,No,,,,,,Yes,No,Yes,Yes,1,99 Other,,"""hole in the heart""- unspecified- closed on it's own per Mom",,No,No,No,0,,,,,,,,,,,,,,,,,45
547,Genetics visit,39.27,36.9,No,,,,,,Yes,Yes,Yes,No,,,,,,No,No,Yes,0,,,,,,,,,,,,,,,,,5
553,Genetics visit,25.46,34.29,Yes,1,19 Mitral valve prolapse,,,,Yes,Yes,Yes,No,,,,,,Yes,No,Yes,1,09 Paternal grandfather,,,,,,,,12 Coronary artery disease,,,,,,,,25
560,Genetics visit,39.89,41.21,No,,,,,,No,No,Yes,No,,,,,,No,No,Yes,0,,,,,,,,,,,,,,,,,40
565,Genetics visit,39.73,41.95,No,,,,,,No,No,Yes,No,,,,,,No,No,No,0,,,,,,,,,,,,,,,,,10
572,Genetics visit,29.66,32.28,No,,,,,,Yes,No,No,No,,,,,,No,No,No,1,11 Maternal grandfather,,,,,,,,19 Mitral valve prolapse,,,,,,,,10
577,Genetics visit,31.09,32.73,No,,,,,,No,No,No,No,,,,,,No,Yes,No,0,,,,,,,,,,,,,,,,,10
585,Genetics visit,25.99,29.21,No,,,,,,No,No,Yes,No,,,,,,No,No,Yes,1,11 Maternal grandfather,,,,,,,,99 Other,,,,pacemaker - unknown reason,,,,20
589,Genetics visit,36.4,43.18,No,,,,,,No,No,Yes,No,,,,,,No,No,Yes,0,,,,,,,,,,,,,,,,,5
595,Genetics visit,31.83,38.06,No,,,,,,No,No,Yes,No,,,,,,No,Yes,Yes,1,04 Maternal aunt,,,,,,,,99 Other,,,,unknown,,,,30
597,Genetics visit,28.79,,No,,,,,,No,No,Yes,No,,,,,,No,No,No,2,04 Maternal aunt,"99 Other, specify",,,,MATERNAL COUSIN,,,-9 Missing,07 Cardiac malposition (heterotaxy),,,,,,,10
598,Genetics visit,33.88,34.89,No,,,,,,No,No,No,No,,,,,,No,No,No,0,,,,,,,,,,,,,,,,,10
603,Genetics visit,42.44,48.16,No,,,,,,No,No,Yes,No,,,,,,Yes,No,No,0,,,,,,,,,,,,,,,,,15
608,Genetics visit,25.15,28.48,No,,,,,,No,Yes,No,No,,,,,,No,Unknown,Yes,1,04 Maternal aunt,,,,,,,,"04Arrhythmias (WPW; prolonged Q-T syndrome; SVT; VT; CHB; SSS; 1ST, 2ND heart block; sinus bradycard",,,,,,,,45
610,Genetics visit,28.81,31.6,No,,,,,,Yes,No,Yes,No,,,,,,No,No,Yes,0,,,,,,,,,,,,,,,,,15
614,Genetics visit,40.77,41.75,No,,,,,,No,No,Yes,No,,,,,,No,No,Yes,0,,,,,,,,,,,,,,,,,30
617,Genetics visit,26.79,30.66,No,,,,,,No,No,No,No,,,,,,No,No,No,0,,,,,,,,,,,,,,,,,20
618,Genetics visit,40.11,43.83,No,,,,,,Yes,Yes,Yes,No,,,,,,No,No,Yes,3,"99 Other, specify","99 Other, specify","99 Other, specify",,Maternal great aunt's daughter,maternal aunt's daughter,maternal cousin,,99 Other,99 Other,99 Other,,Mom said the child had a hold in her heart but couldn't elaborate.,"Doctors said she was a ""blue baby"" but didn't confirm diagnosis.  She lived one week.",Child had a hold in her heart and a heart murmur.,,15
620,Genetics visit,34.97,31.52,No,,,,,,No,No,No,No,,,,,,No,No,No,0,,,,,,,,,,,,,,,,,45
621,Genetics visit,44.22,44.62,No,,,,,,No,No,No,No,,,,,,Yes,No,Yes,0,,,,,,,,,,,,,,,,,5
623,Genetics visit,33.58,42.89,No,,,,,,No,No,No,No,,,,,,Yes,No,No,1,12 Maternal grandmother,,,,,,,,05 ASD,,,,,,,,10
626,Genetics visit,33.03,36.03,No,,,,,,No,No,No,No,,,,,,Yes,No,No,0,,,,,,,,,,,,,,,,,5
628,Genetics visit,33.37,36.33,No,,,,,,Yes,Yes,Yes,No,,,,,,No,No,Yes,2,"99 Other, specify","99 Other, specify",,,MATERNAL COUSIN,MATERNAL COUSIN,,,35 VSD,05 ASD,,,,,,,10
633,Genetics visit,35.98,40.25,No,,,,,,No,No,Yes,No,,,,,,No,No,No,0,,,,,,,,,,,,,,,,,15
634,Genetics visit,32.79,41.09,No,,,,,,No,No,Yes,No,,,,,,No,No,Yes,1,03 Maternal uncle,,,,,,,,1 6HLHS,,,,,,,,40
636,Genetics visit,41.13,43.66,No,,,,,,Yes,No,Yes,No,,,,,,No,No,No,1,"99 Other, specify",,,,cousin,,,,29 TOF,,,,,,,,10
645,Genetics visit,35.67,45.89,No,,,,,,No,No,Yes,No,,,,,,Yes,No,Yes,1,"99 Other, specify",,,,Maternal Great Aunt,,,,99 Other,,,,Mother couldn't specify.,,,,15
646,Genetics visit,29.48,37.62,No,,,,,,No,No,Yes,No,,,,,,No,No,No,2,04 Maternal aunt,"99 Other, specify",,,,2ND COUSIN,,,18 Mitral valve and left atrial lesions,35 VSD,,,,,,,10
650,Genetics visit,41.3,41.59,No,,,,,,Yes,No,Yes,No,,,,,,No,No,No,0,,,,,,,,,,,,,,,,,5
655,Genetics visit,31.99,36.31,No,,,,,,Yes,Yes,Yes,No,,,,,,No,No,No,0,,,,,,,,,,,,,,,,,20
656,Genetics visit,40.44,38.77,No,,,,,,No,No,Yes,No,,,,,,No,No,No,2,03 Maternal uncle,11 Maternal grandfather,,,,,,,"04Arrhythmias (WPW; prolonged Q-T syndrome; SVT; VT; CHB; SSS; 1ST, 2ND heart block; sinus bradycard",99 Other,,,,HEART ATTACK,,,10
659,Genetics visit,40.61,49.18,No,,,,,,No,No,No,No,,,,,,No,No,No,0,,,,,,,,,,,,,,,,,5
661,Genetics visit,22.85,26.75,No,,,,,,No,No,No,No,,,,,,No,No,Unknown,2,09 Paternal grandfather,12 Maternal grandmother,,,,,,,99 Other,27 Systemic hypertension,,,HEART ATTACK,,,,45
663,Genetics visit,42.33,41.67,No,,,,,,No,No,Yes,No,,,,,,No,No,Yes,0,,,,,,,,,,,,,,,,,15
668,Genetics visit,22.95,24.97,No,,,,,,Yes,Yes,No,No,,,,,,No,No,Yes,2,09 Paternal grandfather,11 Maternal grandfather,,,,,,,99 Other,99 Other,,,"heart attack at age 48, died",heart attack requiring bypass surgery,,,20
670,Genetics visit,33.98,36.15,No,,,,,,No,No,Yes,No,,,,,,No,No,Yes,0,,,,,,,,,,,,,,,,,3
676,Genetics visit,33.56,38.89,No,,,,,,No,No,Yes,Unknown,,,,,,No,No,No,0,,,,,,,,,,,,,,,,,10
682,Genetics visit,45.99,50.69,No,,,,,,Yes,No,Yes,No,,,,,,No,No,Yes,0,,,,,,,,,,,,,,,,,2
686,Genetics visit,30.37,32.14,No,,,,,,No,No,Yes,No,,,,,,No,No,No,0,,,,,,,,,,,,,,,,,2
687,Genetics visit,26.88,31.66,No,,,,,,Yes,Yes,Yes,No,,,,,,No,No,No,0,,,,,,,,,,,,,,,,,20
689,Genetics visit,22.97,23.94,No,,,,,,No,No,Yes,No,,,,,,No,No,No,1,10 Paternal grandmother,,,,,,,,99 Other,,,,"Patient's mom stated that patient's paternal grandmother had a ""hole in her heart"" and passed away when she was 28 yro.  No more info could be given regarding specific type of defect.",,,,15
695,Genetics visit,37.92,34.02,No,,,,,,No,No,Yes,Yes,1,21 Patent ductus arteriosus,,,,Yes,Unknown,Yes,0,,,,,,,,,,,,,,,,,5
701,Genetics visit,28.06,33.13,No,,,,,,No,No,No,No,,,,,,No,No,No,1,11 Maternal grandfather,,,,,,,,"04Arrhythmias (WPW; prolonged Q-T syndrome; SVT; VT; CHB; SSS; 1ST, 2ND heart block; sinus bradycard",,,,,,,,10
702,Genetics visit,40.53,42.66,No,,,,,,No,No,No,No,,,,,,No,No,No,0,,,,,,,,,,,,,,,,,10
708,Genetics visit,39.64,41.47,No,,,,,,No,No,Yes,No,,,,,,No,Yes,No,0,,,,,,,,,,,,,,,,,45
709,Genetics visit,40.57,38.61,No,,,,,,No,No,Yes,No,,,,,,Yes,Yes,Yes,0,,,,,,,,,,,,,,,,,5
712,Genetics visit,32.3,38.78,No,,,,,,No,No,No,No,,,,,,No,No,Yes,0,,,,,,,,,,,,,,,,,5
715,Genetics visit,38.32,35.03,No,,,,,,Yes,Yes,Yes,No,,,,,,No,No,No,1,01 Paternal uncle,,,,,,,,99 Other,,,,early death at age 5,,,,5
720,Genetics visit,44.66,45.09,No,,,,,,No,No,Yes,No,,,,,,No,No,No,0,,,,,,,,,,,,,,,,,20