blind_id,VISIT,GENDER,ASSISTANCE,NOASSIST,WITHASSIST,WITHASSIS_ME,PATIENT_AGE_INSTR,THREE_ITEMS,T_ITEMS_SC,HUNGRY,TIRED,HUNG_TIRED,HUN_TIRED_SC,TWO_THINGS,TWO_THING_SC,END_WORDS,END_WORDS_SC,THREE_DIRECT,THREE_DIR_SC,ALL_WORDS,ALL_WORDS_SC,COMMUN_SC,CATCH_BALL,CATCH_BAL_SC,CLIMB_SLIDE,CLIMB_SLI_SC,OVERHAND,OVERHAND_SC,BALANCE,BALANCE_SC,JUMP,JUMP_SC,ONE_FOOT,ONE_FOOT_SC,G_MOTOR_SC,SIX_PIECE,SIX_PIECE_SC,CUT_PAPER,CUT_PAPER_SC,THREE_SHAPE,THREE_SHA_SC,BUTTONS,BUTTONS_SC,DRAW,DRAW_SC,COLOR,COLOR_SC,F_MOTOR_SC,NUMBERS,NUMBERS_SC,CIRCLE,CIRCLE_SC,DIRECTIONS,DIRECTION_SC,FIVE_COLOR,FIVE_COLO_SC,PLAY_ACT,PLAY_ACT_SC,COUNT_FIVE,COUNT_FIV_SC,PROB_SOLV_SC,UTENSILS,UTENSILS_SC,FOUR_THINGS,FOUR_THIN_SC,WASH,WASH_SC,PLAYMATE,PLAYMATE_SC,BRUSH,BRUSH_SC,DRESS,DRESS_SC,PERS_SOC_SC,HEAR,TALK,SAY,WALK,HISTORY,VISION,MED_PROB,WORRY,VER_ID
2,Study visit 7 (4 years),Male,Yes,Mother,Skipped,Skipped,4.08,Yes,10,"""eat""","""I go to sleep""",Yes,10,Yes,10,Yes,10,Yes,10,Yes,10,60.0,Yes,10,Yes,10,Yes,10,Yes,10,Yes,10,Yes,10,60.0,Yes,10,Yes,10,Yes,10,Yes,10,Yes,10,Yes,10,60.0,Yes,10,Yes,10,Yes,10,Yes,10,Yes,10,Yes,10,60.0,Yes,10,Yes,10,Yes,10,Yes,10,Yes,10,Yes,10,60.0,Yes,Yes,Yes,Yes,No,No,No,No,B
4,Study visit 7 (4 years),Female,Yes,Mother,Skipped,Skipped,4.08,Yes,10,Eat,I sleep,Yes,10,Yes,10,Yes,10,Yes,10,Yes,10,60.0,Yes,10,Yes,10,Yes,10,Not yet,0,Not yet,0,Yes,10,40.0,Not yet,0,Not yet,0,Yes,10,Not yet,0,Not yet,0,Sometimes,5,15.0,Yes,10,Yes,10,Sometimes,5,Yes,10,Yes,10,Yes,10,55.0,Yes,10,Yes,10,Yes,10,Yes,10,Sometimes,5,Yes,10,55.0,Yes,Yes,Yes,No,No,No,Yes,No,B
5,Study visit 7 (4 years),Male,Yes,Mother,Skipped,Skipped,3.95,Yes,10,I eat good,take a nap,Yes,10,Sometimes,5,Yes,10,Yes,10,Yes,10,55.0,Yes,10,Yes,10,Yes,10,Not yet,0,Yes,10,Sometimes,5,45.0,Not yet,0,Not yet,0,Sometimes,5,Sometimes,5,Not yet,0,Sometimes,5,15.0,Yes,10,Yes,10,Yes,10,Sometimes,5,Yes,10,Yes,10,55.0,Yes,10,Sometimes,5,Yes,10,Yes,10,Yes,10,Yes,10,55.0,Yes,Yes,Yes,No,No,No,No,Yes,B
9,Study visit 7 (4 years),Male,Yes,Mother,Skipped,Skipped,4.02,Yes,10,,,Sometimes,5,Not yet,0,Sometimes,5,Sometimes,5,Not yet,0,25.0,Sometimes,5,Not yet,0,Yes,10,Not yet,0,Sometimes,5,Sometimes,5,25.0,Not yet,0,Sometimes,5,Not yet,0,Yes,10,Not yet,0,Not yet,0,15.0,Sometimes,5,Not yet,0,Not yet,0,Not yet,0,Not yet,0,Sometimes,5,10.0,Not yet,0,Yes,10,Not yet,0,Yes,10,Sometimes,5,Yes,10,35.0,Yes,No,Yes,Yes,No,Yes,Yes,No,B
12,Study visit 7 (4 years),Male,Yes,Father,Skipped,Skipped,3.96,Yes,10,"I'm hungry, goes to kitchen and tells me what he wants",go to sleep,Yes,10,Yes,10,Yes,10,Yes,10,Yes,10,60.0,Yes,10,Yes,10,Yes,10,Yes,10,Yes,10,Yes,10,60.0,Yes,10,Yes,10,Yes,10,Yes,10,Yes,10,Yes,10,60.0,Yes,10,Yes,10,Yes,10,Yes,10,Yes,10,Yes,10,60.0,Yes,10,Yes,10,Yes,10,Yes,10,Yes,10,Yes,10,60.0,Yes,Yes,Yes,Yes,No,No,No,No,B
23,Study visit 7 (4 years),Male,Yes,Mother,Skipped,Skipped,4.07,Sometimes,5,Eat food,Sleep,Yes,10,Yes,10,Yes,10,Sometimes,5,Sometimes,5,45.0,Yes,10,Yes,10,Yes,10,Yes,10,Yes,10,Yes,10,60.0,Sometimes,5,Sometimes,5,Yes,10,Yes,10,Yes,10,Sometimes,5,45.0,Yes,10,Sometimes,5,Yes,10,Yes,10,Yes,10,Yes,10,55.0,Yes,10,Yes,10,Yes,10,Yes,10,Yes,10,Yes,10,60.0,Yes,Yes,Yes,Yes,No,No,Yes,Yes,B
36,Study visit 7 (4 years),Male,Yes,Mother,Skipped,Skipped,4,Yes,10,,,Yes,10,Yes,10,Yes,10,Yes,10,Yes,10,60.0,Yes,10,Yes,10,Yes,10,Yes,10,Yes,10,Yes,10,60.0,Sometimes,5,Sometimes,5,Sometimes,5,Sometimes,5,Not yet,0,Not yet,0,20.0,Yes,10,Yes,10,Yes,10,Sometimes,5,Yes,10,Yes,10,55.0,Yes,10,Yes,10,Yes,10,Sometimes,5,Yes,10,Yes,10,55.0,Yes,Yes,Yes,Yes,No,No,Yes,No,B
37,Study visit 7 (4 years),Male,Yes,Mother,Skipped,Skipped,3.91,Sometimes,5,eat and drink my water,"go to my bed, sleep in my bed",Yes,10,Yes,10,Not yet,0,Yes,10,Not yet,0,35.0,Sometimes,5,Yes,10,Yes,10,Not yet,0,Not yet,0,Not yet,0,25.0,Not yet,0,Not yet,0,Not yet,0,Not yet,0,Not yet,0,Not yet,0,0.0,Yes,10,Not yet,0,Sometimes,5,Sometimes,5,Sometimes,5,Not yet,0,25.0,Yes,10,Sometimes,5,Sometimes,5,Sometimes,5,Not yet,0,Not yet,0,25.0,Yes,No,Yes,No,No,Yes,Yes,No,B
38,Study visit 7 (4 years),Female,Yes,Mother,Skipped,Skipped,4.08,Yes,10,Ask Mommy for something to eat,I take a nap,Yes,10,Yes,10,Yes,10,Yes,10,Yes,10,60.0,Sometimes,5,Yes,10,Sometimes,5,Not yet,0,Sometimes,5,Not yet,0,25.0,Yes,10,Yes,10,Yes,10,Yes,10,Yes,10,Sometimes,5,55.0,Yes,10,Yes,10,Yes,10,Yes,10,Yes,10,Yes,10,60.0,Yes,10,Yes,10,Yes,10,Yes,10,Sometimes,5,Sometimes,5,50.0,Yes,No,Yes,Yes,No,No,No,No,B
39,Study visit 7 (4 years),Male,Yes,Mother,Skipped,Skipped,3.93,Yes,10,I am hungry and I want to eat something,"I want rest, I want to sleep",Yes,10,Yes,10,Yes,10,Yes,10,Yes,10,60.0,Yes,10,Yes,10,Yes,10,Yes,10,Yes,10,Yes,10,60.0,Yes,10,Yes,10,Sometimes,5,Yes,10,Yes,10,Sometimes,5,50.0,Yes,10,Yes,10,Yes,10,Yes,10,Yes,10,Sometimes,5,55.0,Yes,10,Yes,10,Yes,10,Sometimes,5,Yes,10,Sometimes,5,50.0,Yes,Yes,Yes,Yes,No,No,Yes,Yes,B
40,Study visit 7 (4 years),Male,Yes,Mother,Skipped,Skipped,4.08,Yes,10,eat,sleep,Yes,10,Sometimes,5,Yes,10,Yes,10,Yes,10,55.0,Sometimes,5,Yes,10,Yes,10,Sometimes,5,Yes,10,Yes,10,50.0,Yes,10,Sometimes,5,Sometimes,5,Yes,10,Not yet,0,Not yet,0,30.0,Yes,10,Yes,10,Sometimes,5,Yes,10,Yes,10,Yes,10,55.0,Not yet,0,Yes,10,Yes,10,Yes,10,Sometimes,5,Sometimes,5,40.0,Yes,Yes,Yes,Yes,No,No,No,No,B
46,Study visit 7 (4 years),Male,Yes,Mother,Skipped,Skipped,4.03,Yes,10,I eat a sandwich,sleep,Yes,10,Yes,10,Yes,10,Sometimes,5,Sometimes,5,50.0,Yes,10,Yes,10,Yes,10,Not yet,0,Yes,10,Not yet,0,40.0,Yes,10,Sometimes,5,Yes,10,Yes,10,Yes,10,Not yet,0,45.0,Sometimes,5,Yes,10,Not yet,0,Yes,10,Yes,10,Yes,10,45.0,Sometimes,5,Yes,10,Yes,10,Yes,10,Yes,10,Yes,10,55.0,Yes,Yes,Yes,No,No,No,Yes,Yes,B
51,Study visit 7 (4 years),Male,Yes,Mother,Skipped,Skipped,4.03,Yes,10,"Eat chicken, drink too",Sleep,Missing,,Yes,10,Yes,10,Yes,10,Not yet,0,48.0,Yes,10,Yes,10,Yes,10,Yes,10,Yes,10,Yes,10,60.0,Not yet,0,Yes,10,Not yet,0,Yes,10,Not yet,0,Not yet,0,20.0,Yes,10,Not yet,0,Sometimes,5,Not yet,0,Not yet,0,Not yet,0,15.0,Yes,10,Yes,10,Yes,10,Yes,10,Yes,10,Yes,10,60.0,Yes,No,Yes,Yes,No,No,No,Yes,B
52,Study visit 7 (4 years),Male,No,Skipped,Mother,Phone interview,0.76,Yes,10,eat,sleep,Yes,10,Yes,10,Yes,10,Yes,10,Yes,10,60.0,Yes,10,Yes,10,Yes,10,Yes,10,Yes,10,Yes,10,60.0,Yes,10,Yes,10,Yes,10,Yes,10,Yes,10,Yes,10,60.0,Yes,10,Yes,10,Yes,10,Yes,10,Yes,10,Yes,10,60.0,Yes,10,Yes,10,Yes,10,Yes,10,Sometimes,5,Sometimes,5,50.0,Yes,Yes,Yes,No,No,No,No,No,B
54,Study visit 7 (4 years),Male,Yes,Mother,Skipped,Skipped,3.98,Yes,10,"""Eat apple""","""I go to sleep""",Missing,,Yes,10,Yes,10,Yes,10,Sometimes,5,54.0,Sometimes,5,Yes,10,Not yet,0,Not yet,0,Not yet,0,Not yet,0,15.0,Not yet,0,Not yet,0,Sometimes,5,Not yet,0,Not yet,0,Not yet,0,5.0,Yes,10,Yes,10,Yes,10,Yes,10,Yes,10,Yes,10,60.0,Sometimes,5,Not yet,0,Yes,10,Yes,10,Not yet,0,Yes,10,35.0,Yes,No,Yes,Yes,No,No,No,No,B
58,Study visit 7 (4 years),Male,Yes,Mother,Skipped,Skipped,4.09,Yes,10,Eat,Go to sleep,Yes,10,Yes,10,Yes,10,Yes,10,Sometimes,5,55.0,Yes,10,Yes,10,Yes,10,Not yet,0,Yes,10,Sometimes,5,45.0,Yes,10,Yes,10,Yes,10,Sometimes,5,Yes,10,Sometimes,5,50.0,Yes,10,Yes,10,Yes,10,Yes,10,Yes,10,Yes,10,60.0,Yes,10,Yes,10,Yes,10,Yes,10,Yes,10,Yes,10,60.0,Yes,Yes,Yes,Yes,No,No,No,Yes,A
61,Study visit 7 (4 years),Female,Yes,Mother,Skipped,Skipped,4.04,Not yet,0,,,Not yet,0,Not yet,0,Sometimes,5,Yes,10,Not yet,0,15.0,Not yet,0,Yes,10,Sometimes,5,Not yet,0,Sometimes,5,Not yet,0,20.0,Not yet,0,Not yet,0,Not yet,0,Not yet,0,Not yet,0,Not yet,0,0.0,Not yet,0,Not yet,0,Not yet,0,Not yet,0,Missing,,Missing,,0.0,Not yet,0,Not yet,0,Sometimes,5,Not yet,0,Not yet,0,Not yet,0,5.0,Yes,No,No,Yes,No,No,No,Yes,B
62,Study visit 7 (4 years),Male,Yes,Mother,Skipped,Skipped,3.92,Yes,10,Eat and even you drink,you sleep,Yes,10,Yes,10,Yes,10,Yes,10,Sometimes,5,55.0,Yes,10,Yes,10,Sometimes,5,Not yet,0,Not yet,0,Not yet,0,25.0,Yes,10,Sometimes,5,Yes,10,Not yet,0,Not yet,0,Not yet,0,25.0,Yes,10,Yes,10,Sometimes,5,Yes,10,Sometimes,5,Yes,10,50.0,Sometimes,5,Yes,10,Yes,10,Yes,10,Not yet,0,Not yet,0,35.0,Yes,Yes,Yes,No,No,No,No,No,B
63,Study visit 7 (4 years),Female,Yes,Father,Skipped,Skipped,4.11,Yes,10,,Go to sleep,Yes,10,Yes,10,Yes,10,Yes,10,Sometimes,5,55.0,Yes,10,Yes,10,Sometimes,5,Yes,10,Sometimes,5,Yes,10,50.0,Not yet,0,Yes,10,Sometimes,5,Yes,10,Yes,10,Yes,10,45.0,Yes,10,Yes,10,Sometimes,5,Yes,10,Yes,10,Yes,10,55.0,Yes,10,Yes,10,Not yet,0,Yes,10,Not yet,0,Yes,10,40.0,Yes,Yes,Yes,Yes,No,No,No,No,B
69,Study visit 7 (4 years),Male,Yes,Mother,Skipped,Skipped,4.06,Yes,10,Eat,Sleep,Yes,10,Yes,10,Yes,10,Yes,10,Sometimes,5,55.0,Yes,10,Yes,10,Yes,10,Yes,10,Yes,10,Yes,10,60.0,Yes,10,Yes,10,Sometimes,5,Sometimes,5,Not yet,0,Not yet,0,30.0,Yes,10,Yes,10,Yes,10,Yes,10,Sometimes,5,Yes,10,55.0,Yes,10,Yes,10,Not yet,0,Yes,10,Yes,10,Yes,10,50.0,Yes,Yes,Yes,Yes,No,No,No,Yes,B
74,Study visit 7 (4 years),Male,Yes,Father,Skipped,Skipped,3.94,Not yet,0,Not developed enough (verbaly),Same as above,Not yet,0,Not yet,0,Not yet,0,Sometimes,5,Not yet,0,5.0,Yes,10,Yes,10,Yes,10,Yes,10,Yes,10,Yes,10,60.0,Yes,10,Sometimes,5,Not yet,0,Not yet,0,Not yet,0,Not yet,0,15.0,Sometimes,5,Not yet,0,Not yet,0,Not yet,0,Sometimes,5,Sometimes,5,15.0,Sometimes,5,Not yet,0,Not yet,0,Not yet,0,Not yet,0,Not yet,0,5.0,No,No,Yes,No,Yes,No,No,Yes,B
77,Study visit 7 (4 years),Female,Yes,Mother,Skipped,Skipped,4,Yes,10,,,Yes,10,Yes,10,Yes,10,Yes,10,Yes,10,60.0,Yes,10,Yes,10,Yes,10,Yes,10,Sometimes,5,Yes,10,55.0,Yes,10,Yes,10,Yes,10,Yes,10,Sometimes,5,Yes,10,55.0,Yes,10,Yes,10,Sometimes,5,Sometimes,5,Yes,10,Sometimes,5,45.0,Yes,10,Yes,10,Yes,10,Yes,10,Yes,10,Yes,10,60.0,Yes,Yes,Yes,Yes,No,No,No,No,B
78,Study visit 7 (4 years),Male,Yes,Mother,Skipped,Skipped,4.08,Yes,10,"""Get something to eat""","""Go sleep""",Yes,10,Yes,10,Yes,10,Sometimes,5,Sometimes,5,50.0,Sometimes,5,Yes,10,Yes,10,Not yet,0,Sometimes,5,Sometimes,5,35.0,Not yet,0,Sometimes,5,Not yet,0,Yes,10,Not yet,0,Not yet,0,15.0,Not yet,0,Yes,10,Sometimes,5,Yes,10,Yes,10,Yes,10,45.0,Yes,10,Yes,10,Yes,10,Yes,10,Yes,10,Yes,10,60.0,Yes,Yes,Yes,No,No,No,No,Yes,B
83,Study visit 7 (4 years),Female,Yes,Mother,Skipped,Skipped,4.04,Yes,10,get a snack,sleep in bed,Yes,10,Yes,10,Yes,10,Sometimes,5,Sometimes,5,50.0,Yes,10,Yes,10,Sometimes,5,Sometimes,5,Sometimes,5,Sometimes,5,40.0,Sometimes,5,Yes,10,Yes,10,Yes,10,Yes,10,Sometimes,5,50.0,Yes,10,Yes,10,Yes,10,Yes,10,Yes,10,Yes,10,60.0,Yes,10,Yes,10,Yes,10,Yes,10,Yes,10,Yes,10,60.0,Yes,No,Yes,Yes,No,No,No,No,B
87,Study visit 7 (4 years),Female,Yes,Mother,Skipped,Skipped,3.96,Yes,10,"I eat, I eat speghethos",Sleep. And my mom sings me a bedtime sing. And my dad reads bed story.,Yes,10,Yes,10,Yes,10,Yes,10,Yes,10,60.0,Yes,10,Yes,10,Yes,10,Sometimes,5,Yes,10,Yes,10,55.0,Yes,10,Yes,10,Yes,10,Yes,10,Yes,10,Yes,10,60.0,Yes,10,Yes,10,Yes,10,Yes,10,Yes,10,Yes,10,60.0,Yes,10,Sometimes,5,Yes,10,Yes,10,Yes,10,Yes,10,55.0,Yes,Yes,Yes,Yes,No,No,No,No,B
95,Study visit 7 (4 years),Male,Yes,Mother,Skipped,Skipped,4.04,Yes,10,"""Eat""","""Sleep""",Yes,10,Yes,10,Yes,10,Yes,10,Yes,10,60.0,Yes,10,Yes,10,Yes,10,Yes,10,Yes,10,Yes,10,60.0,Yes,10,Yes,10,Yes,10,Yes,10,Yes,10,Yes,10,60.0,Yes,10,Yes,10,Yes,10,Yes,10,Yes,10,Yes,10,60.0,Yes,10,Yes,10,Yes,10,Yes,10,Yes,10,Sometimes,5,55.0,Yes,No,Yes,Yes,No,No,No,No,B
101,Study visit 7 (4 years),Male,Yes,Mother,Skipped,Skipped,3.92,Not yet,0,,,Not yet,0,Not yet,0,Not yet,0,Yes,10,Not yet,0,10.0,Sometimes,5,Yes,10,Not yet,0,Not yet,0,Not yet,0,Sometimes,5,20.0,Not yet,0,Not yet,0,Not yet,0,Not yet,0,Not yet,0,Not yet,0,0.0,Not yet,0,Not yet,0,Not yet,0,Not yet,0,Not yet,0,Not yet,0,0.0,Not yet,0,Not yet,0,Not yet,0,Not yet,0,Not yet,0,Not yet,0,0.0,Yes,No,No,Yes,No,No,No,Yes,B
104,Study visit 7 (4 years),Male,Yes,Mother,Skipped,Skipped,4,Yes,10,,bed,Yes,10,Yes,10,Yes,10,Yes,10,Yes,10,60.0,Yes,10,Yes,10,Yes,10,Yes,10,Yes,10,Yes,10,60.0,Sometimes,5,Sometimes,5,Sometimes,5,Sometimes,5,Not yet,0,Not yet,0,20.0,Not yet,0,Yes,10,Not yet,0,Not yet,0,Yes,10,Not yet,0,20.0,Yes,10,Missing,,Not yet,0,Yes,10,Yes,10,Sometimes,5,42.0,Yes,Yes,Yes,No,No,No,Yes,No,B
106,Study visit 7 (4 years),Female,Yes,Mother,Skipped,Skipped,4.13,Yes,10,eat,nap,Yes,10,Yes,10,Yes,10,Yes,10,Yes,10,60.0,Yes,10,Yes,10,Yes,10,Yes,10,Yes,10,Yes,10,60.0,Sometimes,5,Sometimes,5,Sometimes,5,Yes,10,Yes,10,Yes,10,45.0,Yes,10,Yes,10,Yes,10,Yes,10,Yes,10,Sometimes,5,55.0,Yes,10,Sometimes,5,Yes,10,Yes,10,Yes,10,Yes,10,55.0,No,No,Yes,Yes,No,No,No,No,B
109,Study visit 7 (4 years),Male,Yes,Mother,Skipped,Skipped,4,Yes,10,eat something,sleep,Yes,10,Yes,10,Yes,10,Yes,10,Yes,10,60.0,Yes,10,Yes,10,Yes,10,Yes,10,Yes,10,Yes,10,60.0,Sometimes,5,Sometimes,5,Sometimes,5,Yes,10,Yes,10,Yes,10,45.0,Yes,10,Yes,10,Yes,10,Yes,10,Yes,10,Yes,10,60.0,Yes,10,Yes,10,Yes,10,Yes,10,Yes,10,Yes,10,60.0,Yes,Yes,Yes,Yes,No,No,No,No,B
114,Study visit 7 (4 years),Female,Yes,Father,Skipped,Skipped,4.08,Yes,10,Fat all gone,Go to bed,Yes,10,Yes,10,Yes,10,Yes,10,Yes,10,60.0,Yes,10,Yes,10,Yes,10,Sometimes,5,Yes,10,Yes,10,55.0,Yes,10,Yes,10,Yes,10,Yes,10,Not yet,0,Sometimes,5,45.0,Yes,10,Yes,10,Yes,10,Yes,10,Yes,10,Yes,10,60.0,Yes,10,Yes,10,Yes,10,Yes,10,Sometimes,5,Yes,10,55.0,Yes,No,Yes,Yes,No,No,No,Yes,B
115,Study visit 7 (4 years),Female,Yes,Father,Skipped,Skipped,4.01,Not yet,0,,,Not yet,0,Not yet,0,Not yet,0,Not yet,0,Not yet,0,0.0,Not yet,0,Not yet,0,Not yet,0,Not yet,0,Not yet,0,Not yet,0,0.0,Not yet,0,Not yet,0,Not yet,0,Not yet,0,Not yet,0,Not yet,0,0.0,Not yet,0,Not yet,0,Not yet,0,Not yet,0,Not yet,0,Not yet,0,0.0,Not yet,0,Not yet,0,Not yet,0,Not yet,0,Not yet,0,Not yet,0,0.0,Yes,No,No,No,No,Yes,Yes,Yes,B
127,Study visit 7 (4 years),Male,Yes,Mother,Skipped,Skipped,3.97,Yes,10,"""I eat""","""Sit""",Sometimes,5,Sometimes,5,Yes,10,Yes,10,Yes,10,50.0,Yes,10,Yes,10,Yes,10,Not yet,0,Sometimes,5,Yes,10,45.0,Not yet,0,Yes,10,Sometimes,5,Sometimes,5,Not yet,0,Sometimes,5,25.0,Yes,10,Yes,10,Sometimes,5,Yes,10,Yes,10,Yes,10,55.0,Yes,10,Yes,10,Sometimes,5,Sometimes,5,Sometimes,5,Sometimes,5,40.0,Yes,Yes,Yes,Yes,No,No,No,Yes,B
134,Study visit 7 (4 years),Male,Yes,Mother,Skipped,Skipped,3.99,Yes,10,""" I eat""","""I go to bed""",Missing,,Yes,10,Yes,10,Sometimes,5,Yes,10,54.0,Yes,10,Yes,10,Yes,10,Yes,10,Yes,10,Yes,10,60.0,Yes,10,Sometimes,5,Not yet,0,Yes,10,Not yet,0,Not yet,0,25.0,Yes,10,Yes,10,Yes,10,Sometimes,5,Yes,10,Yes,10,55.0,Yes,10,Not yet,0,Yes,10,Yes,10,Yes,10,Yes,10,50.0,Yes,Yes,Yes,Yes,No,No,No,No,B
139,Study visit 7 (4 years),Female,Yes,Mother,Skipped,Skipped,3.93,Sometimes,5,Ma I hungry,liedown then off to sleep,Sometimes,5,Not yet,0,Sometimes,5,Yes,10,Sometimes,5,30.0,Not yet,0,Sometimes,5,Not yet,0,Not yet,0,Not yet,0,Not yet,0,5.0,Not yet,0,Sometimes,5,Sometimes,5,Not yet,0,Not yet,0,Not yet,0,10.0,Sometimes,5,Not yet,0,Not yet,0,Not yet,0,Not yet,0,Not yet,0,5.0,Sometimes,5,Not yet,0,Yes,10,Yes,10,Not yet,0,Sometimes,5,30.0,Yes,No,Yes,Yes,No,No,No,No,B
140,Study visit 7 (4 years),Male,Yes,Mother,Skipped,Skipped,3.98,Yes,10,Soup/Candy,Sleep,Yes,10,Not yet,0,Yes,10,Not yet,0,Sometimes,5,35.0,Sometimes,5,Yes,10,Sometimes,5,Not yet,0,Not yet,0,Not yet,0,20.0,Yes,10,Yes,10,Sometimes,5,Yes,10,Not yet,0,Not yet,0,35.0,Yes,10,Yes,10,Yes,10,Sometimes,5,Yes,10,Yes,10,55.0,Yes,10,Sometimes,5,Yes,10,Yes,10,Not yet,0,Yes,10,45.0,Yes,No,No,Yes,No,No,Yes,No,B
141,Study visit 7 (4 years),Male,No,Skipped,Mother,In-person,4.37,Yes,10,,,Yes,10,Yes,10,Yes,10,Yes,10,Yes,10,60.0,Yes,10,Not yet,0,Yes,10,Yes,10,Yes,10,Yes,10,50.0,Not yet,0,Sometimes,5,Sometimes,5,Yes,10,Not yet,0,Not yet,0,20.0,Yes,10,Yes,10,Yes,10,Sometimes,5,Yes,10,Yes,10,55.0,Not yet,0,Sometimes,5,Yes,10,Yes,10,Yes,10,Yes,10,45.0,No,No,No,Yes,Yes,No,Yes,Yes,B
142,Study visit 7 (4 years),Female,Yes,Mother,Skipped,Skipped,4.13,Yes,10,"can I have a snack, I want to eat","I tired, lay down",Yes,10,Yes,10,Yes,10,Yes,10,Not yet,0,50.0,Yes,10,Sometimes,5,Sometimes,5,Yes,10,Yes,10,Yes,10,50.0,Sometimes,5,Sometimes,5,Yes,10,Not yet,0,Not yet,0,Not yet,0,20.0,Yes,10,Not yet,0,Not yet,0,Sometimes,5,Sometimes,5,Yes,10,30.0,Not yet,0,Yes,10,Not yet,0,Yes,10,Not yet,0,Sometimes,5,25.0,Yes,No,Yes,No,No,No,No,No,B
143,Study visit 7 (4 years),Male,Yes,Mother,Skipped,Skipped,3.99,Yes,10,,,Yes,10,Yes,10,Yes,10,Yes,10,Yes,10,60.0,Sometimes,5,Not yet,0,Not yet,0,Not yet,0,Not yet,0,Not yet,0,5.0,Yes,10,Not yet,0,Not yet,0,Not yet,0,Not yet,0,Not yet,0,10.0,Yes,10,Yes,10,Yes,10,Yes,10,Yes,10,Yes,10,60.0,Yes,10,Yes,10,Not yet,0,Yes,10,Not yet,0,Not yet,0,30.0,Yes,Yes,Yes,No,No,No,No,Yes,B
147,Study visit 7 (4 years),Male,Yes,Mother,Skipped,Skipped,3.98,Yes,10,,,Yes,10,Yes,10,Yes,10,Yes,10,Yes,10,60.0,Yes,10,Yes,10,Yes,10,Yes,10,Sometimes,5,Sometimes,5,50.0,Yes,10,Yes,10,Sometimes,5,Sometimes,5,Sometimes,5,Sometimes,5,40.0,Yes,10,Yes,10,Yes,10,Yes,10,Yes,10,Yes,10,60.0,Yes,10,Yes,10,Yes,10,Yes,10,Yes,10,Yes,10,60.0,Yes,Yes,Yes,Yes,No,No,No,Yes,B
149,Study visit 7 (4 years),Male,Yes,Mother,Skipped,Skipped,3.99,Yes,10,Eat,Sleep,Yes,10,Sometimes,5,Sometimes,5,Yes,10,Sometimes,5,45.0,Sometimes,5,Yes,10,Yes,10,Not yet,0,Yes,10,Not yet,0,35.0,Yes,10,Not yet,0,Sometimes,5,Yes,10,Not yet,0,Not yet,0,25.0,Yes,10,Yes,10,Yes,10,Yes,10,Yes,10,Yes,10,60.0,Yes,10,Yes,10,Yes,10,Yes,10,Yes,10,Yes,10,60.0,Yes,Yes,Yes,Yes,No,No,No,No,B
154,Study visit 7 (4 years),Male,Yes,Other primary caregiver,Skipped,Skipped,4.13,Yes,10,eat,go to sleep,Yes,10,Yes,10,Yes,10,Yes,10,Yes,10,60.0,Yes,10,Yes,10,Yes,10,Sometimes,5,Sometimes,5,Sometimes,5,45.0,Yes,10,Yes,10,Sometimes,5,Sometimes,5,Not yet,0,Not yet,0,30.0,Yes,10,Yes,10,Yes,10,Sometimes,5,Sometimes,5,Yes,10,50.0,Yes,10,Yes,10,Yes,10,Sometimes,5,Yes,10,Yes,10,55.0,Yes,No,Yes,No,Yes,Yes,Yes,Yes,B
159,Study visit 7 (4 years),Female,Yes,Mother,Skipped,Skipped,3.96,Yes,10,Eat,Go to bed,Yes,10,Not yet,0,Yes,10,Yes,10,Yes,10,50.0,Yes,10,Yes,10,Yes,10,Not yet,0,Not yet,0,Yes,10,40.0,Yes,10,Yes,10,Yes,10,Yes,10,Yes,10,Yes,10,60.0,Yes,10,Yes,10,Yes,10,Yes,10,Yes,10,Yes,10,60.0,Yes,10,Yes,10,Yes,10,Sometimes,5,Yes,10,Yes,10,55.0,Yes,Yes,Yes,Yes,No,No,No,No,B
161,Study visit 7 (4 years),Female,Yes,Mother,Skipped,Skipped,4.07,Yes,10,"""we eat food""","""You go to sleep""",Yes,10,Sometimes,5,Sometimes,5,Yes,10,Sometimes,5,45.0,Yes,10,Yes,10,Yes,10,Yes,10,Not yet,0,Yes,10,50.0,Yes,10,Yes,10,Yes,10,Yes,10,Yes,10,Sometimes,5,55.0,Yes,10,Yes,10,Sometimes,5,Sometimes,5,Yes,10,Yes,10,50.0,Sometimes,5,Yes,10,Yes,10,Yes,10,Yes,10,Yes,10,55.0,Yes,Yes,Yes,No,No,No,No,No,B
165,Study visit 7 (4 years),Male,Yes,Mother,Skipped,Skipped,4.03,Yes,10,Fruit!,Cat Snack and go Night,Sometimes,5,Yes,10,Yes,10,Yes,10,Not yet,0,45.0,Sometimes,5,Yes,10,Yes,10,Not yet,0,Yes,10,Yes,10,45.0,Yes,10,Yes,10,Yes,10,Sometimes,5,Yes,10,Sometimes,5,50.0,Yes,10,Yes,10,Yes,10,Yes,10,Yes,10,Yes,10,60.0,Yes,10,Sometimes,5,Yes,10,Yes,10,Yes,10,Yes,10,55.0,Yes,No,Yes,Yes,Yes,No,No,Yes,B
166,Study visit 7 (4 years),Male,Yes,Mother,Skipped,Skipped,3.99,Not yet,0,,,Not yet,0,Not yet,0,Not yet,0,Not yet,0,Not yet,0,0.0,Yes,10,Yes,10,Yes,10,Not yet,0,Yes,10,Sometimes,5,45.0,Yes,10,Yes,10,Not yet,0,Yes,10,Sometimes,5,Not yet,0,35.0,Not yet,0,Not yet,0,Sometimes,5,Yes,10,Yes,10,Not yet,0,25.0,Sometimes,5,Not yet,0,Yes,10,Sometimes,5,Yes,10,Yes,10,40.0,Yes,Yes,Yes,Yes,No,No,No,No,B
168,Study visit 7 (4 years),Male,Yes,Mother,Skipped,Skipped,4.21,Yes,10,have a snack,take a nap,Yes,10,Yes,10,Yes,10,Yes,10,Yes,10,60.0,Yes,10,Yes,10,Yes,10,Yes,10,Yes,10,Yes,10,60.0,Yes,10,Sometimes,5,Yes,10,Yes,10,Yes,10,Sometimes,5,50.0,Yes,10,Yes,10,Yes,10,Yes,10,Yes,10,Yes,10,60.0,Yes,10,Yes,10,Yes,10,Yes,10,Sometimes,5,Yes,10,55.0,Yes,Yes,Yes,Yes,No,No,No,No,B
169,Study visit 7 (4 years),Male,Yes,Mother,Skipped,Skipped,4.01,Yes,10,eat,rest,Missing,,Sometimes,5,Yes,10,Sometimes,5,Yes,10,48.0,Yes,10,Yes,10,Yes,10,Sometimes,5,Sometimes,5,Sometimes,5,45.0,Yes,10,Yes,10,Yes,10,Not yet,0,Yes,10,Not yet,0,40.0,Yes,10,Yes,10,Sometimes,5,Not yet,0,Yes,10,Yes,10,45.0,Yes,10,Yes,10,Not yet,0,Yes,10,Yes,10,Yes,10,50.0,Yes,Yes,Yes,Yes,No,No,No,Yes,B
171,Study visit 7 (4 years),Male,Yes,Mother,Skipped,Skipped,4.07,Yes,10,"""Eat food""","""I sleep""",Yes,10,Yes,10,Yes,10,Yes,10,Yes,10,60.0,Yes,10,Yes,10,Yes,10,Yes,10,Yes,10,Yes,10,60.0,Yes,10,Sometimes,5,Not yet,0,Yes,10,Yes,10,Yes,10,45.0,Yes,10,Sometimes,5,Yes,10,Yes,10,Yes,10,Yes,10,55.0,Yes,10,Not yet,0,Yes,10,Yes,10,Yes,10,Yes,10,50.0,Yes,Yes,Yes,No,No,No,No,No,B
174,Study visit 7 (4 years),Female,Yes,Mother,Skipped,Skipped,3.96,Yes,10,eat food,go to sleep,Yes,10,Yes,10,Yes,10,Yes,10,Yes,10,60.0,Sometimes,5,Yes,10,Yes,10,Sometimes,5,Yes,10,Yes,10,50.0,Yes,10,Yes,10,Yes,10,Yes,10,Yes,10,Missing,,60.0,Yes,10,Yes,10,Sometimes,5,Yes,10,Yes,10,Yes,10,55.0,Yes,10,Yes,10,Yes,10,Yes,10,Yes,10,Sometimes,5,55.0,Yes,Yes,Yes,Yes,No,No,No,No,B
176,Study visit 7 (4 years),Female,Yes,Mother,Skipped,Skipped,3.98,Not yet,0,,,Not yet,0,Not yet,0,Not yet,0,Not yet,0,Not yet,0,0.0,Not yet,0,Not yet,0,Not yet,0,Not yet,0,Not yet,0,Not yet,0,0.0,Not yet,0,Not yet,0,Not yet,0,Not yet,0,Not yet,0,Not yet,0,0.0,Not yet,0,Not yet,0,Not yet,0,Not yet,0,Not yet,0,Not yet,0,0.0,Not yet,0,Not yet,0,Not yet,0,Not yet,0,Not yet,0,Not yet,0,0.0,Yes,No,No,No,No,No,No,No,B
184,Study visit 7 (4 years),Male,Yes,Mother,Skipped,Skipped,3.99,Yes,10,"""I eat chicken just like you dad""","""I go to sleep""",Yes,10,Yes,10,Yes,10,Yes,10,Yes,10,60.0,Sometimes,5,Yes,10,Yes,10,Sometimes,5,Yes,10,Yes,10,50.0,Sometimes,5,Not yet,0,Not yet,0,Not yet,0,Not yet,0,Not yet,0,5.0,Yes,10,Yes,10,Yes,10,Yes,10,Sometimes,5,Yes,10,55.0,Yes,10,Yes,10,Sometimes,5,Yes,10,Yes,10,Sometimes,5,50.0,Yes,Yes,Yes,Yes,No,No,No,No,A
186,Study visit 7 (4 years),Male,Yes,Mother,Skipped,Skipped,4.08,Not yet,0,Nothing,Nothing,Not yet,0,Not yet,0,Not yet,0,Not yet,0,Not yet,0,0.0,Not yet,0,Not yet,0,Not yet,0,Not yet,0,Not yet,0,Not yet,0,0.0,Not yet,0,Not yet,0,Not yet,0,Not yet,0,Not yet,0,Not yet,0,0.0,Not yet,0,Not yet,0,Not yet,0,Not yet,0,Not yet,0,Not yet,0,0.0,Not yet,0,Not yet,0,Not yet,0,Not yet,0,Not yet,0,Not yet,0,0.0,No,No,No,No,No,Yes,Yes,Yes,B
187,Study visit 7 (4 years),Female,Yes,Mother,Skipped,Skipped,4.05,Not yet,0,,,Not yet,0,Not yet,0,Not yet,0,Not yet,0,Not yet,0,0.0,Not yet,0,Not yet,0,Not yet,0,Not yet,0,Not yet,0,Not yet,0,0.0,Not yet,0,Not yet,0,Not yet,0,Not yet,0,Not yet,0,Not yet,0,0.0,Not yet,0,Not yet,0,Not yet,0,Not yet,0,Not yet,0,Not yet,0,0.0,Not yet,0,Not yet,0,Not yet,0,Not yet,0,Not yet,0,Not yet,0,0.0,Yes,No,No,No,No,No,No,No,B
188,Study visit 7 (4 years),Male,Yes,Mother,Skipped,Skipped,3.95,Yes,10,hungry,night night,Yes,10,Sometimes,5,Sometimes,5,Yes,10,Sometimes,5,45.0,Yes,10,Yes,10,Not yet,0,Not yet,0,Not yet,0,Yes,10,30.0,Yes,10,Not yet,0,Sometimes,5,Not yet,0,Not yet,0,Not yet,0,15.0,Yes,10,Yes,10,Yes,10,Not yet,0,Yes,10,Not yet,0,40.0,Yes,10,Yes,10,Yes,10,Yes,10,Yes,10,Not yet,0,50.0,Yes,Yes,Yes,Yes,No,No,Yes,No,B
196,Study visit 7 (4 years),Male,Yes,Mother,Skipped,Skipped,3.93,Yes,10,,my blankie,Sometimes,5,Not yet,0,Sometimes,5,Sometimes,5,Not yet,0,25.0,Yes,10,Yes,10,Yes,10,Yes,10,Yes,10,Yes,10,60.0,Yes,10,Sometimes,5,Not yet,0,Sometimes,5,Not yet,0,Sometimes,5,25.0,Sometimes,5,Not yet,0,Not yet,0,Sometimes,5,Not yet,0,Yes,10,20.0,Yes,10,Not yet,0,Yes,10,Yes,10,Sometimes,5,Sometimes,5,40.0,Yes,No,No,Yes,No,No,No,Yes,B
197,Study visit 7 (4 years),Female,Yes,Mother,Skipped,Skipped,4.02,Yes,10,I eat,I go to sleep at bedtime,Yes,10,Yes,10,Yes,10,Yes,10,Yes,10,60.0,Yes,10,Yes,10,Yes,10,Yes,10,Yes,10,Not yet,0,50.0,Yes,10,Sometimes,5,Yes,10,Yes,10,Yes,10,Sometimes,5,50.0,Yes,10,Yes,10,Sometimes,5,Sometimes,5,Yes,10,Yes,10,50.0,Yes,10,Yes,10,Yes,10,Yes,10,Not yet,0,Yes,10,50.0,Yes,Yes,Yes,Yes,No,No,No,No,B
203,Study visit 7 (4 years),Male,Yes,Mother,Skipped,Skipped,4.05,Missing,,"eat, find food, order something to eat",nap,Missing,,Yes,10,Yes,10,Sometimes,5,Yes,10,52.5,Sometimes,5,Sometimes,5,Sometimes,5,Sometimes,5,Yes,10,Yes,10,40.0,Sometimes,5,Yes,10,Sometimes,5,Yes,10,Sometimes,5,Yes,10,45.0,Yes,10,Yes,10,Yes,10,Sometimes,5,Yes,10,Sometimes,5,50.0,Yes,10,Yes,10,Yes,10,Yes,10,Yes,10,Yes,10,60.0,Yes,No,No,No,No,No,No,No,B