blind_id,VISIT,GENDER,ASSISTANCE,NOASSIST,WITHASSIST,WITHASSIS_ME,PATIENT_AGE_INSTR,THREE_DIREC,T_DIREC_SC,FOUR_FIVE,FOUR_FIVE_SC,END_ED,END_ED_SC,COMPARE,COMPARE_SC,ANSWERS_1,ANSWERS_2,ANSWERS,ANSWERS_SC,REPEAT,REPEAT_SC,COMMUN_SC,THROW_BALL,THROW_BAL_SC,CATCH_BALL,CATCH_BAL_SC,ONE_FOOT,ONE_FOOT_SC,TIPTOES,TIPTOES_SC,HOP,HOP_SC,SKIP,SKIP_SC,G_MOTOR_SC,LINE,LINE_SC,DRAWING,DRAWING_SC,CUT_PAPER,CUT_PAPER_SC,COPYING,COPYING_SC,LETTERS,LETTERS_SC,LETTERS_NAME,LET_NAME_SC,F_MOTOR_SC,CIRCLES,CIRCLES_SC,COLORS,COLORS_SC,COUNTS,COUNTS_SC,OPPOSIT_1,OPPOSIT_2,OPPOSIT_3,OPPOSIT_4,OPPOSIT,OPPOSIT_SC,NUMBERS,NUMBERS_SC,NAME2,NAME_SC,PROB_SOLV_SC,UTENSILS,UTENSILS_SC,WASHING,WASHING_SC,TELLING,TELLING_SC,DRESSING,TELLING_EX,DRESSING_SC,TOILET,TOILET_SC,SHARING,SHARING_SC,PERS_SOC_SC,HEAR,TALK,SAY,WALK,HISTORY,VISION,MED_PROB,WORRY,VER_ID
2,Study visit 8 (5 years),Male,Yes,Mother,Skipped,Skipped,5.08,Yes,10,Yes,10,Yes,10,Yes,10,eat,sleep,Yes,10,Yes,10,60.0,Yes,10,Yes,10,Yes,10,Yes,10,Sometimes,5,Yes,10,55.0,Yes,10,Yes,10,Yes,10,Yes,10,Yes,10,Yes,10,60.0,Yes,10,Yes,10,Yes,10,small,hot,day,down,Yes,10,Yes,10,Yes,10,60.0,Yes,10,Yes,10,Yes,10,Yes,"First name, Age, City he lives in, Last name, Boy or girl",10,Yes,10,Yes,10,60.0,Yes,Yes,Yes,Yes,No,No,No,No,B
4,Study visit 8 (5 years),Female,Yes,Mother,Skipped,Skipped,4.98,Yes,10,Yes,10,Yes,10,Sometimes,5,I just eat,I sleep,Yes,10,Not yet,0,45.0,Yes,10,Yes,10,Sometimes,5,Yes,10,Not yet,0,Not yet,0,35.0,Sometimes,5,Not yet,0,Yes,10,Sometimes,5,Yes,10,Yes,10,40.0,Yes,10,Yes,10,Yes,10,small,hot,day,down,Yes,10,Yes,10,Yes,10,60.0,Yes,10,Yes,10,Yes,10,Not yet,"First name, Age, City he lives in, Last name, Boy or girl, Telephone number",0,Yes,10,Yes,10,50.0,Yes,Yes,Yes,No,No,Yes,No,Yes,B
5,Study visit 8 (5 years),Male,Yes,Mother,Skipped,Skipped,4.94,Yes,10,Yes,10,Yes,10,Sometimes,5,I tell mom and daddy that I want some food,I drink water and rest,Yes,10,Yes,10,55.0,Yes,10,Sometimes,5,Yes,10,Not yet,0,Not yet,0,Not yet,0,25.0,Not yet,0,Not yet,0,Not yet,0,Sometimes,5,Not yet,0,Not yet,0,5.0,Yes,10,Yes,10,Sometimes,5,small,hot,,down,Yes,10,Not yet,0,Not yet,0,35.0,Yes,10,Yes,10,Yes,10,Not yet,"First name, Age, Last name, Boy or girl",0,Yes,10,Yes,10,50.0,Yes,Yes,Yes,No,No,Yes,No,Yes,B
6,Study visit 8 (5 years),Male,Yes,Mother,Skipped,Skipped,5.01,Not yet,0,Yes,10,Yes,10,Not yet,0,Eat,Sleep,Yes,10,Yes,10,40.0,Sometimes,5,Sometimes,5,Sometimes,5,Not yet,0,Not yet,0,Not yet,0,15.0,Sometimes,5,Yes,10,Not yet,0,Sometimes,5,Yes,10,Sometimes,5,35.0,Yes,10,Yes,10,Yes,10,small,hot,day,down,Yes,10,Yes,10,Yes,10,60.0,Not yet,0,Not yet,0,Yes,10,Not yet,"First name, Age, City he lives in, Last name, Boy or girl, Telephone number",0,Not yet,0,Sometimes,5,15.0,Yes,No,Yes,No,No,No,No,Yes,B
9,Study visit 8 (5 years),Male,Yes,Mother,Skipped,Skipped,4.94,Yes,10,Yes,10,Not yet,0,Sometimes,5,,"""I tired""",Sometimes,5,Not yet,0,30.0,Yes,10,Sometimes,5,Not yet,0,Not yet,0,Not yet,0,Not yet,0,15.0,Sometimes,5,Not yet,0,Sometimes,5,Not yet,0,Not yet,0,Sometimes,5,15.0,Not yet,0,Yes,10,Sometimes,5,,,,,Not yet,0,Yes,10,Not yet,0,25.0,Not yet,0,Yes,10,Yes,10,Sometimes,"First name, Age, Last name, Boy or girl",5,Yes,10,Sometimes,5,40.0,Yes,Yes,Yes,Yes,No,No,No,Yes,B
12,Study visit 8 (5 years),Male,Yes,Mother,Skipped,Skipped,4.93,Yes,10,Yes,10,Yes,10,Yes,10,Ask for food from mom,Go to sleep,Yes,10,Not yet,0,50.0,Yes,10,Yes,10,Yes,10,Yes,10,Sometimes,5,Sometimes,5,50.0,Yes,10,Yes,10,Yes,10,Yes,10,Yes,10,Yes,10,60.0,Yes,10,Yes,10,Yes,10,little,hot,day,down,Yes,10,Yes,10,Yes,10,60.0,Yes,10,Yes,10,Yes,10,Yes,"First name, Age, Last name, Boy or girl",10,Yes,10,Yes,10,60.0,Yes,Yes,Yes,Yes,No,No,No,No,B
23,Study visit 8 (5 years),Male,No,Skipped,Mother,In-person,5.33,Yes,10,Yes,10,Yes,10,Yes,10,,,Yes,10,Sometimes,5,55.0,Yes,10,Sometimes,5,Sometimes,5,Yes,10,Yes,10,Sometimes,5,45.0,Yes,10,Sometimes,5,Yes,10,Yes,10,Yes,10,Yes,10,55.0,Yes,10,Yes,10,Sometimes,5,,,,,Yes,10,Yes,10,Yes,10,55.0,Yes,10,Yes,10,Yes,10,Not yet,,0,Sometimes,5,Sometimes,5,40.0,Yes,Yes,Yes,No,No,No,Yes,Yes,B
37,Study visit 8 (5 years),Male,Yes,Mother,Skipped,Skipped,4.99,Yes,10,Yes,10,Sometimes,5,Sometimes,5,Ask parents for food,Go to sleep,Yes,10,Yes,10,50.0,Yes,10,Yes,10,Not yet,0,Yes,10,Not yet,0,Not yet,0,30.0,Not yet,0,Not yet,0,Sometimes,5,Not yet,0,Not yet,0,Not yet,0,5.0,Yes,10,Yes,10,Sometimes,5,small,warm,morning,down,Yes,10,Yes,10,Yes,10,55.0,Yes,10,Yes,10,Yes,10,Yes,"First name, Age, Last name, Boy or girl",10,Yes,10,Sometimes,5,55.0,Yes,No,Yes,No,No,No,No,No,B
38,Study visit 8 (5 years),Female,Yes,Mother,Skipped,Skipped,5.08,Yes,10,Yes,10,Yes,10,Sometimes,5,Eat,Sleep,Yes,10,Not yet,0,45.0,Yes,10,Yes,10,Yes,10,Yes,10,Yes,10,Yes,10,60.0,Yes,10,Yes,10,Yes,10,Yes,10,Yes,10,Yes,10,60.0,Yes,10,Yes,10,Yes,10,little,hot,day,down,Yes,10,Yes,10,Yes,10,60.0,Yes,10,Yes,10,Yes,10,Sometimes,"First name, Age, City he lives in, Last name, Boy or girl",5,Yes,10,Sometimes,5,50.0,Yes,No,Yes,Yes,No,No,No,No,B
39,Study visit 8 (5 years),Male,Yes,Mother,Skipped,Skipped,4.97,Yes,10,Yes,10,Yes,10,Sometimes,5,Mom I want something to eat,I want to sleep,Sometimes,5,Sometimes,5,45.0,Yes,10,Yes,10,Yes,10,Yes,10,Sometimes,5,Sometimes,5,50.0,Yes,10,Yes,10,Sometimes,5,Yes,10,Yes,10,Yes,10,55.0,Yes,10,Yes,10,Yes,10,small,hot,day,dawn,Yes,10,Yes,10,Yes,10,60.0,Yes,10,Yes,10,Yes,10,Yes,"First name, Age, Last name, Boy or girl",10,Yes,10,Yes,10,60.0,Yes,Yes,Yes,Yes,No,No,No,Yes,B
40,Study visit 8 (5 years),Male,Yes,Mother,Skipped,Skipped,5.06,Yes,10,Yes,10,Sometimes,5,Not yet,0,,,Yes,10,Yes,10,45.0,Yes,10,Sometimes,5,Sometimes,5,Yes,10,Sometimes,5,Sometimes,5,40.0,Sometimes,5,Yes,10,Sometimes,5,Sometimes,5,Not yet,0,Sometimes,5,30.0,Yes,10,Yes,10,Sometimes,5,,,,,Not yet,0,Yes,10,Yes,10,45.0,Yes,10,Yes,10,Yes,10,Yes,,10,Yes,10,Yes,10,60.0,Yes,Yes,Yes,Yes,No,No,No,No,B
46,Study visit 8 (5 years),Male,Yes,Mother,Skipped,Skipped,5.01,Sometimes,5,Yes,10,Yes,10,Sometimes,5,you eat,yawn and go to sleep,Yes,10,Not yet,0,40.0,Yes,10,Yes,10,Not yet,0,Yes,10,Not yet,0,Not yet,0,30.0,Not yet,0,Sometimes,5,Yes,10,Yes,10,Yes,10,Yes,10,45.0,Yes,10,Yes,10,Yes,10,little,hot,summer time,down,Yes,10,Yes,10,Yes,10,60.0,Yes,10,Yes,10,Yes,10,Sometimes,"First name, Age, Last name, Boy or girl",5,Yes,10,Yes,10,55.0,Yes,Yes,Yes,No,No,No,Yes,Yes,B
51,Study visit 8 (5 years),Male,Yes,Mother,Skipped,Skipped,5.08,Yes,10,Yes,10,Sometimes,5,Yes,10,Eat food,Go to sleep,Yes,10,Not yet,0,45.0,Yes,10,Yes,10,Yes,10,Yes,10,Yes,10,Not yet,0,50.0,Sometimes,5,Sometimes,5,Yes,10,Sometimes,5,Sometimes,5,Sometimes,5,35.0,Yes,10,Yes,10,Not yet,0,small,hot,day,down,Yes,10,Yes,10,Sometimes,5,45.0,Yes,10,Yes,10,Yes,10,Yes,"First name, Age, Last name, Boy or girl",10,Yes,10,Yes,10,60.0,Yes,Yes,Yes,No,No,No,No,No,B
52,Study visit 8 (5 years),Male,No,Skipped,Mother,Phone interview,5.01,Yes,10,Yes,10,Yes,10,Yes,10,,,Yes,10,Yes,10,60.0,Yes,10,Yes,10,Yes,10,Yes,10,Yes,10,Yes,10,60.0,Yes,10,Yes,10,Yes,10,Yes,10,Not yet,0,Yes,10,50.0,Yes,10,Yes,10,Not yet,0,small,hot,day,down,Yes,10,Yes,10,Yes,10,50.0,Yes,10,Not yet,0,Yes,10,Yes,,10,Yes,10,Sometimes,5,45.0,Yes,Yes,Yes,No,No,No,No,Yes,B
54,Study visit 8 (5 years),Male,Yes,Mother,Skipped,Skipped,4.97,Sometimes,5,Missing,,Yes,10,Yes,10,"""You could say you want a snack""","""Lay down, close your eyes and sleep""",Yes,10,Sometimes,5,48.0,Yes,10,Yes,10,Sometimes,5,Yes,10,Not yet,0,Sometimes,5,40.0,Sometimes,5,Sometimes,5,Yes,10,Not yet,0,Not yet,0,Yes,10,30.0,Yes,10,Yes,10,Sometimes,5,small,warm,sun,back,Yes,10,Not yet,0,Yes,10,45.0,Not yet,0,Yes,10,Missing,,Sometimes,,5,Sometimes,5,Yes,10,36.0,Yes,Yes,Yes,Yes,No,No,No,No,B
58,Study visit 8 (5 years),Male,Yes,Mother,Skipped,Skipped,5.02,Yes,10,Yes,10,Yes,10,Yes,10,"""Eat something.""","""I go to sleep in my bed.""",Yes,10,Yes,10,60.0,Yes,10,Yes,10,Yes,10,Sometimes,5,Not yet,0,Not yet,0,35.0,Yes,10,Yes,10,Sometimes,5,Sometimes,5,Yes,10,Yes,10,50.0,Yes,10,Yes,10,Yes,10,small,hot,day,back down,Yes,10,Yes,10,Yes,10,60.0,Yes,10,Yes,10,Yes,10,Yes,"First name, Age, City he lives in, Last name, Boy or girl",10,Yes,10,Yes,10,60.0,Yes,Yes,Yes,Yes,No,No,Yes,Yes,B
61,Study visit 8 (5 years),Female,Yes,Mother,Skipped,Skipped,5.11,Not yet,0,Not yet,0,Not yet,0,Not yet,0,not yet,,Not yet,0,Not yet,0,0.0,Yes,10,Not yet,0,Not yet,0,Not yet,0,Not yet,0,Not yet,0,10.0,Not yet,0,Not yet,0,Yes,10,Not yet,0,Not yet,0,Not yet,0,10.0,Not yet,0,Not yet,0,Sometimes,5,,,,,Not yet,0,Not yet,0,Not yet,0,5.0,Sometimes,5,Sometimes,5,Not yet,0,Not yet,,0,Missing,,Sometimes,5,18.0,Yes,No,No,Yes,No,No,No,Yes,B
62,Study visit 8 (5 years),Male,Yes,Mother,Skipped,Skipped,4.96,Yes,10,Yes,10,Yes,10,Not yet,0,I eat,I yawn and go right to bed,Yes,10,Yes,10,50.0,Yes,10,Yes,10,Sometimes,5,Yes,10,Not yet,0,Not yet,0,35.0,Sometimes,5,Not yet,0,Not yet,0,Sometimes,5,Sometimes,5,Yes,10,25.0,Yes,10,Yes,10,Yes,10,small,hot,day,down,Yes,10,Yes,10,Yes,10,60.0,Sometimes,5,Yes,10,Yes,10,Sometimes,"First name, Age, Last name, Boy or girl",5,Not yet,0,Sometimes,5,35.0,Yes,Yes,Yes,No,No,No,No,Yes,B
63,Study visit 8 (5 years),Female,Yes,Father,Skipped,Skipped,5,Yes,10,Yes,10,Yes,10,Not yet,0,Can I have a snack?,Go to sleep,Yes,10,Sometimes,5,45.0,Yes,10,Yes,10,Yes,10,Yes,10,Yes,10,Yes,10,60.0,Not yet,0,Sometimes,5,Not yet,0,Yes,10,Yes,10,Yes,10,35.0,Yes,10,Yes,10,Yes,10,Little,Hot,Morning,down,Yes,10,Yes,10,Yes,10,60.0,Yes,10,Not yet,0,Yes,10,Yes,"First name, Age, Last name, Boy or girl",10,Yes,10,Sometimes,5,45.0,Yes,Yes,Yes,Yes,No,Yes,No,Yes,B
69,Study visit 8 (5 years),Male,Yes,Mother,Skipped,Skipped,5.2,Yes,10,Yes,10,Yes,10,Yes,10,Eat,Go to sleep,Yes,10,Sometimes,5,55.0,Yes,10,Yes,10,Yes,10,Yes,10,Yes,10,Not yet,0,50.0,Sometimes,5,Sometimes,5,Yes,10,Not yet,0,Sometimes,5,Yes,10,35.0,Yes,10,Yes,10,Yes,10,small,hot,day,down,Yes,10,Yes,10,Yes,10,60.0,Yes,10,Sometimes,5,Yes,10,Sometimes,"First name, Age, City he lives in, Last name, Boy or girl",5,Yes,10,Yes,10,50.0,Yes,Yes,Yes,Yes,No,No,Yes,Yes,B
74,Study visit 8 (5 years),Male,Yes,Father,Skipped,Skipped,5.01,Not yet,0,Sometimes,5,Not yet,0,Not yet,0,,,Not yet,0,Not yet,0,5.0,Sometimes,5,Yes,10,Yes,10,Yes,10,Yes,10,Yes,10,55.0,Not yet,0,Not yet,0,Not yet,0,Not yet,0,Not yet,0,Not yet,0,0.0,Not yet,0,Not yet,0,Sometimes,5,,,,,Not yet,0,Not yet,0,Not yet,0,5.0,Not yet,0,Sometimes,5,Not yet,0,Not yet,,0,Sometimes,5,Sometimes,5,15.0,No,No,Yes,Yes,Yes,No,No,Yes,B
77,Study visit 8 (5 years),Female,Yes,Mother,Skipped,Skipped,5.03,Yes,10,Yes,10,Yes,10,Sometimes,5,Tells his mom,Lie on the couch,Sometimes,5,Yes,10,50.0,Yes,10,Yes,10,Yes,10,Yes,10,Sometimes,5,Sometimes,5,50.0,Yes,10,Sometimes,5,Yes,10,Sometimes,5,Yes,10,Yes,10,50.0,Yes,10,Not yet,0,Not yet,0,yes,,,,Sometimes,5,Yes,10,Not yet,0,25.0,Sometimes,5,Yes,10,Yes,10,Sometimes,"First name, Age, Last name, Boy or girl",5,Yes,10,Yes,10,50.0,Yes,Yes,Yes,Yes,No,No,No,No,B
87,Study visit 8 (5 years),Female,Yes,Mother,Skipped,Skipped,4.96,Yes,10,Yes,10,Sometimes,5,Yes,10,"""Um, tell someone for a snack""","""Take a nap or go to sleep""",Yes,10,Yes,10,55.0,Yes,10,Yes,10,Yes,10,Yes,10,Sometimes,5,Sometimes,5,50.0,Yes,10,Yes,10,Yes,10,Yes,10,Yes,10,Yes,10,60.0,Yes,10,Yes,10,Yes,10,small,warm,day,"down, abajo",Yes,10,Yes,10,Yes,10,60.0,Yes,10,Yes,10,Sometimes,5,Yes,"First name, Age, Boy or girl",10,Yes,10,Yes,10,55.0,Yes,Yes,Yes,Yes,No,No,No,No,B
95,Study visit 8 (5 years),Male,Yes,Mother,Skipped,Skipped,5.03,Yes,10,Yes,10,Yes,10,Yes,10,"""go and eat""","""go to sleep""",Yes,10,Yes,10,60.0,Yes,10,Yes,10,Yes,10,Yes,10,Not yet,0,Not yet,0,40.0,Yes,10,Yes,10,Yes,10,Yes,10,Yes,10,Yes,10,60.0,Yes,10,Yes,10,Sometimes,5,small,hot & dangerous,day time,down,Yes,10,Yes,10,Yes,10,55.0,Sometimes,5,Yes,10,Yes,10,Sometimes,"First name, Age, City he lives in, Last name, Boy or girl",5,Yes,10,Yes,10,50.0,Yes,No,Yes,Yes,No,No,No,No,B
101,Study visit 8 (5 years),Male,Yes,Mother,Skipped,Skipped,5.12,Sometimes,5,Not yet,0,Not yet,0,Not yet,0,,,Not yet,0,Not yet,0,5.0,Sometimes,5,Sometimes,5,Sometimes,5,Not yet,0,Not yet,0,Not yet,0,15.0,Not yet,0,Not yet,0,Not yet,0,Not yet,0,Not yet,0,Not yet,0,0.0,Yes,10,Not yet,0,Not yet,0,,,,,Not yet,0,Yes,10,Not yet,0,20.0,Not yet,0,Not yet,0,Not yet,0,Not yet,,0,Not yet,0,Yes,10,10.0,Yes,No,No,No,No,No,No,Yes,B
104,Study visit 8 (5 years),Male,No,Skipped,Mother,Phone interview,4.99,Yes,10,Yes,10,Sometimes,5,Sometimes,5,as something,rest,Yes,10,Sometimes,5,45.0,Yes,10,Yes,10,Sometimes,5,Yes,10,Yes,10,Sometimes,5,50.0,Not yet,0,Not yet,0,Yes,10,Sometimes,5,Yes,10,Sometimes,5,30.0,Yes,10,Yes,10,Not yet,0,,,,,Yes,10,Yes,10,Yes,10,50.0,Sometimes,5,Yes,10,Yes,10,Yes,,10,Yes,10,Yes,10,55.0,Yes,Yes,Yes,Yes,No,No,No,Yes,B
106,Study visit 8 (5 years),Female,Yes,Mother,Skipped,Skipped,5.07,Sometimes,5,Yes,10,Yes,10,Yes,10,Ask Mommy for sandwich,Go to sleep and not agree,Yes,10,Not yet,0,45.0,Yes,10,Sometimes,5,Yes,10,Yes,10,Yes,10,Yes,10,55.0,Not yet,0,Sometimes,5,Yes,10,Not yet,0,Sometimes,5,Yes,10,30.0,Yes,10,Yes,10,Sometimes,5,small,steaming hot,morning,back,Yes,10,Yes,10,Yes,10,55.0,Yes,10,Yes,10,Yes,10,Yes,"First name, Age, Last name, boy or girl",10,Yes,10,Sometimes,5,55.0,No,No,Yes,Yes,No,Yes,Yes,No,B
109,Study visit 8 (5 years),Male,Yes,Mother,Skipped,Skipped,5.02,Yes,10,Yes,10,Yes,10,Yes,10,I eat,I sleep,Yes,10,Yes,10,60.0,Yes,10,Yes,10,Yes,10,Yes,10,Sometimes,5,Yes,10,55.0,Yes,10,Yes,10,Yes,10,Yes,10,Yes,10,Yes,10,60.0,Yes,10,Yes,10,Yes,10,small,hot,morning,down,Yes,10,Yes,10,Yes,10,60.0,Yes,10,Yes,10,Yes,10,Yes,,10,Yes,10,Yes,10,60.0,Yes,Yes,Yes,Yes,No,No,No,No,B
112,Study visit 8 (5 years),Female,No,Skipped,Mother,Phone interview,5.08,Yes,10,Yes,10,Yes,10,Yes,10,"""I eat a snack""","""I sleep""",Yes,10,Yes,10,60.0,Yes,10,Yes,10,Yes,10,Sometimes,5,Yes,10,Sometimes,5,50.0,Yes,10,Yes,10,Yes,10,Yes,10,Yes,10,Yes,10,60.0,Yes,10,Yes,10,Sometimes,5,small,hot,day,back down,Yes,10,Yes,10,Yes,10,55.0,Yes,10,Yes,10,Yes,10,Yes,,10,Yes,10,Yes,10,60.0,Yes,Yes,Yes,Yes,No,No,No,No,B
114,Study visit 8 (5 years),Female,Yes,Father,Skipped,Skipped,5.23,Yes,10,Yes,10,Yes,10,Not yet,0,I eat,I lay down,Yes,10,Sometimes,5,45.0,Yes,10,Yes,10,Yes,10,Yes,10,Yes,10,Yes,10,60.0,Sometimes,5,Yes,10,Yes,10,Not yet,0,Yes,10,Yes,10,45.0,Yes,10,Yes,10,Yes,10,small,hot,day,down,Yes,10,Yes,10,Yes,10,60.0,Yes,10,Yes,10,Yes,10,Yes,"First name, Age, City he lives in, Last name, Girl",10,Yes,10,Yes,10,60.0,Yes,No,Yes,Yes,No,No,No,No,B
115,Study visit 8 (5 years),Female,Yes,Father,Skipped,Skipped,4.97,Not yet,0,Not yet,0,Not yet,0,Not yet,0,,,Not yet,0,Not yet,0,0.0,Not yet,0,Not yet,0,Not yet,0,Not yet,0,Not yet,0,Not yet,0,0.0,Not yet,0,Not yet,0,Not yet,0,Not yet,0,Not yet,0,Not yet,0,0.0,Not yet,0,Not yet,0,Not yet,0,,,,,Not yet,0,Not yet,0,Not yet,0,0.0,Not yet,0,Not yet,0,Not yet,0,Not yet,,0,Not yet,0,Not yet,0,0.0,Yes,No,No,No,No,Yes,Yes,Yes,B
127,Study visit 8 (5 years),Male,Yes,Mother,Skipped,Skipped,4.96,Yes,10,Yes,10,Yes,10,Sometimes,5,Get up & get food,I yawn,Yes,10,Sometimes,5,50.0,Yes,10,Yes,10,Not yet,0,Yes,10,Not yet,0,Sometimes,5,35.0,Sometimes,5,Not yet,0,Yes,10,Not yet,0,Not yet,0,Not yet,0,15.0,Yes,10,Yes,10,Sometimes,5,little,fire,0,down,Sometimes,5,Yes,10,Not yet,0,40.0,Yes,10,Yes,10,Yes,10,Sometimes,"First name, Age, Last name, Boy or girl",5,Yes,10,Yes,10,55.0,Yes,Yes,Yes,No,No,No,Yes,No,B
134,Study visit 8 (5 years),Male,Yes,Mother,Skipped,Skipped,5.04,Yes,10,Yes,10,Yes,10,Yes,10,"""Eat some food""","""Go to bed""",Yes,10,Yes,10,60.0,Yes,10,Yes,10,Yes,10,Yes,10,Sometimes,5,Yes,10,55.0,Yes,10,Yes,10,Yes,10,Yes,10,Yes,10,Yes,10,60.0,Yes,10,Yes,10,Yes,10,small,hot,morning,down,Yes,10,Yes,10,Yes,10,60.0,Yes,10,Yes,10,Yes,10,Yes,"First name, Age, City he lives in, Last name, Boy or girl",10,Yes,10,Yes,10,60.0,Yes,Yes,Yes,Yes,No,No,No,No,B
139,Study visit 8 (5 years),Female,Yes,Mother,Skipped,Skipped,5.31,Not yet,0,Yes,10,Not yet,0,Not yet,0,Ma I want something to eat,I go to bed,Yes,10,Not yet,0,20.0,Sometimes,5,Sometimes,5,Not yet,0,Not yet,0,Not yet,0,Not yet,0,10.0,Not yet,0,Not yet,0,Sometimes,5,Not yet,0,Not yet,0,Not yet,0,5.0,Not yet,0,Not yet,0,Not yet,0,,,,,Not yet,0,Not yet,0,Not yet,0,0.0,Yes,10,Sometimes,5,Yes,10,Sometimes,,5,Sometimes,5,Yes,10,45.0,Yes,No,Yes,Yes,No,No,No,No,B
140,Study visit 8 (5 years),Male,No,Skipped,Other primary caregiver,Phone interview,5.21,Yes,10,Yes,10,Sometimes,5,Not yet,0,eat,go to bed,Yes,10,Yes,10,45.0,Yes,10,Yes,10,Yes,10,Yes,10,Not yet,0,Not yet,0,40.0,Yes,10,Yes,10,Yes,10,Not yet,0,Sometimes,5,Yes,10,45.0,Yes,10,Sometimes,5,Sometimes,5,little,hot,,down,Yes,10,Not yet,0,Not yet,0,30.0,Not yet,0,Sometimes,5,Yes,10,Sometimes,"First name, Age, Last name, Boy or girl",5,Yes,10,Sometimes,5,35.0,Yes,No,Yes,Yes,No,No,No,Yes,B
141,Study visit 8 (5 years),Male,No,Skipped,Mother,In-person,5.43,Not yet,0,Yes,10,Yes,10,Sometimes,5,,,Yes,10,Not yet,0,35.0,Yes,10,Sometimes,5,Sometimes,5,Sometimes,5,Sometimes,5,Not yet,0,30.0,Yes,10,Sometimes,5,Yes,10,Yes,10,Not yet,0,Yes,10,45.0,Yes,10,Yes,10,Not yet,0,,,,,Not yet,0,Not yet,0,Not yet,0,20.0,Yes,10,Yes,10,Not yet,0,Not yet,"First name, Age, Boy or girl",0,Yes,10,Yes,10,40.0,No,No,Yes,Yes,Yes,Yes,Yes,Yes,B
142,Study visit 8 (5 years),Female,Yes,Mother,Skipped,Skipped,5.01,Yes,10,Yes,10,Yes,10,Yes,10,,,Yes,10,Yes,10,60.0,Yes,10,Yes,10,Yes,10,Yes,10,Yes,10,Yes,10,60.0,Yes,10,Yes,10,Sometimes,5,Sometimes,5,Sometimes,5,Yes,10,45.0,Yes,10,Yes,10,Sometimes,5,,,,,Sometimes,5,Sometimes,5,Yes,10,45.0,Yes,10,Yes,10,Yes,10,Sometimes,,5,Sometimes,5,Yes,10,50.0,Yes,Yes,Yes,Yes,No,No,No,No,B
143,Study visit 8 (5 years),Male,Yes,Mother,Skipped,Skipped,4.99,Yes,10,Yes,10,Yes,10,Yes,10,Tel you I'm hungry,I don't like naps,Yes,10,Not yet,0,50.0,Yes,10,Not yet,0,Not yet,0,Not yet,0,Not yet,0,Not yet,0,10.0,Sometimes,5,Yes,10,Not yet,0,Not yet,0,Not yet,0,Not yet,0,15.0,Yes,10,Yes,10,Yes,10,small,hot,day,down,Yes,10,Yes,10,Yes,10,60.0,Not yet,0,Not yet,0,Yes,10,Not yet,,0,Not yet,0,Yes,10,20.0,Yes,Yes,Yes,No,No,No,No,Yes,B
147,Study visit 8 (5 years),Male,Yes,Mother,Skipped,Skipped,4.93,Yes,10,Yes,10,Yes,10,Yes,10,I eat,Sleep,Yes,10,Yes,10,60.0,Yes,10,Yes,10,Yes,10,Yes,10,Yes,10,Not yet,0,50.0,Sometimes,5,Not yet,0,Not yet,0,Not yet,0,Sometimes,5,Yes,10,20.0,Yes,10,Yes,10,Yes,10,small,hot,morning,down,Yes,10,Yes,10,Yes,10,60.0,Yes,10,Yes,10,Yes,10,Sometimes,"First name, Age last name, Boy or girl",5,Yes,10,Sometimes,5,50.0,Yes,Yes,Yes,Yes,No,No,No,No,B
154,Study visit 8 (5 years),Male,Yes,Other primary caregiver,Skipped,Skipped,5.04,Yes,10,Yes,10,Yes,10,Yes,10,see field level comments,see field level comments,Yes,10,Yes,10,60.0,Yes,10,Yes,10,Yes,10,Yes,10,Yes,10,Not yet,0,50.0,Sometimes,5,Yes,10,Yes,10,Yes,10,Yes,10,Yes,10,55.0,Yes,10,Yes,10,Yes,10,small,hot,morning,back down,Yes,10,Yes,10,Yes,10,60.0,Yes,10,Yes,10,Yes,10,Yes,"First name, Age, City he lives in, Last name, Boy or girl",10,Yes,10,Yes,10,60.0,Yes,No,Yes,No,Yes,Yes,Missing,Yes,B
159,Study visit 8 (5 years),Female,Yes,Mother,Skipped,Skipped,4.98,Yes,10,Yes,10,Not yet,0,Yes,10,Ask your mom if I can have food,Go to bed,Yes,10,Sometimes,5,45.0,Yes,10,Yes,10,Sometimes,5,Yes,10,Sometimes,5,Yes,10,50.0,Yes,10,Yes,10,Yes,10,Yes,10,Yes,10,Yes,10,60.0,Yes,10,Yes,10,Yes,10,small,hot,day,down,Yes,10,Yes,10,Yes,10,60.0,Yes,10,Yes,10,Yes,10,Sometimes,"First name, Age, Last name, Boy or girl",5,Yes,10,Yes,10,55.0,Yes,Yes,Yes,Yes,No,No,No,No,B
161,Study visit 8 (5 years),Female,No,Skipped,Mother,Phone interview,5.01,Yes,10,Yes,10,Sometimes,5,Yes,10,,,Yes,10,Yes,10,55.0,Yes,10,Yes,10,Sometimes,5,Yes,10,Not yet,0,Yes,10,45.0,Yes,10,Yes,10,Yes,10,Yes,10,Sometimes,5,Yes,10,55.0,Yes,10,Yes,10,Yes,10,small,,,,Sometimes,5,Yes,10,Yes,10,55.0,Yes,10,Yes,10,Yes,10,Yes,"First name, Age, Last name, Boy or girl",10,Yes,10,Yes,10,60.0,Yes,Yes,Yes,No,No,No,No,No,B
166,Study visit 8 (5 years),Male,No,Skipped,Mother,Phone interview,4.95,Sometimes,5,Not yet,0,Not yet,0,Not yet,0,Eat,Sleep,Not yet,0,Not yet,0,5.0,Yes,10,Sometimes,5,Sometimes,5,Sometimes,5,Not yet,0,Not yet,0,25.0,Yes,10,Not yet,0,Sometimes,5,Sometimes,5,Yes,10,Yes,10,40.0,Yes,10,Yes,10,Sometimes,5,,,,,Not yet,0,Sometimes,5,Yes,10,40.0,Yes,10,Yes,10,Sometimes,5,Yes,"First name, Age, Last name, Boy or girl",10,Yes,10,Yes,10,55.0,Yes,No,Yes,No,No,No,Yes,Yes,B
174,Study visit 8 (5 years),Female,Yes,Mother,Skipped,Skipped,4.93,Yes,10,Yes,10,Sometimes,5,Sometimes,5,eat,Go to sleep,Yes,10,Sometimes,5,45.0,Yes,10,Yes,10,Yes,10,Yes,10,Yes,10,Sometimes,5,55.0,Sometimes,5,Yes,10,Yes,10,Yes,10,Yes,10,Yes,10,55.0,Yes,10,Yes,10,Yes,10,little,hot,daytime,down,Yes,10,Yes,10,Yes,10,60.0,Yes,10,Yes,10,Yes,10,Yes,"First name, Age, Last name, Girl, Telephone number",10,Yes,10,Yes,10,60.0,Yes,Yes,Yes,Yes,No,No,Yes,No,B
176,Study visit 8 (5 years),Female,No,Skipped,Mother,In-person,5.44,Not yet,0,Not yet,0,Not yet,0,Not yet,0,,,Not yet,0,Not yet,0,0.0,Not yet,0,Not yet,0,Not yet,0,Not yet,0,Not yet,0,Not yet,0,0.0,Not yet,0,Not yet,0,Not yet,0,Not yet,0,Not yet,0,Not yet,0,0.0,Not yet,0,Not yet,0,Not yet,0,,,,,Not yet,0,Not yet,0,Not yet,0,0.0,Not yet,0,Not yet,0,Not yet,0,Not yet,,0,Not yet,0,Not yet,0,0.0,Yes,No,No,No,No,No,No,No,B
184,Study visit 8 (5 years),Male,Yes,Mother,Skipped,Skipped,5.05,Yes,10,Sometimes,5,Sometimes,5,Sometimes,5,"""Eat'","""Lie down""",Yes,10,Sometimes,5,40.0,Yes,10,Yes,10,Yes,10,Yes,10,Sometimes,5,Sometimes,5,50.0,Not yet,0,Yes,10,Yes,10,Sometimes,5,Yes,10,Sometimes,5,40.0,Yes,10,Yes,10,Yes,10,"""Small""","""hot""","""day""","""down""",Yes,10,Yes,10,Yes,10,60.0,Yes,10,Yes,10,Yes,10,Yes,"First name, Age, City he lives in, Last name, Boy or girl",10,Yes,10,Sometimes,5,55.0,Yes,Yes,Yes,Yes,No,No,No,Yes,B
187,Study visit 8 (5 years),Female,Yes,Mother,Skipped,Skipped,5.02,Not yet,0,Not yet,0,Not yet,0,Not yet,0,,,Not yet,0,Not yet,0,0.0,Not yet,0,Not yet,0,Not yet,0,Not yet,0,Not yet,0,Not yet,0,0.0,Not yet,0,Not yet,0,Not yet,0,Not yet,0,Not yet,0,Not yet,0,0.0,Not yet,0,Not yet,0,Not yet,0,,,,,Not yet,0,Not yet,0,Not yet,0,0.0,Not yet,0,Not yet,0,Not yet,0,Not yet,,0,Not yet,0,Not yet,0,0.0,Yes,No,No,No,No,No,No,No,B
188,Study visit 8 (5 years),Male,No,Skipped,Mother,Phone interview,5.08,Yes,10,Yes,10,Yes,10,Yes,10,,,Yes,10,Sometimes,5,55.0,Yes,10,Yes,10,Yes,10,Yes,10,Yes,10,Yes,10,60.0,Not yet,0,Sometimes,5,Not yet,0,Yes,10,Sometimes,5,Sometimes,5,25.0,Yes,10,Sometimes,5,Sometimes,5,small,hot,day,down,Yes,10,Sometimes,5,Sometimes,5,40.0,Yes,10,Yes,10,Yes,10,Yes,,10,Yes,10,Yes,10,60.0,Yes,Yes,Yes,Yes,No,No,No,No,B
196,Study visit 8 (5 years),Male,No,Skipped,Mother,Phone interview,5.44,Sometimes,5,Yes,10,Yes,10,Yes,10,eat snack,take a nap,Yes,10,Not yet,0,45.0,Yes,10,Yes,10,Yes,10,Yes,10,Yes,10,Yes,10,60.0,Sometimes,5,Yes,10,Yes,10,Yes,10,Sometimes,5,Yes,10,50.0,Yes,10,Yes,10,Yes,10,tiny,hot,day,down,Yes,10,Yes,10,Yes,10,60.0,Yes,10,Yes,10,Yes,10,Yes,,10,Yes,10,Yes,10,60.0,Yes,No,Yes,Yes,No,No,No,No,B
197,Study visit 8 (5 years),Female,Yes,Mother,Skipped,Skipped,4.95,Yes,10,Yes,10,Yes,10,Not yet,0,I eat food,I sleep,Yes,10,Not yet,0,40.0,Yes,10,Yes,10,Yes,10,Yes,10,Sometimes,5,Not yet,0,45.0,Yes,10,Yes,10,Yes,10,Not yet,0,Sometimes,5,Yes,10,45.0,Yes,10,Yes,10,Sometimes,5,small,hot,daytime,down,Yes,10,Sometimes,5,Sometimes,5,45.0,Yes,10,Yes,10,Yes,10,Yes,"First name, Age, City he lives in, Last name, Girl",10,Yes,10,Yes,10,60.0,Yes,Yes,Yes,Yes,No,No,No,No,B
203,Study visit 8 (5 years),Male,Yes,Mother,Skipped,Skipped,5.3,Sometimes,5,Not yet,0,Not yet,0,Sometimes,5,can not confuse you not know that I speak,,Not yet,0,Not yet,0,10.0,Not yet,0,Sometimes,5,Sometimes,5,Sometimes,5,Sometimes,5,Yes,10,30.0,Not yet,0,Not yet,0,Not yet,0,Not yet,0,Not yet,0,Not yet,0,0.0,Yes,10,Yes,10,Yes,10,,,,,Not yet,0,Yes,10,Yes,10,50.0,Sometimes,5,Not yet,0,Yes,10,Not yet,"First name, Age, Last name, Boy or girl",0,Sometimes,5,Sometimes,5,25.0,No,No,No,No,No,No,No,Yes,B