blind_id,visit,PATIENT_AGE_ECHO12L,PRERHYTH,PACED,PACEDOTH,PRERHYTHSPEC,SINUS,JUNCTION,OTHERRHYTH,OTHERRHYTHSP,ATRECTOPY,ATRISOLATED,ATRCOUPLET,ATRNSTACHY,NSTACHYTYPE,ATRSTACHY,STACHYTYPE,VECTOPY,VISOLATED,VCOUPLET,VNSTACHY,VSTACHY,VRATE,PRINTRVL,QRSDURTN,QTINTRVL,QTCINTRV,PAXIS,RAXIS,TAXIS,RBBB,LBBB,RAE,LAE,RVH,LVH,NSVH,STSTRAIN,STSTRAININF,STSTRAINANT,STSTRAINLAT,STISCHEM,STISCHEMINF,STISCHEMANT,STISCHEMLAT,TWAVEINV,TWAVEINVINF,TWAVEINVANT,TWAVEINVLAT,NSPECSTT,VER_ID
2,Study visit 9 (age 6 years),5.79,NORMAL SINUS RHYTHM,Skipped,,,No,No,No,,No,Skipped,Skipped,Skipped,Skipped,Skipped,Skipped,No,Skipped,Skipped,Skipped,Skipped,84,120,104,360,420,45,200,120,No,No,No,No,Yes,No,No,Yes,Yes,No,No,No,Skipped,Skipped,Skipped,No,Skipped,Skipped,Skipped,Yes,UNKNOWN
2,Study visit 66 (stage III (FONTAN)),2.61,NORMAL SINUS RHYTHM,Skipped,,,No,No,No,,No,Skipped,Skipped,Skipped,Skipped,Skipped,Skipped,No,Skipped,Skipped,Skipped,Skipped,89,106,92,364,443,23,255,84,No,No,No,No,Yes,No,No,No,Skipped,Skipped,Skipped,No,Skipped,Skipped,Skipped,No,Skipped,Skipped,Skipped,No,B
4,Study visit 9 (age 6 years),5.92,NORMAL SINUS RHYTHM,Skipped,,,No,No,No,,No,Skipped,Skipped,Skipped,Skipped,Skipped,Skipped,No,Skipped,Skipped,Skipped,Skipped,120,115,105,313,418,8,113,5,No,No,No,No,Yes,No,No,No,Skipped,Skipped,Skipped,No,Skipped,Skipped,Skipped,No,Skipped,Skipped,Skipped,No,UNKNOWN
4,Study visit 66 (stage III (FONTAN)),2.66,NORMAL SINUS RHYTHM,Skipped,,,No,No,No,,No,Skipped,Skipped,Skipped,Skipped,Skipped,Skipped,No,Skipped,Skipped,Skipped,Skipped,85,142,116,338,402,33,166,38,Yes,No,No,No,Yes,No,No,Yes,Yes,No,No,No,Skipped,Skipped,Skipped,No,Skipped,Skipped,Skipped,No,B
5,Study visit 9 (age 6 years),5.58,NORMAL SINUS RHYTHM,Skipped,,,No,No,No,,No,Skipped,Skipped,Skipped,Skipped,Skipped,Skipped,No,Skipped,Skipped,Skipped,Skipped,102,156,160,388,505,15,179,-12,Yes,No,No,No,Yes,No,No,No,Skipped,Skipped,Skipped,No,Skipped,Skipped,Skipped,No,Skipped,Skipped,Skipped,No,C
5,Study visit 66 (stage III (FONTAN)),2.36,NORMAL SINUS RHYTHM,Skipped,,,No,No,No,,No,Skipped,Skipped,Skipped,Skipped,Skipped,Skipped,No,Skipped,Skipped,Skipped,Skipped,121,136,68,298,423,50,163,65,No,No,Yes,Yes,Yes,No,No,Yes,No,Yes,No,No,Skipped,Skipped,Skipped,No,Skipped,Skipped,Skipped,No,B
6,Study visit 9 (age 6 years),6.61,NORMAL SINUS RHYTHM,Skipped,,,No,No,No,,No,Skipped,Skipped,Skipped,Skipped,Skipped,Skipped,No,Skipped,Skipped,Skipped,Skipped,121,132,90,322,457,6,87,25,No,No,No,No,Yes,No,No,No,Skipped,Skipped,Skipped,No,Skipped,Skipped,Skipped,No,Skipped,Skipped,Skipped,Yes,C
6,Study visit 66 (stage III (FONTAN)),1.64,NORMAL SINUS RHYTHM,Skipped,,,No,No,No,,No,Skipped,Skipped,Skipped,Skipped,Skipped,Skipped,No,Skipped,Skipped,Skipped,Skipped,95,124,88,358,447,0,97,-58,No,No,No,No,Yes,No,No,No,Skipped,Skipped,Skipped,Yes,Yes,No,Yes,Yes,Yes,Yes,Yes,No,B
7,Study visit 66 (stage III (FONTAN)),2.78,NORMAL SINUS RHYTHM,Skipped,,,No,No,No,,No,Skipped,Skipped,Skipped,Skipped,Skipped,Skipped,No,Skipped,Skipped,Skipped,Skipped,107,82,81,333,445,86,89,85,No,No,No,No,Yes,No,No,No,Skipped,Skipped,Skipped,No,Skipped,Skipped,Skipped,No,Skipped,Skipped,Skipped,No,B
9,Study visit 9 (age 6 years),6.35,NORMAL SINUS RHYTHM,Skipped,,,No,No,No,,No,Skipped,Skipped,Skipped,Skipped,Skipped,Skipped,No,Skipped,Skipped,Skipped,Skipped,85,192,114,388,461,24,95,79,Yes,No,No,No,No,No,No,No,Skipped,Skipped,Skipped,No,Skipped,Skipped,Skipped,No,Skipped,Skipped,Skipped,No,UNKNOWN
9,Study visit 66 (stage III (FONTAN)),2.75,NORMAL SINUS RHYTHM,Skipped,,,No,No,No,,No,Skipped,Skipped,Skipped,Skipped,Skipped,Skipped,No,Skipped,Skipped,Skipped,Skipped,113,156,106,324,445,17,106,46,No,No,Yes,Yes,Yes,No,No,No,Skipped,Skipped,Skipped,No,Skipped,Skipped,Skipped,No,Skipped,Skipped,Skipped,Yes,B
12,Study visit 66 (stage III (FONTAN)),6.55,OTHER,Skipped,,atrial paced,No,No,Yes,sinus,No,Skipped,Skipped,Skipped,Skipped,Skipped,Skipped,No,Skipped,Skipped,Skipped,Skipped,126,144,100,320,469,67,86,105,No,No,Yes,No,Yes,No,No,No,Skipped,Skipped,Skipped,No,Skipped,Skipped,Skipped,Yes,No,Yes,No,No,UNKNOWN
23,Study visit 9 (age 6 years),5.79,NORMAL SINUS RHYTHM,Skipped,,,No,No,No,,No,Skipped,Skipped,Skipped,Skipped,Skipped,Skipped,No,Skipped,Skipped,Skipped,Skipped,101,84,96,350,453,45,128,94,No,No,No,No,Yes,No,No,No,Skipped,Skipped,Skipped,No,Skipped,Skipped,Skipped,No,Skipped,Skipped,Skipped,Yes,C
23,Study visit 66 (stage III (FONTAN)),3.82,NORMAL SINUS RHYTHM,Skipped,,,No,No,No,,No,Skipped,Skipped,Skipped,Skipped,Skipped,Skipped,No,Skipped,Skipped,Skipped,Skipped,107,106,98,348,464,53,176,43,No,No,No,No,Yes,No,No,No,Skipped,Skipped,Skipped,No,Skipped,Skipped,Skipped,No,Skipped,Skipped,Skipped,No,B
26,Study visit 9 (age 6 years),5.97,SINUS BRADYCARDIA,Skipped,,,No,No,No,,No,Skipped,Skipped,Skipped,Skipped,Skipped,Skipped,No,Skipped,Skipped,Skipped,Skipped,59,120,96,434,429,43,74,110,No,No,No,No,Yes,No,No,No,Skipped,Skipped,Skipped,No,Skipped,Skipped,Skipped,No,Skipped,Skipped,Skipped,Yes,C
26,Study visit 66 (stage III (FONTAN)),2.23,NORMAL SINUS RHYTHM,Skipped,,,No,No,No,,No,Skipped,Skipped,Skipped,Skipped,Skipped,Skipped,No,Skipped,Skipped,Skipped,Skipped,153,136,86,278,443,,248,54,No,No,No,No,Yes,No,No,No,Skipped,Skipped,Skipped,No,Skipped,Skipped,Skipped,No,Skipped,Skipped,Skipped,No,B
32,Study visit 9 (age 6 years),5.71,NORMAL SINUS RHYTHM,Skipped,,,No,No,No,,No,Skipped,Skipped,Skipped,Skipped,Skipped,Skipped,No,Skipped,Skipped,Skipped,Skipped,100,110,80,340,440,45,150,75,No,No,No,No,Yes,No,No,No,Skipped,Skipped,Skipped,Yes,No,Yes,No,Yes,No,Yes,No,No,UNKNOWN
32,Study visit 66 (stage III (FONTAN)),2.26,OTHER,Skipped,,Low atrial rhythm,No,No,No,,No,Skipped,Skipped,Skipped,Skipped,Skipped,Skipped,No,Skipped,Skipped,Skipped,Skipped,100,120,80,300,410,0,-60,80,No,No,No,No,Yes,No,No,Yes,No,Yes,No,Yes,No,Yes,No,Yes,No,Yes,No,No,B
36,Study visit 66 (stage III (FONTAN)),2.76,NORMAL SINUS RHYTHM,Skipped,,,No,No,No,,No,Skipped,Skipped,Skipped,Skipped,Skipped,Skipped,No,Skipped,Skipped,Skipped,Skipped,104,100,80,360,425,45,65,100,No,No,Yes,Yes,Yes,No,No,No,Skipped,Skipped,Skipped,No,Skipped,Skipped,Skipped,Yes,No,Yes,No,Yes,B
37,Study visit 9 (age 6 years),5.33,NORMAL SINUS RHYTHM,Skipped,,,No,No,No,,No,Skipped,Skipped,Skipped,Skipped,Skipped,Skipped,No,Skipped,Skipped,Skipped,Skipped,80,140,96,368,425,36,95,71,No,No,No,No,Yes,No,No,No,Skipped,Skipped,Skipped,No,Skipped,Skipped,Skipped,No,Skipped,Skipped,Skipped,No,C
37,Study visit 66 (stage III (FONTAN)),5.33,NORMAL SINUS RHYTHM,Skipped,,,No,No,No,,No,Skipped,Skipped,Skipped,Skipped,Skipped,Skipped,No,Skipped,Skipped,Skipped,Skipped,80,140,96,368,425,36,95,71,No,No,No,No,Yes,No,No,No,Skipped,Skipped,Skipped,No,Skipped,Skipped,Skipped,No,Skipped,Skipped,Skipped,No,C
38,Study visit 9 (age 6 years),6.43,NORMAL SINUS RHYTHM,Skipped,,,No,No,No,,No,Skipped,Skipped,Skipped,Skipped,Skipped,Skipped,No,Skipped,Skipped,Skipped,Skipped,94,138,108,370,462,32,244,55,Yes,No,No,No,No,No,No,No,Skipped,Skipped,Skipped,No,Skipped,Skipped,Skipped,No,Skipped,Skipped,Skipped,No,C
38,Study visit 66 (stage III (FONTAN)),3.94,NORMAL SINUS RHYTHM,Skipped,,,No,No,No,,No,Skipped,Skipped,Skipped,Skipped,Skipped,Skipped,No,Skipped,Skipped,Skipped,Skipped,89,134,100,356,433,14,251,61,Yes,No,No,No,No,No,No,No,Skipped,Skipped,Skipped,No,Skipped,Skipped,Skipped,No,Skipped,Skipped,Skipped,No,B
39,Study visit 9 (age 6 years),5.62,ATRIAL ESCAPE,Skipped,,,No,No,No,,No,Skipped,Skipped,Skipped,Skipped,Skipped,Skipped,No,Skipped,Skipped,Skipped,Skipped,69,122,116,460,492,-11,90,67,No,No,No,No,Yes,No,No,No,Skipped,Skipped,Skipped,No,Skipped,Skipped,Skipped,No,Skipped,Skipped,Skipped,Yes,C
39,Study visit 66 (stage III (FONTAN)),3.53,NORMAL SINUS RHYTHM,Skipped,,,No,No,No,,No,Skipped,Skipped,Skipped,Skipped,Skipped,Skipped,No,Skipped,Skipped,Skipped,Skipped,89,114,118,386,469,72,97,-70,Yes,No,Yes,No,Yes,No,No,No,Skipped,Skipped,Skipped,No,Skipped,Skipped,Skipped,No,Skipped,Skipped,Skipped,Yes,B
40,Study visit 9 (age 6 years),6.37,NORMAL SINUS RHYTHM,Skipped,,,No,No,Yes,FIRST DEGREE AV BLOCK,No,Skipped,Skipped,Skipped,Skipped,Skipped,Skipped,No,Skipped,Skipped,Skipped,Skipped,79,198,126,388,444,-9,-73,95,Yes,No,No,No,Yes,No,No,No,Skipped,Skipped,Skipped,No,Skipped,Skipped,Skipped,No,Skipped,Skipped,Skipped,No,C
40,Study visit 66 (stage III (FONTAN)),4.25,NORMAL SINUS RHYTHM,Skipped,,,No,No,No,,No,Skipped,Skipped,Skipped,Skipped,Skipped,Skipped,No,Skipped,Skipped,Skipped,Skipped,89,120,118,320,388,74,157,73,No,No,No,No,Yes,No,No,Yes,No,Yes,No,No,Skipped,Skipped,Skipped,No,Skipped,Skipped,Skipped,No,B
46,Study visit 9 (age 6 years),6.05,PACED,DDD,,,No,No,Missing,,No,Skipped,Skipped,Skipped,Skipped,Skipped,Skipped,No,Skipped,Skipped,Skipped,Skipped,70,210,186,484,522,60,-80,93,Yes,No,No,No,No,No,No,No,Skipped,Skipped,Skipped,No,Skipped,Skipped,Skipped,No,Skipped,Skipped,Skipped,No,UNKNOWN
50,Study visit 66 (stage III (FONTAN)),2.99,NORMAL SINUS RHYTHM,Skipped,,,No,No,No,,No,Skipped,Skipped,Skipped,Skipped,Skipped,Skipped,No,Skipped,Skipped,Skipped,Skipped,117,83,90,336,496,52,98,60,No,No,Yes,No,Yes,No,No,No,Skipped,Skipped,Skipped,No,Skipped,Skipped,Skipped,No,Skipped,Skipped,Skipped,Yes,B
51,Study visit 9 (age 6 years),6.05,NORMAL SINUS RHYTHM,Skipped,,,No,No,No,,No,Skipped,Skipped,Skipped,Skipped,Skipped,Skipped,No,Skipped,Skipped,Skipped,Skipped,73,120,78,388,428,54,105,85,No,No,No,No,Yes,No,No,No,Skipped,Skipped,Skipped,No,Skipped,Skipped,Skipped,No,Skipped,Skipped,Skipped,No,B
51,Study visit 66 (stage III (FONTAN)),2.85,NORMAL SINUS RHYTHM,Skipped,,,No,No,No,,No,Skipped,Skipped,Skipped,Skipped,Skipped,Skipped,No,Skipped,Skipped,Skipped,Skipped,83,144,82,416,463,46,123,91,No,No,No,No,Yes,No,No,No,Skipped,Skipped,Skipped,No,Skipped,Skipped,Skipped,No,Skipped,Skipped,Skipped,No,B
52,Study visit 9 (age 6 years),5.63,NORMAL SINUS RHYTHM,Skipped,,,Yes,No,No,,No,Skipped,Skipped,Skipped,Skipped,Skipped,Skipped,No,Skipped,Skipped,Skipped,Skipped,71,134,118,392,411,82,135,60,No,No,No,No,Yes,No,No,No,Skipped,Skipped,Skipped,No,Skipped,Skipped,Skipped,No,Skipped,Skipped,Skipped,No,C
52,Study visit 66 (stage III (FONTAN)),2.31,NORMAL SINUS RHYTHM,Skipped,,,No,No,No,,No,Skipped,Skipped,Skipped,Skipped,Skipped,Skipped,No,Skipped,Skipped,Skipped,Skipped,103,126,110,316,413,70,146,30,Yes,No,No,No,Yes,No,No,No,Skipped,Skipped,Skipped,Yes,Yes,Yes,No,Yes,No,Yes,No,No,B
54,Study visit 9 (age 6 years),5.98,NORMAL SINUS RHYTHM,Skipped,,,No,No,No,,No,Skipped,Skipped,Skipped,Skipped,Skipped,Skipped,No,Skipped,Skipped,Skipped,Skipped,96,172,114,346,437,52,160,61,No,No,No,No,Yes,No,No,No,Skipped,Skipped,Skipped,No,Skipped,Skipped,Skipped,No,Skipped,Skipped,Skipped,Yes,C
54,Study visit 66 (stage III (FONTAN)),1.95,NORMAL SINUS RHYTHM,Skipped,,,No,No,No,,No,Skipped,Skipped,Skipped,Skipped,Skipped,Skipped,No,Skipped,Skipped,Skipped,Skipped,139,124,78,298,454,85,105,97,No,No,Yes,Yes,Yes,No,No,No,Skipped,Skipped,Skipped,No,Skipped,Skipped,Skipped,No,Skipped,Skipped,Skipped,No,B
58,Study visit 9 (age 6 years),6.61,SINUS BRADYCARDIA,Skipped,,,No,No,No,,No,Skipped,Skipped,Skipped,Skipped,Skipped,Skipped,No,Skipped,Skipped,Skipped,Skipped,51,98,106,454,418,65,65,69,No,No,No,No,Yes,No,No,No,Skipped,Skipped,Skipped,No,Skipped,Skipped,Skipped,No,Skipped,Skipped,Skipped,No,C
58,Study visit 66 (stage III (FONTAN)),2,NORMAL SINUS RHYTHM,Skipped,,,No,No,No,,No,Skipped,Skipped,Skipped,Skipped,Skipped,Skipped,No,Skipped,Skipped,Skipped,Skipped,80,102,94,398,459,29,44,62,No,No,No,No,Yes,No,No,No,Skipped,Skipped,Skipped,No,Skipped,Skipped,Skipped,No,Skipped,Skipped,Skipped,Yes,B
61,Study visit 9 (age 6 years),5.98,NORMAL SINUS RHYTHM,Skipped,,,Yes,No,No,,No,Skipped,Skipped,Skipped,Skipped,Skipped,Skipped,No,Skipped,Skipped,Skipped,Skipped,61,120,80,360,367,-90,174,95,No,No,No,No,Yes,No,No,No,Skipped,Skipped,Skipped,No,Skipped,Skipped,Skipped,No,Skipped,Skipped,Skipped,No,UNKNOWN
61,Study visit 66 (stage III (FONTAN)),3.03,NORMAL SINUS RHYTHM,Skipped,,,Yes,No,No,,No,Skipped,Skipped,Skipped,Skipped,Skipped,Skipped,No,Skipped,Skipped,Skipped,Skipped,96,130,60,300,395,30,190,70,No,No,No,No,Yes,No,No,No,Skipped,Skipped,Skipped,No,Skipped,Skipped,Skipped,Yes,No,Yes,No,No,B
62,Study visit 9 (age 6 years),6.17,NORMAL SINUS RHYTHM,Skipped,,,No,No,No,,No,Skipped,Skipped,Skipped,Skipped,Skipped,Skipped,No,Skipped,Skipped,Skipped,Skipped,61,108,102,420,422,75,114,101,No,No,No,No,Yes,No,No,No,Skipped,Skipped,Skipped,Yes,Yes,Yes,No,Yes,No,Yes,No,Yes,UNKNOWN
62,Study visit 66 (stage III (FONTAN)),2.8,NORMAL SINUS RHYTHM,Skipped,,,No,No,No,,No,Skipped,Skipped,Skipped,Skipped,Skipped,Skipped,No,Skipped,Skipped,Skipped,Skipped,115,100,92,310,429,53,110,27,No,No,Yes,No,Yes,No,No,No,Skipped,Skipped,Skipped,No,Skipped,Skipped,Skipped,No,Skipped,Skipped,Skipped,Yes,B
63,Study visit 9 (age 6 years),5.74,NORMAL SINUS RHYTHM,Skipped,,,No,No,No,,No,Skipped,Skipped,Skipped,Skipped,Skipped,Skipped,No,Skipped,Skipped,Skipped,Skipped,121,190,91,306,434,31,103,56,No,No,No,No,Yes,No,No,No,Skipped,Skipped,Skipped,Yes,No,Yes,No,No,Skipped,Skipped,Skipped,No,C
63,Study visit 66 (stage III (FONTAN)),0.98,NORMAL SINUS RHYTHM,Skipped,,,No,No,No,,No,Skipped,Skipped,Skipped,Skipped,Skipped,Skipped,No,Skipped,Skipped,Skipped,Skipped,115,154,86,312,409,46,-23,79,No,No,Yes,No,Yes,No,No,No,Skipped,Skipped,Skipped,No,Skipped,Skipped,Skipped,No,Skipped,Skipped,Skipped,No,B
69,Study visit 9 (age 6 years),6.52,NORMAL SINUS RHYTHM,Skipped,,,No,No,No,,No,Skipped,Skipped,Skipped,Skipped,Skipped,Skipped,No,Skipped,Skipped,Skipped,Skipped,138,128,104,328,497,48,158,22,No,No,No,No,Yes,No,No,No,Skipped,Skipped,Skipped,No,Skipped,Skipped,Skipped,No,Skipped,Skipped,Skipped,No,C
69,Study visit 66 (stage III (FONTAN)),3.22,NORMAL SINUS RHYTHM,Skipped,,,No,No,No,,No,Skipped,Skipped,Skipped,Skipped,Skipped,Skipped,No,Skipped,Skipped,Skipped,Skipped,128,130,100,306,446,22,158,65,No,No,No,No,Yes,No,No,No,Skipped,Skipped,Skipped,No,Skipped,Skipped,Skipped,No,Skipped,Skipped,Skipped,No,B
74,Study visit 9 (age 6 years),5.98,OTHER,Skipped,,Atrial rhythm,No,No,No,,No,Skipped,Skipped,Skipped,Skipped,Skipped,Skipped,No,Skipped,Skipped,Skipped,Skipped,75,104,102,372,415,-22,51,57,No,No,No,No,Yes,No,No,No,Skipped,Skipped,Skipped,No,Skipped,Skipped,Skipped,No,Skipped,Skipped,Skipped,No,C
74,Study visit 66 (stage III (FONTAN)),2.38,NORMAL SINUS RHYTHM,Skipped,,,No,No,No,,No,Skipped,Skipped,Skipped,Skipped,Skipped,Skipped,No,Skipped,Skipped,Skipped,Skipped,132,120,88,282,417,67,54,67,No,No,Yes,No,Yes,No,No,No,Skipped,Skipped,Skipped,No,Skipped,Skipped,Skipped,No,Skipped,Skipped,Skipped,No,B
77,Study visit 9 (age 6 years),5.63,NORMAL SINUS RHYTHM,Skipped,,,No,No,No,,No,Skipped,Skipped,Skipped,Skipped,Skipped,Skipped,No,Skipped,Skipped,Skipped,Skipped,83,110,82,338,397,41,95,81,No,No,No,No,Yes,No,No,No,Skipped,Skipped,Skipped,No,Skipped,Skipped,Skipped,No,Skipped,Skipped,Skipped,No,C
77,Study visit 66 (stage III (FONTAN)),2.83,NORMAL SINUS RHYTHM,Skipped,,,No,No,No,,No,Skipped,Skipped,Skipped,Skipped,Skipped,Skipped,No,Skipped,Skipped,Skipped,Skipped,102,110,88,306,398,41,109,53,No,No,No,No,Yes,No,No,No,Skipped,Skipped,Skipped,No,Skipped,Skipped,Skipped,No,Skipped,Skipped,Skipped,No,B
78,Study visit 9 (age 6 years),6.78,NORMAL SINUS RHYTHM,Skipped,,,No,No,No,,No,Skipped,Skipped,Skipped,Skipped,Skipped,Skipped,No,Skipped,Skipped,Skipped,Skipped,82,106,84,344,402,61,-108,101,No,No,No,No,Yes,No,No,No,Skipped,Skipped,Skipped,No,Skipped,Skipped,Skipped,No,Skipped,Skipped,Skipped,Yes,C
78,Study visit 66 (stage III (FONTAN)),3.04,NORMAL SINUS RHYTHM,Skipped,,,No,No,No,,No,Skipped,Skipped,Skipped,Skipped,Skipped,Skipped,No,Skipped,Skipped,Skipped,Skipped,108,88,78,322,435,62,105,82,No,No,No,No,Yes,No,No,No,Skipped,Skipped,Skipped,No,Skipped,Skipped,Skipped,No,Skipped,Skipped,Skipped,No,B
83,Study visit 9 (age 6 years),5.9,NORMAL SINUS RHYTHM,Skipped,,,No,No,No,,No,Skipped,Skipped,Skipped,Skipped,Skipped,Skipped,No,Skipped,Skipped,Skipped,Skipped,100,164,104,366,472,12,89,42,No,No,No,No,Yes,No,No,No,Skipped,Skipped,Skipped,No,Skipped,Skipped,Skipped,No,Skipped,Skipped,Skipped,Yes,C
83,Study visit 66 (stage III (FONTAN)),3.06,NORMAL SINUS RHYTHM,Skipped,,,No,No,No,,No,Skipped,Skipped,Skipped,Skipped,Skipped,Skipped,No,Skipped,Skipped,Skipped,Skipped,132,160,96,298,442,48,103,25,No,No,Yes,No,Yes,No,Yes,Yes,Yes,Yes,No,Yes,Yes,Yes,No,Yes,No,Yes,No,Yes,B
87,Study visit 9 (age 6 years),6.41,NORMAL SINUS RHYTHM,Skipped,,,No,No,No,,No,Skipped,Skipped,Skipped,Skipped,Skipped,Skipped,No,Skipped,Skipped,Skipped,Skipped,119,150,78,318,447,58,133,47,No,No,No,Yes,Yes,No,No,No,Skipped,Skipped,Skipped,No,Skipped,Skipped,Skipped,No,Skipped,Skipped,Skipped,Yes,C
87,Study visit 66 (stage III (FONTAN)),2.64,NORMAL SINUS RHYTHM,Skipped,,,No,No,No,,No,Skipped,Skipped,Skipped,Skipped,Skipped,Skipped,No,Skipped,Skipped,Skipped,Skipped,135,146,78,282,423,53,103,-7,No,No,No,No,Yes,No,No,No,Skipped,Skipped,Skipped,No,Skipped,Skipped,Skipped,No,Skipped,Skipped,Skipped,Yes,B
91,Study visit 9 (age 6 years),6.05,NORMAL SINUS RHYTHM,Skipped,,,No,No,No,,No,Skipped,Skipped,Skipped,Skipped,Skipped,Skipped,No,Skipped,Skipped,Skipped,Skipped,73,125,100,440,494,16,95,12,No,No,No,No,Yes,No,No,No,Skipped,Skipped,Skipped,Yes,No,Yes,No,No,Skipped,Skipped,Skipped,No,C
91,Study visit 66 (stage III (FONTAN)),3.18,NORMAL SINUS RHYTHM,Skipped,,,No,No,No,,No,Skipped,Skipped,Skipped,Skipped,Skipped,Skipped,No,Skipped,Skipped,Skipped,Skipped,96,130,90,330,425,45,90,-30,No,No,Yes,No,Yes,No,No,Yes,No,Yes,No,Yes,Yes,No,Yes,Yes,No,No,No,Yes,B
92,Study visit 9 (age 6 years),5.65,NORMAL SINUS RHYTHM,Skipped,,,No,No,No,,No,Skipped,Skipped,Skipped,Skipped,Skipped,Skipped,No,Skipped,Skipped,Skipped,Skipped,63,130,86,404,414,12,38,108,No,No,No,No,Yes,No,Yes,No,Skipped,Skipped,Skipped,No,Skipped,Skipped,Skipped,No,Skipped,Skipped,Skipped,Yes,C
92,Study visit 66 (stage III (FONTAN)),2.43,NORMAL SINUS RHYTHM,Skipped,,,No,No,No,,No,Skipped,Skipped,Skipped,Skipped,Skipped,Skipped,No,Skipped,Skipped,Skipped,Skipped,143,110,80,298,460,68,36,133,No,No,No,No,Yes,No,No,No,Skipped,Skipped,Skipped,No,Skipped,Skipped,Skipped,No,Skipped,Skipped,Skipped,Yes,B
95,Study visit 9 (age 6 years),5.92,NORMAL SINUS RHYTHM,Skipped,,,Yes,No,No,,No,Skipped,Skipped,Skipped,Skipped,Skipped,Skipped,No,Skipped,Skipped,Skipped,Skipped,74,134,104,390,432,62,266,94,No,No,No,No,Yes,No,No,No,Skipped,Skipped,Skipped,No,Skipped,Skipped,Skipped,No,Skipped,Skipped,Skipped,Yes,C
95,Study visit 66 (stage III (FONTAN)),4.9,NORMAL SINUS RHYTHM,Skipped,,,No,No,No,,No,Skipped,Skipped,Skipped,Skipped,Skipped,Skipped,No,Skipped,Skipped,Skipped,Skipped,98,128,98,342,436,55,257,88,No,No,No,Yes,Yes,No,No,No,Skipped,Skipped,Skipped,No,Skipped,Skipped,Skipped,No,Skipped,Skipped,Skipped,No,B
101,Study visit 9 (age 6 years),5.63,NORMAL SINUS RHYTHM,Skipped,,,No,No,No,,No,Skipped,Skipped,Skipped,Skipped,Skipped,Skipped,No,Skipped,Skipped,Skipped,Skipped,163,112,90,250,411,89,87,114,No,No,No,No,Yes,No,No,No,Skipped,Skipped,Skipped,Yes,No,Yes,Yes,Yes,Yes,Yes,Yes,No,UNKNOWN
101,Study visit 66 (stage III (FONTAN)),2.57,NORMAL SINUS RHYTHM,Skipped,,,No,No,No,,No,Skipped,Skipped,Skipped,Skipped,Skipped,Skipped,No,Skipped,Skipped,Skipped,Skipped,113,104,102,314,430,74,86,49,No,No,Yes,No,No,No,No,No,Skipped,Skipped,Skipped,No,Skipped,Skipped,Skipped,No,Skipped,Skipped,Skipped,No,B
104,Study visit 9 (age 6 years),5.66,NORMAL SINUS RHYTHM,Skipped,,,Yes,No,No,,No,Skipped,Skipped,Skipped,Skipped,Skipped,Skipped,No,Skipped,Skipped,Skipped,Skipped,58,246,75,427,419,46,-54,60,No,No,No,Yes,Yes,Yes,No,No,Skipped,Skipped,Skipped,No,Skipped,Skipped,Skipped,No,Skipped,Skipped,Skipped,No,C
104,Study visit 66 (stage III (FONTAN)),2.7,NORMAL SINUS RHYTHM,Skipped,,,No,No,No,,No,Skipped,Skipped,Skipped,Skipped,Skipped,Skipped,No,Skipped,Skipped,Skipped,Skipped,,193,,,,,,,No,No,Yes,Yes,Yes,No,No,No,Skipped,Skipped,Skipped,No,Skipped,Skipped,Skipped,No,Skipped,Skipped,Skipped,No,B
106,Study visit 9 (age 6 years),5.76,JUNCTIONAL ESCAPE,Skipped,,,Yes,No,No,,No,Skipped,Skipped,Skipped,Skipped,Skipped,Skipped,No,Skipped,Skipped,Skipped,Skipped,94,110,100,306,383,82,100,-82,No,No,No,No,Yes,No,No,No,Skipped,Skipped,Skipped,No,Skipped,Skipped,Skipped,No,Skipped,Skipped,Skipped,No,UNKNOWN
106,Study visit 66 (stage III (FONTAN)),1.72,NORMAL SINUS RHYTHM,Skipped,,,No,No,No,,No,Skipped,Skipped,Skipped,Skipped,Skipped,Skipped,No,Skipped,Skipped,Skipped,Skipped,107,142,80,320,429,37,102,71,No,No,Yes,No,Yes,No,No,No,Skipped,Skipped,Skipped,No,Skipped,Skipped,Skipped,No,Skipped,Skipped,Skipped,No,B
109,Study visit 9 (age 6 years),6.01,SINUS BRADYCARDIA,Skipped,,,Yes,No,No,,No,Skipped,Skipped,Skipped,Skipped,Skipped,Skipped,No,Skipped,Skipped,Skipped,Skipped,64,154,134,450,464,28,113,93,Yes,No,No,No,No,No,No,No,Skipped,Skipped,Skipped,No,Skipped,Skipped,Skipped,No,Skipped,Skipped,Skipped,No,C
109,Study visit 66 (stage III (FONTAN)),3.65,NORMAL SINUS RHYTHM,Skipped,,,Yes,No,No,,No,Skipped,Skipped,Skipped,Skipped,Skipped,Skipped,No,Skipped,Skipped,Skipped,Skipped,53,176,138,486,456,17,107,84,Yes,No,No,No,Yes,No,No,No,Skipped,Skipped,Skipped,No,Skipped,Skipped,Skipped,No,Skipped,Skipped,Skipped,No,B
112,Study visit 66 (stage III (FONTAN)),2.88,NORMAL SINUS RHYTHM,Skipped,,,No,No,No,,No,Skipped,Skipped,Skipped,Skipped,Skipped,Skipped,No,Skipped,Skipped,Skipped,Skipped,96,144,104,368,464,37,118,48,No,No,No,No,Yes,No,No,No,Skipped,Skipped,Skipped,No,Skipped,Skipped,Skipped,No,Skipped,Skipped,Skipped,No,B
113,Study visit 9 (age 6 years),5.68,NORMAL SINUS RHYTHM,Skipped,,,No,No,No,,No,Skipped,Skipped,Skipped,Skipped,Skipped,Skipped,No,Skipped,Skipped,Skipped,Skipped,61,132,92,436,438,0,139,81,No,No,No,No,Yes,No,No,No,Skipped,Skipped,Skipped,No,Skipped,Skipped,Skipped,No,Skipped,Skipped,Skipped,Yes,C
113,Study visit 66 (stage III (FONTAN)),2.23,NORMAL SINUS RHYTHM,Skipped,,,No,No,No,,No,Skipped,Skipped,Skipped,Skipped,Skipped,Skipped,No,Skipped,Skipped,Skipped,Skipped,95,156,82,331,416,35,119,57,No,No,No,No,Yes,No,No,No,Skipped,Skipped,Skipped,No,Skipped,Skipped,Skipped,No,Skipped,Skipped,Skipped,No,B
114,Study visit 9 (age 6 years),5.75,NORMAL SINUS RHYTHM,Skipped,,,No,No,No,,No,Skipped,Skipped,Skipped,Skipped,Skipped,Skipped,No,Skipped,Skipped,Skipped,Skipped,70,120,90,380,420,60,90,90,No,No,No,No,No,No,No,No,Skipped,Skipped,Skipped,No,Skipped,Skipped,Skipped,Yes,No,Yes,No,No,C
114,Study visit 66 (stage III (FONTAN)),3.47,NORMAL SINUS RHYTHM,Skipped,,,No,No,No,,No,Skipped,Skipped,Skipped,Skipped,Skipped,Skipped,No,Skipped,Skipped,Skipped,Skipped,100,120,90,340,425,45,100,100,No,No,Yes,No,Yes,No,No,No,Skipped,Skipped,Skipped,No,Skipped,Skipped,Skipped,Yes,No,Yes,No,No,B
115,Study visit 9 (age 6 years),5.68,NORMAL SINUS RHYTHM,Skipped,,,No,No,No,,No,Skipped,Skipped,Skipped,Skipped,Skipped,Skipped,No,Skipped,Skipped,Skipped,Skipped,142,100,94,300,450,50,125,-30,No,No,No,No,Yes,No,No,No,Skipped,Skipped,Skipped,No,Skipped,Skipped,Skipped,Yes,No,Yes,No,No,UNKNOWN
115,Study visit 66 (stage III (FONTAN)),4.38,NORMAL SINUS RHYTHM,Skipped,,,No,No,No,,No,Skipped,Skipped,Skipped,Skipped,Skipped,Skipped,No,Skipped,Skipped,Skipped,Skipped,115,100,90,300,430,45,150,45,No,No,Yes,No,Yes,No,No,Yes,No,Yes,No,No,Skipped,Skipped,Skipped,Yes,No,Yes,No,No,B
127,Study visit 9 (age 6 years),5.22,NORMAL SINUS RHYTHM,Skipped,,,No,No,No,,No,Skipped,Skipped,Skipped,Skipped,Skipped,Skipped,No,Skipped,Skipped,Skipped,Skipped,83,178,90,376,441,20,-175,63,No,No,No,No,Yes,No,No,No,Skipped,Skipped,Skipped,No,Skipped,Skipped,Skipped,No,Skipped,Skipped,Skipped,No,C
127,Study visit 66 (stage III (FONTAN)),2.46,NORMAL SINUS RHYTHM,Skipped,,,No,No,No,,No,Skipped,Skipped,Skipped,Skipped,Skipped,Skipped,No,Skipped,Skipped,Skipped,Skipped,95,188,86,350,440,-4,196,67,No,No,No,No,Yes,No,No,No,Skipped,Skipped,Skipped,No,Skipped,Skipped,Skipped,No,Skipped,Skipped,Skipped,Yes,B