blind_id,VISIT,PATIENT_AGE_VISIT,CATH_DONE,PATIENT_AGE_CATH,CATH_LENGTH,CATH_WEIGHT,BSA,SEDATION,BILAT_SVC,ABNORM_SVC,SVC_STEN_PR,SVC_STEN_OR,SVC_STEN_SID,SVC_OCCL_PR,SVC_OCCL_OR,SVC_OCCL_SID,RAIV_PR,LACV_PR,SVC_OTH,SVC_SP,HEPVEIN_IVC,HEPVEIN_DRAI,ABNORM_IVC,IVC_STEN_PR,IVC_STEN_ET,IVC_OCCL_PR,IVC_OCCL_ET,CTD_PR,INTER_IVC_PR,ICV_OTH,ICV_SP,ABNORM_PA,ABNORM_PA_NU,PA_ABN_0,PA_ABN_1,PA_ABN_2,PA_ABN_OTH_0,PA_ABN_OTH_1,PA_ABN_OTH_2,CATH_IN,M_RA_PRES,M_LAPC_WP,M_PALPV_WP,M_RPARPV_WP,SVE_DP,PAA_AP,PAD_AP,MD_AP,LPA_SATUR,RPA_SATUR,SVC_SATUR,PV_SATUR,SA_SATUR,ADD_COMENT,VER_ID
2,Stage III (FONTAN),2.62,Yes,2.62,82.0,9.90,0.46,General Anesthesia,No,No,Skipped,Skipped,Skipped,Skipped,Skipped,Skipped,Skipped,Skipped,Skipped,,Yes,Skipped,No,Skipped,Skipped,Skipped,Skipped,Skipped,Skipped,Skipped,,No,,,,,,,,Room air,7,9,14,14,12,90,43,64,70,72,68,96,88,BALLOON DILATION OF AORTIC ISTHMUS,B
4,Stage III (FONTAN),2.66,Yes,2.66,89.0,14.60,0.58,General Anesthesia,No,No,Skipped,Skipped,Skipped,Skipped,Skipped,Skipped,Skipped,Skipped,Skipped,,Yes,Skipped,No,Skipped,Skipped,Skipped,Skipped,Skipped,Skipped,Skipped,,No,,,,,,,,Room air,11,10,15,15,12,90,93,65,69,69,64,98,87,POST SANO CONDUIT TAKE-DOWN ANEURYSM NOTED,B
5,Stage III (FONTAN),2.17,Yes,2.17,86.0,12.40,0.53,Moderate,No,No,Skipped,Skipped,Skipped,Skipped,Skipped,Skipped,Skipped,Skipped,Skipped,,Yes,Skipped,No,Skipped,Skipped,Skipped,Skipped,Skipped,Skipped,Skipped,,No,,,,,,,,Room air,6,6,9,9,6,81,76,60,65,63,64,95,82,,B
6,Stage III (FONTAN),1.65,Yes,1.65,83.0,11.30,0.50,Moderate,No,No,Skipped,Skipped,Skipped,Skipped,Skipped,Skipped,Skipped,Skipped,Skipped,,No,No,No,Skipped,Skipped,Skipped,Skipped,Skipped,Skipped,Skipped,,No,,,,,,,,Room air,,14,22,20,0,126,126,82,61,62,62,,82,no interventions,B
7,Stage III (FONTAN),2.61,Yes,2.61,88.0,11.00,0.51,General Anesthesia,No,No,Skipped,Skipped,Skipped,Skipped,Skipped,Skipped,Skipped,Skipped,Skipped,,Yes,Skipped,Yes,No,Skipped,No,Skipped,No,No,No,,No,,,,,,,,Room air,7,7,11,8,8,82,82,64,76,71,71,98,,This Cardiac Cath was done at a Non PHN Site.,B
9,Stage III (FONTAN),2.72,Yes,2.72,96.0,13.40,0.59,General Anesthesia,No,No,Skipped,Skipped,Skipped,Skipped,Skipped,Skipped,Skipped,Skipped,Skipped,,Yes,Skipped,No,Skipped,Skipped,Skipped,Skipped,Skipped,Skipped,Skipped,,No,,,,,,,,Room air,7,7,11,11,9,71,69,51,54,53,53,75,68,No comments.,B
12,Stage III (FONTAN),6.54,Yes,6.54,125.0,22.30,0.89,General Anesthesia,No,No,Skipped,Skipped,Skipped,Skipped,Skipped,Skipped,Skipped,Skipped,Skipped,,Yes,Skipped,No,Skipped,Skipped,Skipped,Skipped,Skipped,Skipped,Skipped,,Yes,,H3.03.02,,,,,,Suppl. oxygen,8,,9,9,10,88,84,56,82,82,82,,87,F3 and F13 are missing data,UNKNOWN
23,Stage III (FONTAN),3.75,Yes,3.75,92.0,13.20,0.57,General Anesthesia,No,No,Skipped,Skipped,Skipped,Skipped,Skipped,Skipped,Skipped,Skipped,Skipped,,No,No,No,Skipped,Skipped,Skipped,Skipped,Skipped,Skipped,Skipped,,Yes,1,H3.06,,,mild LPA narrowing distal to the LSVC insertion,,,Room air,6,6,2,10,8,90,84,63,66,70,69,97,85,no interventions,B
26,Stage III (FONTAN),1.27,Yes,1.27,69.0,8.70,0.39,Moderate,No,No,Skipped,Skipped,Skipped,Skipped,Skipped,Skipped,Skipped,Skipped,Skipped,,Unknown,Unknown,No,Skipped,Skipped,Skipped,Skipped,Skipped,Skipped,Skipped,,Yes,1,H2.03.02,,,,,,Room air,,,,,2,89,90,58,,,57,95,86,innominate vein not evaluated by angiography,B
32,Stage III (FONTAN),2.23,Yes,2.23,80.0,12.00,0.50,General Anesthesia,Yes,No,Skipped,Skipped,Skipped,Skipped,Skipped,Skipped,Skipped,Skipped,Skipped,,Unknown,Unknown,Unknown,Skipped,Skipped,Skipped,Skipped,Skipped,Skipped,Skipped,,No,,,,,,,,Room air,9,9,13,13,14,85,79,61,71,70,69,96,84,,B
36,Stage III (FONTAN),,Yes,2.03,84.0,10.60,0.49,General Anesthesia,No,No,Skipped,Skipped,Skipped,Skipped,Skipped,Skipped,Skipped,Skipped,Skipped,,Unknown,Unknown,No,Skipped,Skipped,Skipped,Skipped,Skipped,Skipped,Skipped,,Yes,1,H3.03.02,,,,,,Room air,12,12,15,17,18,81,80,61,71,66,66,91,81,"1. numerous aorta to pulmonary artery collaterals (small). 2. LPA angioplasty at takeoff of SVC anastomosis, dilation with small coefficient balloon",A
37,Stage III (FONTAN),2.11,Yes,2.11,83.0,11.40,0.50,General Anesthesia,No,No,Skipped,Skipped,Skipped,Skipped,Skipped,Skipped,Skipped,Skipped,Skipped,,Unknown,Unknown,Unknown,Skipped,Skipped,Skipped,Skipped,Skipped,Skipped,Skipped,,No,,,,,,,,Missing,,11,13,14,14,70,62,48,67,61,65,,83,no comments,B
38,Stage III (FONTAN),4.08,Yes,4.08,96.0,14.10,0.61,General Anesthesia,No,No,Skipped,Skipped,Skipped,Skipped,Skipped,Skipped,Skipped,Skipped,Skipped,,Yes,Skipped,No,Skipped,Skipped,Skipped,Skipped,Skipped,Skipped,Skipped,,No,,,,,,,,Suppl. oxygen,2,2,5,7,3,73,65,51,67,69,70,99,86,none,B
39,Stage III (FONTAN),3.22,Yes,3.22,91.5,12.20,0.55,General Anesthesia,No,No,Skipped,Skipped,Skipped,Skipped,Skipped,Skipped,Skipped,Skipped,Skipped,,Unknown,Unknown,No,Skipped,Skipped,Skipped,Skipped,Skipped,Skipped,Skipped,,Yes,1,H3.02.02,,,,,,Suppl. oxygen,6,6,11,11,6,72,74,56,74,75,75,98,87,"Moderate aortopulmomary collatereal blood flow to both lungs, more to the left side.",B
40,Stage III (FONTAN),4.23,Yes,4.23,99.0,13.70,0.61,General Anesthesia,No,No,Skipped,Skipped,Skipped,Skipped,Skipped,Skipped,Skipped,Skipped,Skipped,,Yes,Skipped,No,Skipped,Skipped,Skipped,Skipped,Skipped,Skipped,Skipped,,No,,,,,,,,Room air,6,6,13,13,8,80,80,55,72,74,70,98,89,NONE,B
50,Stage III (FONTAN),2.67,Yes,2.67,82.0,12.70,0.52,General Anesthesia,No,No,Skipped,Skipped,Skipped,Skipped,Skipped,Skipped,Skipped,Skipped,Skipped,,Unknown,Unknown,Unknown,Skipped,Skipped,Skipped,Skipped,Skipped,Skipped,Skipped,,Unknown,,,,,,,,Room air,7,7,11,11,8,,96,68,67,65,68,98,84,None,B
51,Stage III (FONTAN),,Yes,2.85,89.0,11.00,0.50,General Anesthesia,Yes,No,Skipped,Skipped,Skipped,Skipped,Skipped,Skipped,Skipped,Skipped,Skipped,,Unknown,Unknown,Unknown,Skipped,Skipped,Skipped,Skipped,Skipped,Skipped,Skipped,,No,,,,,,,,Room air,4,5,7,7,5,90,90,60,65,65,66,94,87,None,A
52,Stage III (FONTAN),2.31,No,,,,,Skipped,Skipped,Skipped,Skipped,Skipped,Skipped,Skipped,Skipped,Skipped,Skipped,Skipped,Skipped,,Skipped,Skipped,Skipped,Skipped,Skipped,Skipped,Skipped,Skipped,Skipped,Skipped,,Skipped,,,,,,,,Skipped,,,,,,,,,,,,,,,B
54,Stage III (FONTAN),,No,,,,,Skipped,Skipped,Skipped,Skipped,Skipped,Skipped,Skipped,Skipped,Skipped,Skipped,Skipped,Skipped,,Skipped,Skipped,Skipped,Skipped,Skipped,Skipped,Skipped,Skipped,Skipped,Skipped,,Skipped,,,,,,,,Skipped,,,,,,,,,,,,,,,A
58,Stage III (FONTAN),2.24,No,,,,,Skipped,Skipped,Skipped,Skipped,Skipped,Skipped,Skipped,Skipped,Skipped,Skipped,Skipped,Skipped,,Skipped,Skipped,Skipped,Skipped,Skipped,Skipped,Skipped,Skipped,Skipped,Skipped,,Skipped,,,,,,,,Skipped,,,,,,,,,,,,,,,B
61,Stage III (FONTAN),3.03,Yes,2.87,91.0,14.10,0.58,General Anesthesia,Yes,No,Skipped,Skipped,Skipped,Skipped,Skipped,Skipped,Skipped,Skipped,Skipped,,Yes,Skipped,No,Skipped,Skipped,Skipped,Skipped,Skipped,Skipped,Skipped,,No,,,,,,,,Room air,8,8,11,11,10,72,74,54,68,70,61,99,88,none,B
62,Stage III (FONTAN),2.8,Yes,2.8,99.0,14.20,0.62,General Anesthesia,No,No,Skipped,Skipped,Skipped,Skipped,Skipped,Skipped,Skipped,Skipped,Skipped,,Yes,Skipped,No,Skipped,Skipped,Skipped,Skipped,Skipped,Skipped,Skipped,,Yes,2,H3.06,H3.06,,DECREASED FLOW TO LUL,LPA STENT PRESENT,,Room air,11,12,13,13,13,102,,,86,66,63,95,89,,B
63,Stage III (FONTAN),,Yes,1.33,82.0,10.00,0.50,General Anesthesia,No,No,Skipped,Skipped,Skipped,Skipped,Skipped,Skipped,Skipped,Skipped,Skipped,,Unknown,Unknown,No,Skipped,Skipped,Skipped,Skipped,Skipped,Skipped,Skipped,,Yes,1,H3.03.02,,,,,,Room air,3,3,9,9,5,,,57,72,74,72,,86,none,A
69,Stage III (FONTAN),3.23,Yes,2.81,91.0,13.60,0.57,General Anesthesia,Yes,No,Skipped,Skipped,Skipped,Skipped,Skipped,Skipped,Skipped,Skipped,Skipped,,Yes,Skipped,No,Skipped,Skipped,Skipped,Skipped,Skipped,Skipped,Skipped,,No,,,,,,,,Suppl. oxygen,8,8,12,12,8,74,73,53,62,61,65,96,84,no interventions,B
74,Stage III (FONTAN),1.46,Yes,1.46,82.0,12.40,0.51,General Anesthesia,No,No,Skipped,Skipped,Skipped,Skipped,Skipped,Skipped,Skipped,Skipped,Skipped,,Unknown,Unknown,No,Skipped,Skipped,Skipped,Skipped,Skipped,Skipped,Skipped,,No,,,,,,,,Suppl. oxygen,7,7,12,12,8,,57,45,68,70,65,,85,None,B
77,Stage III (FONTAN),2.81,Yes,2.81,94.0,12.40,0.56,General Anesthesia,No,No,Skipped,Skipped,Skipped,Skipped,Skipped,Skipped,Skipped,Skipped,Skipped,,Unknown,Unknown,Unknown,Skipped,Skipped,Skipped,Skipped,Skipped,Skipped,Skipped,,No,,,,,,,,Room air,3,4,7,8,5,,70,54,69,68,67,98,85,moderate degree of aorta to pulmonary collaterals formed in both lung fields,B
78,Stage III (FONTAN),,Yes,2.98,89.0,11.00,0.52,General Anesthesia,No,Unknown,Skipped,Skipped,Skipped,Skipped,Skipped,Skipped,Skipped,Skipped,Skipped,,Unknown,Unknown,Unknown,Skipped,Skipped,Skipped,Skipped,Skipped,Skipped,Skipped,,Yes,1,H3.02.02,,,,,,Suppl. oxygen,5,10,10,11,8,74,65,46,69,67,66,100,91,,A
83,Stage III (FONTAN),,Yes,3.07,91.0,18.00,0.60,General Anesthesia,No,No,Skipped,Skipped,Skipped,Skipped,Skipped,Skipped,Skipped,Skipped,Skipped,,No,No,No,Skipped,Skipped,Skipped,Skipped,Skipped,Skipped,Skipped,,No,,,,,,,,Room air,8,7,12,12,10,83,73,58,64,67,63,96,85,1. BD AORTIC COARCTATION 2. VVC FROM INNOMINANT VEIN DRAINING INTO LUPV COILED 3. RIMA COILED,A
87,Stage III (FONTAN),,Yes,2.64,77.0,9.10,0.43,General Anesthesia,No,No,Skipped,Skipped,Skipped,Skipped,Skipped,Skipped,Skipped,Skipped,Skipped,,Yes,Skipped,No,Skipped,Skipped,Skipped,Skipped,Skipped,Skipped,Skipped,,Yes,1,H3.02.02,,,,,,Room air,7,7,14,12,9,80,74,55,66,70,64,96,80,"THE PROXIMAL LPA WAS BALLOON DILATED AND STENTED. SEVERAL APC'S FROM RIMA, LIMA AND LEFT LATERAL THORACIC ARTERY WERE COIL OCCLUDED.",A
91,Stage III (FONTAN),3.14,Yes,2.14,96.5,12.90,0.59,General Anesthesia,No,No,Skipped,Skipped,Skipped,Skipped,Skipped,Skipped,Skipped,Skipped,Skipped,,Yes,Skipped,No,Skipped,Skipped,Skipped,Skipped,Skipped,Skipped,Skipped,,No,,,,,,,,Room air,3,5,8,8,4,67,63,44,,74,69,,87,none,B
92,Stage III (FONTAN),,Yes,2.39,81.0,10.90,0.48,General Anesthesia,No,No,Skipped,Skipped,Skipped,Skipped,Skipped,Skipped,Skipped,Skipped,Skipped,,No,No,No,Skipped,Skipped,Skipped,Skipped,Skipped,Skipped,Skipped,,Yes,1,H3.06,,,PROXIMAL LPA MILDLY NARROW,,,Room air,10,11,15,15,9,85,88,65,62,62,63,96,82,6 COILS PLACED IN RIMA,A
95,Stage III (FONTAN),4.9,Yes,4.9,105.0,14.20,0.65,General Anesthesia,No,No,Skipped,Skipped,Skipped,Skipped,Skipped,Skipped,Skipped,Skipped,Skipped,,Yes,Skipped,No,Skipped,Skipped,Skipped,Skipped,Skipped,Skipped,Skipped,,No,,,,,,,,Room air,8,6,10,10,9,76,71,55,68,68,66,95,82,NONE.,B
101,Stage III (FONTAN),2.57,No,,,,,Skipped,Skipped,Skipped,Skipped,Skipped,Skipped,Skipped,Skipped,Skipped,Skipped,Skipped,Skipped,,Skipped,Skipped,Skipped,Skipped,Skipped,Skipped,Skipped,Skipped,Skipped,Skipped,,Skipped,,,,,,,,Skipped,,,,,,,,,,,,,,,B
104,Stage III (FONTAN),2.69,Yes,2.69,,16.30,,General Anesthesia,Unknown,No,Skipped,Skipped,Skipped,Skipped,Skipped,Skipped,Skipped,Skipped,Skipped,,Unknown,Unknown,Unknown,Skipped,Skipped,Skipped,Skipped,Skipped,Skipped,Skipped,,No,,,,,,,,Room air,12,10,15,15,6,74,53,63,53,51,53,,77,"two coils were placed into the LIMA followed by two gianturco coils.  Two additional  gianturco coils were placed above this.  In the RIMA collateral, two coils were positioned.  4 additional gianturco coils were placed into the RIMA",B
106,Stage III (FONTAN),1.64,Yes,1.64,74.0,8.90,0.41,General Anesthesia,Yes,No,Skipped,Skipped,Skipped,Skipped,Skipped,Skipped,Skipped,Skipped,Skipped,,Yes,Skipped,No,Skipped,Skipped,Skipped,Skipped,Skipped,Skipped,Skipped,,No,,,,,,,,Room air,4,5,9,9,4,61,59,45,58,57,53,99,81,Device closure of left SVC,B
107,Stage III (FONTAN),2.4,No,,,,,Skipped,Skipped,Skipped,Skipped,Skipped,Skipped,Skipped,Skipped,Skipped,Skipped,Skipped,Skipped,,Skipped,Skipped,Skipped,Skipped,Skipped,Skipped,Skipped,Skipped,Skipped,Skipped,,Skipped,,,,,,,,Skipped,,,,,,,,,,,,,,,B
109,Stage III (FONTAN),3.66,Yes,3.66,100.0,15.60,0.65,General Anesthesia,No,No,Skipped,Skipped,Skipped,Skipped,Skipped,Skipped,Skipped,Skipped,Skipped,,Yes,Skipped,No,Skipped,Skipped,Skipped,Skipped,Skipped,Skipped,Skipped,,No,,,,,,,,Room air,8,6,12,11,7,105,49,72,67,67,67,99,82,None,B
112,Stage III (FONTAN),2.88,No,,,,,Skipped,Skipped,Skipped,Skipped,Skipped,Skipped,Skipped,Skipped,Skipped,Skipped,Skipped,Skipped,,Skipped,Skipped,Skipped,Skipped,Skipped,Skipped,Skipped,Skipped,Skipped,Skipped,,Skipped,,,,,,,,Skipped,,,,,,,,,,,,,,,B
113,Stage III (FONTAN),1.95,Yes,1.95,87.0,10.20,0.49,Moderate,Yes,No,Skipped,Skipped,Skipped,Skipped,Skipped,Skipped,Skipped,Skipped,Skipped,,Yes,Skipped,No,Skipped,Skipped,Skipped,Skipped,Skipped,Skipped,Skipped,,No,,,,,,,,Room air,10,10,16,16,10,110,115,84,65,53,57,95,86,RIMA WAS COILED,B
114,Stage III (FONTAN),3.39,Yes,3.39,97.7,15.60,0.64,General Anesthesia,No,No,Skipped,Skipped,Skipped,Skipped,Skipped,Skipped,Skipped,Skipped,Skipped,,Unknown,Unknown,Unknown,Skipped,Skipped,Skipped,Skipped,Skipped,Skipped,Skipped,,No,,,,,,,,Room air,8,9,12,12,10,97,86,64,68,67,69,96,80,None,B
115,Stage III (FONTAN),3.23,Yes,3.23,79.0,11.30,0.48,General Anesthesia,Yes,Yes,No,Skipped,Skipped,No,Skipped,Skipped,No,No,Yes,small posterior collateral,Unknown,Unknown,Unknown,Skipped,Skipped,Skipped,Skipped,Skipped,Skipped,Skipped,,No,,,,,,,,Room air,8,9,14,12,10,70,67,40,70,72,71,,84,None,B
127,Stage III (FONTAN),2.45,Yes,2.45,92.0,13.30,0.57,General Anesthesia,No,No,Skipped,Skipped,Skipped,Skipped,Skipped,Skipped,Skipped,Skipped,Skipped,,Unknown,Unknown,Unknown,Skipped,Skipped,Skipped,Skipped,Skipped,Skipped,Skipped,,No,,,,,,,,Room air,11,11,13,13,12,100,90,66,64,65,64,99,,None,B
134,Stage III (FONTAN),1.57,Yes,1.57,81.0,9.60,0.45,Moderate,No,No,Skipped,Skipped,Skipped,Skipped,Skipped,Skipped,Skipped,Skipped,Skipped,,Unknown,Unknown,Unknown,Skipped,Skipped,Skipped,Skipped,Skipped,Skipped,Skipped,,No,,,,,,,,Room air,,9,11,,8,104,109,75,62,,62,,88,no additional comments,B
139,Stage III (FONTAN),5.9,Yes,5.35,106.5,17.20,0.71,General Anesthesia,No,No,Skipped,Skipped,Skipped,Skipped,Skipped,Skipped,Skipped,Skipped,Skipped,,Yes,Skipped,No,Skipped,Skipped,Skipped,Skipped,Skipped,Skipped,Skipped,,No,,,,,,,,Room air,5,5,15,15,5,75,76,39,74,61,57,94,83,saline contrast shows evidence of small pulmonary avm's,UNKNOWN
140,Stage III (FONTAN),3.84,Yes,3.84,96.5,17.05,0.67,General Anesthesia,No,No,Skipped,Skipped,Skipped,Skipped,Skipped,Skipped,Skipped,Skipped,Skipped,,Unknown,Unknown,Unknown,Skipped,Skipped,Skipped,Skipped,Skipped,Skipped,Skipped,,No,,,,,,,,Room air,7,,11,12,9,,78,58,65,66,67,99,87,obstruction noted within the rv cavity: 40mm gradient between rv apex and rvot which equal to 70mm post angiography,B
141,Stage III (FONTAN),2.21,Yes,2.1,82.0,10.50,0.48,General Anesthesia,No,No,Skipped,Skipped,Skipped,Skipped,Skipped,Skipped,Skipped,Skipped,Skipped,,Yes,Skipped,No,Skipped,Skipped,Skipped,Skipped,Skipped,Skipped,Skipped,,No,,,,,,,,Room air,7,9,12,12,10,104,100,66,71,59,65,98,83,,B
142,Stage III (FONTAN),2,Yes,2,83.0,10.50,0.48,General Anesthesia,No,No,Skipped,Skipped,Skipped,Skipped,Skipped,Skipped,Skipped,Skipped,Skipped,,No,No,No,Skipped,Skipped,Skipped,Skipped,Skipped,Skipped,Skipped,,No,,,,,,,,Room air,7,8,12,12,7,76,74,55,,58,58,98,84,no interventions,B
143,Stage III (FONTAN),,Yes,1.61,89.0,13.40,1.10,Moderate,No,No,Skipped,Skipped,Skipped,Skipped,Skipped,Skipped,Skipped,Skipped,Skipped,,Unknown,Unknown,No,Skipped,Skipped,Skipped,Skipped,Skipped,Skipped,Skipped,,No,,,,,,,,Room air,11,14,18,14,,90,93,71,77,69,63,99,87,PARTICLE OCCLUSION COLLATERAL FROM RIMA AND LIMA.,A
147,Stage III (FONTAN),,Yes,1.98,85.0,12.10,0.52,Moderate,No,No,Skipped,Skipped,Skipped,Skipped,Skipped,Skipped,Skipped,Skipped,Skipped,,Yes,Skipped,No,Skipped,Skipped,Skipped,Skipped,Skipped,Skipped,Skipped,,Yes,1,H3.03.02,,,,,,Room air,,,10,10,5,88,90,66,69,66,65,,87,"occluded femeral veins, LPA 6mn, RPA,10mn,naka/ 205/m2, outside catherization from referring center",A
149,Stage III (FONTAN),2.93,Yes,2.93,95.0,13.80,0.60,General Anesthesia,No,No,Skipped,Skipped,Skipped,Skipped,Skipped,Skipped,Skipped,Skipped,Skipped,,Unknown,Unknown,Unknown,Skipped,Skipped,Skipped,Skipped,Skipped,Skipped,Skipped,,Yes,1,H3.02.01,,,,,,Room air,10,9,16,16,14,80,79,58,68,66,69,95,87,s/p balloon right Inominate artery.,B
153,Stage III (FONTAN),1.83,Yes,1.83,,,,General Anesthesia,No,No,Skipped,Skipped,Skipped,Skipped,Skipped,Skipped,Skipped,Skipped,Skipped,,Unknown,Unknown,Unknown,Skipped,Skipped,Skipped,Skipped,Skipped,Skipped,Skipped,,No,,,,,,,,Suppl. oxygen,6,6,,,7,71,67,46,68,,,99,89,no additional comments,B
154,Stage III (FONTAN),,Yes,2.14,90.0,14.20,0.58,General Anesthesia,No,No,Skipped,Skipped,Skipped,Skipped,Skipped,Skipped,Skipped,Skipped,Skipped,,No,No,No,Skipped,Skipped,Skipped,Skipped,Skipped,Skipped,Skipped,,No,,,,,,,,Room air,6,6,10,10,7,,68,49,63,64,66,98,87,coil embolization of the rima and lima with multiple platinum coils,A
156,Stage III (FONTAN),2.37,Yes,2.37,87.0,12.00,0.53,General Anesthesia,No,No,Skipped,Skipped,Skipped,Skipped,Skipped,Skipped,Skipped,Skipped,Skipped,,Yes,Skipped,No,Skipped,Skipped,Skipped,Skipped,Skipped,Skipped,Skipped,,No,,,,,,,,Suppl. oxygen,8,8,13,11,10,77,74,57,72,68,69,99,86,none,B
159,Stage III (FONTAN),3.15,Yes,3.15,95.0,14.60,0.62,Moderate,No,No,Skipped,Skipped,Skipped,Skipped,Skipped,Skipped,Skipped,Skipped,Skipped,,Unknown,Unknown,No,Skipped,Skipped,Skipped,Skipped,Skipped,Skipped,Skipped,,No,,,,,,,,Room air,5,5,8,8,,74,74,60,64,65,65,96,82,None,B
161,Stage III (FONTAN),3.36,Yes,3.36,92.0,13.70,0.58,General Anesthesia,No,No,Skipped,Skipped,Skipped,Skipped,Skipped,Skipped,Skipped,Skipped,Skipped,,No,No,No,Skipped,Skipped,Skipped,Skipped,Skipped,Skipped,Skipped,,No,,,,,,,,Room air,7,,10,11,6,78,66,54,70,70,66,98,86,no interventions,B
162,Stage III (FONTAN),1.95,Yes,1.95,82.0,12.70,0.52,General Anesthesia,No,No,Skipped,Skipped,Skipped,Skipped,Skipped,Skipped,Skipped,Skipped,Skipped,,Unknown,Unknown,Unknown,Skipped,Skipped,Skipped,Skipped,Skipped,Skipped,Skipped,,No,,,,,,,,Room air,7,7,11,11,8,,96,68,67,65,68,98,84,None,UNKNOWN
165,Stage III (FONTAN),,Yes,2.78,90.0,12.40,0.55,General Anesthesia,No,No,Skipped,Skipped,Skipped,Skipped,Skipped,Skipped,Skipped,Skipped,Skipped,,Unknown,Unknown,No,Skipped,Skipped,Skipped,Skipped,Skipped,Skipped,Skipped,,Yes,1,H3.02.02,,,,,,Room air,7,7,11,12,9,72,65,47,63,63,65,93,85,NONE,A
166,Stage III (FONTAN),2.84,No,,,,,Skipped,Skipped,Skipped,Skipped,Skipped,Skipped,Skipped,Skipped,Skipped,Skipped,Skipped,Skipped,,Skipped,Skipped,Skipped,Skipped,Skipped,Skipped,Skipped,Skipped,Skipped,Skipped,,Skipped,,,,,,,,Skipped,,,,,,,,,,,,,,,B
168,Stage III (FONTAN),1.69,Yes,1.69,84.0,12.80,0.53,General Anesthesia,No,No,Skipped,Skipped,Skipped,Skipped,Skipped,Skipped,Skipped,Skipped,Skipped,,Unknown,Unknown,No,Skipped,Skipped,Skipped,Skipped,Skipped,Skipped,Skipped,,No,,,,,,,,Room air,8,11,16,18,9,87,91,68,67,63,67,99,85,NONE,B
169,Stage III (FONTAN),1.17,Yes,1.17,77.5,9.86,0.45,General Anesthesia,Unknown,Unknown,Skipped,Skipped,Skipped,Skipped,Skipped,Skipped,Skipped,Skipped,Skipped,,Unknown,Unknown,Unknown,Skipped,Skipped,Skipped,Skipped,Skipped,Skipped,Skipped,,No,,,,,,,,Suppl. oxygen,4,6,10,,8,109,69,56,67,,68,,91,no additional comments,B
171,Stage III (FONTAN),2.19,Yes,2.19,85.0,12.80,0.53,General Anesthesia,No,No,Skipped,Skipped,Skipped,Skipped,Skipped,Skipped,Skipped,Skipped,Skipped,,Unknown,No,Unknown,Skipped,Skipped,Skipped,Skipped,Skipped,Skipped,Skipped,,No,,,,,,,,Room air,7,7,14,13,10,74,72,53,76,77,76,97,91,None,B
174,Stage III (FONTAN),1.34,Yes,1.34,80.6,11.42,0.49,General Anesthesia,No,No,Skipped,Skipped,Skipped,Skipped,Skipped,Skipped,Skipped,Skipped,Skipped,,Unknown,Unknown,Unknown,Skipped,Skipped,Skipped,Skipped,Skipped,Skipped,Skipped,,No,,,,,,,,Suppl. oxygen,3,3,,,6,75,68,52,,,,,,no additional comments,B
184,Stage III (FONTAN),,Yes,2.54,91.0,14.10,0.58,General Anesthesia,No,No,Skipped,Skipped,Skipped,Skipped,Skipped,Skipped,Skipped,Skipped,Skipped,,Unknown,Unknown,No,Skipped,Skipped,Skipped,Skipped,Skipped,Skipped,Skipped,,No,,,,,,,,Room air,4,5,9,9,5,71,,,66,66,72,,91,Two coils placed in the rt. internal mammary artery.,A
186,Stage III (FONTAN),2.91,Yes,2.91,84.5,13.70,0.57,General Anesthesia,No,No,Skipped,Skipped,Skipped,Skipped,Skipped,Skipped,Skipped,Skipped,Skipped,,Yes,Skipped,No,Skipped,Skipped,Skipped,Skipped,Skipped,Skipped,Skipped,,No,,,,,,,,Room air,5,5,8,10,4,72,63,47,71,73,71,96,87,none,B
187,Stage III (FONTAN),1.4,Yes,1.4,72.5,8.00,0.39,Moderate,No,No,Skipped,Skipped,Skipped,Skipped,Skipped,Skipped,Skipped,Skipped,Skipped,,Yes,Skipped,No,Skipped,Skipped,Skipped,Skipped,Skipped,Skipped,Skipped,,Yes,1,H3.02.02,,,,,,Room air,6,6,11,11,8,95,91,,67,62,64,100,88,NONE,B
188,Stage III (FONTAN),3.52,No,,,,,Skipped,Skipped,Skipped,Skipped,Skipped,Skipped,Skipped,Skipped,Skipped,Skipped,Skipped,Skipped,,Skipped,Skipped,Skipped,Skipped,Skipped,Skipped,Skipped,Skipped,Skipped,Skipped,,Skipped,,,,,,,,Skipped,,,,,,,,,,,,,,,B
196,Stage III (FONTAN),2.1,Yes,2.1,83.9,12.20,0.52,General Anesthesia,No,No,Skipped,Skipped,Skipped,Skipped,Skipped,Skipped,Skipped,Skipped,Skipped,,No,No,No,Skipped,Skipped,Skipped,Skipped,Skipped,Skipped,Skipped,,No,,,,,,,,Room air,6,7,11,,0,89,82,59,73,,75,97,87,no interventions,B
197,Stage III (FONTAN),3.35,Yes,3.35,94.0,12.10,0.56,General Anesthesia,No,No,Skipped,Skipped,Skipped,Skipped,Skipped,Skipped,Skipped,Skipped,Skipped,,Unknown,Unknown,No,Skipped,Skipped,Skipped,Skipped,Skipped,Skipped,Skipped,,Yes,1,H3.06,,,mildly narrowed,,,Room air,7,7,13,12,8,90,70,60,71,68,74,100,82,None,B
203,Stage III (FONTAN),4.3,Yes,3.92,95.0,13.60,0.59,General Anesthesia,No,No,Skipped,Skipped,Skipped,Skipped,Skipped,Skipped,Skipped,Skipped,Skipped,,Yes,Skipped,No,Skipped,Skipped,Skipped,Skipped,Skipped,Skipped,Skipped,,No,,,,,,,,Room air,5,5,11,11,5,82,85,57,67,68,68,96,79,No interventions,B
204,Stage III (FONTAN),3.26,Yes,3.26,95.0,12.80,0.58,General Anesthesia,No,No,Skipped,Skipped,Skipped,Skipped,Skipped,Skipped,Skipped,Skipped,Skipped,,Unknown,Unknown,Unknown,Skipped,Skipped,Skipped,Skipped,Skipped,Skipped,Skipped,,Yes,2,H2.03.02,H3.03.02,,,,,Room air,4,4,10,10,6,98,98,73,74,76,75,99,88,None,B
206,Stage III (FONTAN),2.37,Yes,1.37,84.0,12.50,0.55,General Anesthesia,No,No,Skipped,Skipped,Skipped,Skipped,Skipped,Skipped,Skipped,Skipped,Skipped,,Yes,Skipped,No,Skipped,Skipped,Skipped,Skipped,Skipped,Skipped,Skipped,,No,,,,,,,,Room air,10,10,15,15,12,84,88,63,56,56,56,99,87,,B
207,Stage III (FONTAN),2.12,Yes,2.12,85.0,11.50,0.51,Moderate,No,No,Skipped,Skipped,Skipped,Skipped,Skipped,Skipped,Skipped,Skipped,Skipped,,Unknown,Unknown,No,Skipped,Skipped,Skipped,Skipped,Skipped,Skipped,Skipped,,No,,,,,,,,Room air,6,7,12,12,,96,96,70,58,63,56,96,,no,B
210,Stage III (FONTAN),2.23,Yes,2.23,83.0,11.90,0.51,Moderate,No,No,Skipped,Skipped,Skipped,Skipped,Skipped,Skipped,Skipped,Skipped,Skipped,,No,No,No,Skipped,Skipped,Skipped,Skipped,Skipped,Skipped,Skipped,,No,,,,,,,,Room air,3,13,17,17,10,,90,61,63,64,68,97,77,occlusion of the right iliac vein requiring balloon dilation and stent placement,B
211,Stage III (FONTAN),3.62,Yes,3.62,94.0,15.00,0.61,General Anesthesia,No,No,Skipped,Skipped,Skipped,Skipped,Skipped,Skipped,Skipped,Skipped,Skipped,,Yes,Skipped,No,Skipped,Skipped,Skipped,Skipped,Skipped,Skipped,Skipped,,No,,,,,,,,Room air,7,7,11,10,7,68,68,56,63,68,65,98,89,none,B
214,Stage III (FONTAN),4.37,Yes,3.58,93.0,13.50,0.58,General Anesthesia,Yes,No,Skipped,Skipped,Skipped,Skipped,Skipped,Skipped,Skipped,Skipped,Skipped,,Yes,Skipped,No,Skipped,Skipped,Skipped,Skipped,Skipped,Skipped,Skipped,,No,,,,,,,,Room air,,8,11,11,8,80,81,61,69,63,64,,78,no interventions,B
216,Stage III (FONTAN),3.93,Yes,3.93,99.0,15.60,0.65,General Anesthesia,No,No,Skipped,Skipped,Skipped,Skipped,Skipped,Skipped,Skipped,Skipped,Skipped,,Yes,Skipped,No,Skipped,Skipped,Skipped,Skipped,Skipped,Skipped,Skipped,,No,,,,,,,,Room air,11,11,14,14,12,80,75,58,60,59,58,99,80,"Diagnostic cath. No issues, no procedures",B