blind_id,ECHO_D_AGE_YEARS,VISIT,ACCEPTABLE,IMGQUAL,CLV_PRES,CLV_EDLAD2,CLV_EDV_MS,CLV_ESV_MS,CLV_VM_MS,CRV_EDLAD2,CRV_EDSAD2,CRV_AEDAREA,CRV_AESAREA,CRV_SDEDLAX,CRV_SDESLAX,CRV_SAEDAREA,CRV_SAESAREA,CRV_HR,CRV_EDVSIMP,CRV_ESVSIMP,CRV_EFSIMP,CNAV_REG,CNAV_SEV,CNAV_APRJW,CNAV_TPRJW,CNAV_ET,CNAV_TVI,CNAV_ANAD,CNAV_TNAD,CTV_AVAD,CTV_TVAD,CTV_TVREG,CTV_TVRSEV,CTV_APRJW,CTV_TPRJW,CTV_RRINT,CTV_SUMWV,CTV_PEV,CTV_PAV,CTV_AWVDUR,CTV_RVDPDT,CRVD_RVET,CRVD_TVC,CRVD_RRI,CPVD_FLWRV,CTD_RRINT,CTD_SUMWV,CTD_PADV,CTD_PEDV,CTD_PSV,CTD_ET,CTD_ISOCA,CTD_ICTIRT,CAD_ANAMAXD,CAD_CWDPV,COMNTYN,COMMENTS
2,2.62,Pre-Fontan Echo,Yes,2:Good,2:No,,,,,4.56,3.94,18.21,14.20,4.41,3.68,,,,,,,2:No,,,,272.02,22.83,1.09,1.33,1.76,1.75,1:Yes,1:Mild,,,,2:No,0.62,0.46,137.32,,272.02,443.65,911.94,,911.94,1:Yes,,,,,,,1.5900,1.92,2:No,
4,2.66,Pre-Fontan Echo,Yes,1:Excellent,1:Yes,,,,,4.69,4.53,19.78,11.65,4.77,4.35,12.37,6.38,79,58.50,24.70,57.78,1:Yes,1:Mild,,,,,1.76,1.79,2.21,2.42,1:Yes,1:Mild,,,,2:No,0.64,0.49,169.02,,,348.61,734.20,,734.20,2:No,5.64,4.44,5.87,,31.69,409.36,1.7300,2.44,1:Yes,Multiple TR jets
4,5.92,Study visit 9 (year 6 Echo),Yes,2:Good,1:Yes,,,,,4.59,4.12,15.91,9.22,3.95,2.93,,,,,,,1:Yes,1:Mild,,,,,1.61,1.45,1.79,2.33,2:No,,,,,2:No,0.69,0.48,132.00,,,346.00,,,,,,,,,,,1.6600,1.70,2:No,
5,2.16,Pre-Fontan Echo,Yes,2:Good,2:No,,,,,4.38,4.24,16.06,11.11,3.79,3.16,,,,,,,2:No,,,,260.26,20.04,1.01,1.41,1.94,2.14,1:Yes,2:Moderate,0.34,0.42,638.82,,,,,,260.26,,638.82,,638.82,2:No,5.73,5.15,3.84,261.35,42.81,419.06,,,1:Yes,DORV
5,5.58,Study visit 9 (year 6 Echo),Yes,2:Good,1:Yes,4.36,3.00,5.40,7.90,5.39,5.91,26.30,19.65,,,,,,,,,2:No,,,,243.00,21.40,1.16,1.96,2.87,3.10,1:Yes,1:Mild,,,,1:Yes,0.79,,,1333.00,243.00,354.00,655.00,,707.70,2:No,6.00,8.00,6.40,201.00,,437.00,1.6000,2.09,2:No,
6,1.64,Pre-Fontan Echo,Yes,3:Fair,2:No,,,,,5.05,3.23,16.07,11.14,3.91,2.84,12.17,7.68,114,32.00,14.50,54.69,1:Yes,1:Mild,,,,,1.60,2.01,1.39,1.89,1:Yes,1:Mild,,,,,,,,,,,557.25,,557.25,,,,,,,,2.0908,,1:Yes,No measurable Doppler information
9,2.71,Pre-Fontan Echo,Yes,2:Good,2:No,,,,,,,,,4.08,3.42,,,,,,,2:No,,,,273.58,25.66,1.32,1.54,2.00,2.18,1:Yes,1:Mild,,,,2:No,0.73,0.53,,,273.58,388.18,713.52,,713.52,,,,,,,,2.0082,1.27,2:No,
9,6.35,Study visit 9 (year 6 Echo),Yes,1:Excellent,2:No,,,,,,,,,5.78,4.03,15.14,7.74,,,,,2:No,,,,275.00,31.50,1.65,2.08,2.68,2.69,1:Yes,1:Mild,,,,2:No,0.83,0.53,106.00,,275.00,396.00,778.10,,731.60,2:No,6.00,13.00,6.80,254.00,,446.00,2.2300,1.41,1:Yes,Fenestrated Fontan
12,6.57,Pre-Fontan Echo,Yes,2:Good,2:No,,,,,6.84,5.87,35.94,26.59,5.67,4.61,33.07,23.66,73,171.60,111.40,35.08,2:No,,,,254.00,11.50,2.20,,2.79,3.44,1:Yes,1:Mild,,,,2:No,0.32,0.31,116.00,865.00,254.00,483.00,723.60,,728.90,2:No,5.00,10.00,6.80,272.00,,473.00,2.0700,1.64,2:No,
23,5.79,Study visit 9 (year 6 Echo),Yes,1:Excellent,1:Yes,2.86,3.00,1.60,8.00,4.40,4.01,14.54,10.13,,,,,,,,,2:No,,,,227.00,13.70,,2.15,2.50,2.24,1:Yes,1:Mild,,,,2:No,0.82,0.66,108.00,1231.00,227.00,325.00,570.50,,647.00,2:No,4.00,7.00,6.80,235.00,24.00,364.00,2.2200,2.27,1:Yes,fenestrated Fontan
26,2.19,Pre-Fontan Echo,Yes,1:Excellent,2:No,,,,,4.16,3.76,11.92,8.39,3.42,2.74,,,,,,,1:Yes,1:Mild,,,240.33,13.83,1.63,1.39,1.88,2.09,1:Yes,1:Mild,,,,2:No,0.61,0.63,,,240.33,390.87,670.81,,670.81,2:No,,,,,,,,1.67,2:No,
26,5.97,Study visit 9 (year 6 Echo),Yes,1:Excellent,2:No,,,,,4.64,4.53,17.38,11.65,4.08,3.74,8.79,5.03,65,44.10,21.70,50.79,1:Yes,2:Moderate,0.32,0.28,256.00,18.00,2.06,2.07,2.42,2.20,2:No,,,,,2:No,0.67,0.48,111.00,,256.00,412.00,940.20,,,,,,,,,,1.7400,1.76,1:Yes,Fontan
32,2.23,Pre-Fontan Echo,Yes,1:Excellent,1:Yes,2.56,1.37,0.62,7.14,4.23,2.86,10.90,7.39,4.04,3.08,,,,,,,2:No,,,,225.23,13.73,1.67,1.64,1.87,1.91,1:Yes,1:Mild,,,,2:No,0.82,0.89,,,225.23,302.33,456.62,,456.62,2:No,13.16,12.09,8.85,221.01,29.19,308.58,1.9918,1.31,2:No,
32,6.2,Study visit 9 (year 6 Echo),Yes,2:Good,1:Yes,2.56,3.90,1.50,16.90,4.32,3.32,11.58,7.97,,,8.72,5.70,97,32.40,20.10,37.96,1:Yes,1:Mild,,,194.00,10.70,1.93,1.81,2.02,2.06,1:Yes,1:Mild,,,,2:No,1.24,0.72,116.00,821.00,194.00,377.00,610.00,,,,,,,,,,1.9700,1.47,1:Yes,fenestrated Fontan
36,2.76,Pre-Fontan Echo,Yes,1:Excellent,1:Yes,1.35,0.24,0.28,3.94,,,,,4.21,3.60,16.03,11.49,,,,,1:Yes,1:Mild,,,266.94,14.75,1.52,1.24,1.15,1.83,1:Yes,1:Mild,,,,2:No,0.76,0.64,145.99,,266.94,329.51,575.60,,575.60,2:No,7.86,7.25,5.24,221.06,,400.42,1.9751,1.21,2:No,
36,5.31,Study visit 9 (year 6 Echo),Yes,2:Good,1:Yes,2.10,1.10,0.60,5.80,4.81,3.27,15.82,10.83,3.67,3.12,,,,,,,2:No,,,,259.00,13.40,,1.36,1.52,1.98,1:Yes,1:Mild,,,,2:No,0.88,0.90,103.00,,259.00,342.00,258.60,,579.80,2:No,9.00,9.00,10.00,221.00,21.00,367.00,2.0700,1.09,2:No,
37,5.33,Study visit 9 (year 6 Echo),Yes,2:Good,1:Yes,2.54,4.40,6.00,12.60,,,,,,,,,,,,,2:No,,,,235.00,16.70,,,2.04,2.35,1:Yes,1:Mild,,,,2:No,0.47,0.86,,,235.00,372.00,689.30,,710.40,2:No,6.00,9.00,9.20,246.00,32.00,441.00,2.0000,2.14,2:No,
38,4.08,Pre-Fontan Echo,Yes,1:Excellent,1:Yes,2.96,3.78,3.69,10.94,5.13,3.32,16.86,10.89,4.69,3.69,,,,,,,1:Yes,1:Mild,,,306.85,20.86,1.55,1.07,1.71,2.18,1:Yes,1:Mild,,,,2:No,0.73,0.55,,1184.99,306.85,377.09,865.10,,865.10,2:No,6.84,10.00,4.95,277.25,49.91,404.79,2.9800,1.89,2:No,
38,6.43,Study visit 9 (year 6 Echo),Yes,1:Excellent,1:Yes,3.08,6.00,4.40,13.40,5.31,3.33,16.44,10.56,5.11,4.17,,,,,,,1:Yes,1:Mild,,,240.00,16.40,1.51,1.44,2.46,2.29,1:Yes,1:Mild,,,,2:No,0.75,0.51,140.00,762.00,240.00,346.00,594.20,,660.20,2:No,8.00,10.00,5.50,238.00,42.00,462.00,2.2000,1.78,1:Yes,Fenestrated Fontan
39,3.53,Pre-Fontan Echo,Yes,2:Good,1:Yes,2.02,1.86,1.23,,5.01,4.03,20.41,14.85,5.55,4.52,,,,,,,2:No,,,,248.30,15.30,1.39,1.72,2.44,2.41,1:Yes,3:Severe,0.49,0.55,744.90,2:No,0.88,0.61,146.16,769.48,248.30,415.60,744.90,,744.90,2:No,4.55,6.38,5.19,,,433.21,2.2160,1.68,2:No,
39,5.62,Study visit 9 (year 6 Echo),Yes,2:Good,1:Yes,,,,,4.88,3.25,14.64,9.43,,,,,,,,,2:No,,,,277.00,20.20,1.62,2.09,2.54,2.07,1:Yes,1:Mild,,,,2:No,0.89,0.73,122.00,865.00,277.00,388.00,924.20,,647.00,2:No,5.00,8.00,5.00,270.00,30.00,425.00,3.1800,1.29,2:No,
40,6.37,Study visit 9 (year 6 Echo),Yes,1:Excellent,1:Yes,1.17,0.40,0.60,1.10,5.04,4.57,21.22,14.52,,,,,,,,,1:Yes,1:Mild,,,254.00,17.20,2.32,2.40,2.08,2.64,1:Yes,1:Mild,,,,2:No,1.03,0.78,137.00,914.00,254.00,447.00,735.90,,,,,,,,,,,1.68,1:Yes,Tricuspid valve ring
50,3,Pre-Fontan Echo,Yes,2:Good,1:Yes,2.82,3.18,2.95,,4.59,2.82,15.76,11.34,4.50,3.76,9.57,6.25,95,37.70,20.70,45.09,2:No,,,,233.22,10.38,1.46,1.45,2.78,2.47,1:Yes,1:Mild,,,,2:No,0.54,0.75,,708.07,236.60,368.42,618.54,141.96,618.45,2:No,8.09,7.12,5.10,247.83,40.55,374.00,1.4598,0.98,1:Yes,Marked tricuspid vavle prolapse
51,2.85,Pre-Fontan Echo,Yes,2:Good,1:Yes,,,,,4.48,4.24,15.69,10.26,4.47,3.55,14.68,7.58,89,50.50,25.20,50.10,2:No,,,,,,1.63,1.75,2.31,2.18,1:Yes,1:Mild,,,,,,,,,,,686.66,,686.66,,,,,,,,,1.68,1:Yes,DORV
51,6.05,Study visit 9 (year 6 Echo),Yes,2:Good,1:Yes,1.80,0.60,0.60,,5.21,4.54,21.00,12.37,4.72,3.78,14.14,9.84,79,69.00,31.60,54.20,1:Yes,1:Mild,,,,,1.83,2.07,2.33,2.71,1:Yes,2:Moderate,0.23,0.25,709.70,2:No,0.85,0.45,113.00,941.00,,390.00,,,639.90,1:Yes,9.00,9.00,6.00,212.00,47.00,358.00,1.8800,2.31,2:No,
52,2.31,Pre-Fontan Echo,Yes,2:Good,1:Yes,4.03,8.08,5.11,,3.98,3.86,14.15,9.94,,,,,,,,,1:Yes,1:Mild,,,242.95,19.67,,1.74,1.80,1.80,1:Yes,2:Moderate,0.42,0.30,,2:No,0.58,1.09,169.01,,242.95,355.62,,,,,,,,,,,2.7864,1.37,2:No,
52,5.63,Study visit 9 (year 6 Echo),Yes,3:Fair,1:Yes,2.83,4.30,3.20,,4.63,3.54,13.94,9.47,,,,,,,,,2:No,,,,,,,,,1.51,1:Yes,1:Mild,,,,2:No,0.79,0.39,,,,612.00,,,,,,,,,,,,,1:Yes,fenestrated Fontan; limited information extractable
54,1.95,Pre-Fontan Echo,Yes,3:Fair,1:Yes,,,,,,,,,,,,,,,,,2:No,,,,239.98,31.64,,1.62,1.75,,1:Yes,2:Moderate,0.27,0.59,571.22,,,,,,239.98,,571.22,,571.22,,,,,,,,1.7733,2.08,1:Yes,Most of the study is missing
54,6.71,Study visit 9 (year 6 Echo),Yes,3:Fair,1:Yes,3.54,8.40,3.30,21.60,,,,,,,,,,,,,1:Yes,1:Mild,,,302.00,40.60,,,,2.33,1:Yes,1:Mild,,,,2:No,0.94,0.59,140.00,,302.00,374.00,,,,,,,,,,,1.3900,2.82,1:Yes,fenestrated Fontan
58,2,Pre-Fontan Echo,Yes,2:Good,1:Yes,0.80,0.26,0.40,6.62,4.44,2.85,13.01,9.58,3.72,3.10,,,,,,,1:Yes,1:Mild,,,295.79,13.17,1.69,1.88,,1.62,1:Yes,1:Mild,,,,,,,,,295.79,,710.43,,710.43,,,,,,,,1.5992,1.28,2:No,
58,6.16,Study visit 9 (year 6 Echo),Yes,2:Good,1:Yes,,,,,4.86,3.03,15.49,9.97,4.74,3.63,18.85,8.59,58,70.80,32.20,54.52,1:Yes,1:Mild,,,345.00,22.70,1.86,1.99,2.28,1.99,2:No,,,,,2:No,0.72,,,,352.00,423.00,792.20,,919.00,2:No,3.00,5.00,3.90,,32.00,384.00,1.7100,1.60,2:No,
61,3.03,Pre-Fontan Echo,Yes,1:Excellent,1:Yes,3.15,3.80,1.70,11.70,4.14,3.49,12.38,7.37,4.02,3.16,,,,,,,2:No,,,,225.00,20.70,1.23,1.43,2.46,2.05,1:Yes,1:Mild,,,,2:No,0.72,0.52,106.00,,225.00,362.00,623.40,,625.20,2:No,8.00,9.00,8.50,262.00,26.00,389.00,1.6000,,1:Yes,Unbalanced AVSD
62,2.66,Pre-Fontan Echo,Yes,2:Good,1:Yes,1.69,0.35,0.44,1.65,,,,,,,,,,,,,2:No,,,,248.25,19.35,2.01,1.78,2.14,2.49,1:Yes,1:Mild,,,,2:No,0.86,0.97,,,248.25,359.18,649.69,,649.69,,,,,,,,,,1:Yes,Multiple TR jets
62,5.1,Study visit 9 (year 6 Echo),Yes,2:Good,1:Yes,1.58,0.70,0.80,3.20,5.52,3.78,22.28,14.19,4.96,4.09,6.94,3.26,87,64.60,34.10,47.37,2:No,,,,243.00,21.10,1.95,1.61,2.25,2.39,1:Yes,1:Mild,,,,2:No,0.86,0.95,135.00,1000.00,243.00,359.00,792.30,,831.90,2:No,3.00,5.00,6.20,246.00,24.00,354.00,,1.61,1:Yes,Fontan
63,1.33,Pre-Fontan Echo,Yes,1:Excellent,1:Yes,,,,,3.13,4.02,10.09,6.50,3.55,2.91,7.92,4.53,126,27.70,14.80,46.57,2:No,,,,239.45,11.00,1.13,1.29,1.90,1.68,2:No,,,,,1:Yes,0.90,,,,239.45,329.55,481.65,,481.65,1:Yes,,15.73,6.47,228.18,25.35,369.03,1.6907,1.26,2:No,
63,5.74,Study visit 9 (year 6 Echo),Yes,2:Good,1:Yes,,,,,4.98,4.53,18.52,11.96,4.39,3.60,,,,,,,1:Yes,1:Mild,,,239.00,14.70,1.72,1.95,2.06,2.69,1:Yes,1:Mild,,,,1:Yes,0.91,,,,236.00,376.00,496.50,,500.20,1:Yes,,22.00,7.40,,,402.00,2.0700,,2:No,
69,3.22,Pre-Fontan Echo,Yes,2:Good,1:Yes,3.30,1.06,1.04,10.21,4.39,3.39,12.36,9.25,4.19,3.53,,,,,,,2:No,,,,261.35,14.45,1.26,1.47,1.96,2.10,1:Yes,1:Mild,,,,1:Yes,0.79,,,,261.35,378.50,506.93,,506.93,1:Yes,,12.92,3.99,261.35,42.81,401.03,,,2:No,
69,6.11,Study visit 9 (year 6 Echo),Yes,2:Good,1:Yes,3.25,3.90,2.70,14.30,4.10,3.47,14.41,9.59,,,,,,,,,2:No,,,,,,,1.63,2.04,2.68,1:Yes,1:Mild,,,,1:Yes,0.57,,,640.00,,386.00,,,,,,,,,,,,,2:No,
74,2.38,Pre-Fontan Echo,Yes,2:Good,1:Yes,2.60,3.21,2.65,18.24,,,,,,,,,,,,,1:Yes,1:Mild,,,242.97,14.30,1.76,1.21,1.62,1.66,1:Yes,1:Mild,,,,2:No,0.49,0.70,121.49,,242.97,338.05,570.46,,570.46,2:No,5.83,6.40,5.34,,,356.54,2.0379,1.21,2:No,
74,5.98,Study visit 9 (year 6 Echo),Yes,1:Excellent,1:Yes,2.61,4.70,6.30,18.50,5.51,3.54,18.40,11.75,4.91,3.89,11.44,6.77,66,51.30,25.20,50.88,2:No,,,,274.00,18.00,2.25,2.28,1.92,2.41,1:Yes,1:Mild,,,,2:No,0.88,0.64,111.00,780.00,274.00,384.00,805.90,133.00,820.70,2:No,6.00,9.00,7.30,307.00,22.00,440.00,2.0900,,1:Yes,Fontan
77,2.96,Pre-Fontan Echo,Yes,2:Good,1:Yes,3.02,1.88,1.29,,5.01,3.82,17.01,11.68,,,,,,,,,2:No,,,,,,,1.67,1.88,2.38,1:Yes,1:Mild,,,,2:No,0.78,0.52,162.25,,,360.56,689.57,,689.57,2:No,8.11,8.36,5.74,236.43,40.53,371.53,1.7500,1.89,2:No,
78,2.98,Pre-Fontan Echo,Yes,2:Good,1:Yes,,,,,4.46,3.34,13.34,8.47,4.17,3.45,,,,,,,2:No,,,,353.72,25.62,1.40,1.54,1.65,1.90,1:Yes,1:Mild,,,,,,,,,353.72,,1011.60,,1011.60,2:No,4.92,7.63,6.63,301.90,,430.32,1.7050,2.35,2:No,
83,3.06,Pre-Fontan Echo,Yes,2:Good,1:Yes,,,,,3.64,3.28,11.28,8.08,3.30,2.37,10.03,5.22,104,38.50,17.20,55.32,2:No,,,,202.80,19.41,,1.46,1.51,1.53,1:Yes,1:Mild,,,,1:Yes,0.99,,,632.91,202.80,361.66,547.56,,547.56,2:No,3.35,8.63,3.78,196.04,37.18,327.86,1.6459,2.64,2:No,
87,2.64,Pre-Fontan Echo,Yes,2:Good,1:Yes,,,,,3.02,3.98,10.98,7.88,,,,,,,,,2:No,,,,283.92,17.61,1.13,1.53,1.74,1.65,2:No,,,,,1:Yes,,,,,283.92,378.56,598.26,,598.26,2:No,8.73,8.47,4.75,300.82,27.04,415.74,,1.27,2:No,
87,5.39,Study visit 9 (year 6 Echo),Yes,1:Excellent,1:Yes,,,,,4.19,3.31,11.91,7.97,4.76,4.22,,,,,,,2:No,,,,240.00,14.20,1.87,1.81,1.85,1.81,1:Yes,2:Moderate,0.24,0.26,525.60,1:Yes,0.78,,,667.00,240.00,333.00,512.40,,515.00,1:Yes,,13.00,5.00,232.00,45.00,420.00,1.6500,1.58,2:No,
91,3.18,Pre-Fontan Echo,Yes,1:Excellent,2:No,,,,,4.51,4.31,16.52,12.31,4.65,3.80,17.15,12.17,81,76.00,51.10,32.76,1:Yes,1:Mild,,,250.90,13.59,1.37,1.90,2.15,2.61,1:Yes,2:Moderate,0.25,0.25,705.15,2:No,0.58,0.55,153.18,681.20,250.90,388.23,705.15,,705.15,2:No,4.87,8.55,4.23,274.66,29.05,422.56,1.9700,1.97,2:No,
91,6.05,Study visit 9 (year 6 Echo),Yes,1:Excellent,2:No,,,,,6.08,6.04,30.98,20.44,4.92,4.16,25.19,18.90,62,128.20,75.20,41.34,1:Yes,1:Mild,,,306.00,17.50,1.78,2.14,2.62,2.75,1:Yes,2:Moderate,0.37,0.48,957.70,2:No,0.57,0.36,148.00,1103.00,306.00,468.00,933.10,,785.20,2:No,7.00,10.00,5.80,292.00,39.00,433.00,2.1300,,1:Yes,multiple TR jets; fenestrated Fontan
92,2.39,Pre-Fontan Echo,Yes,2:Good,1:Yes,2.04,0.61,0.61,8.86,4.39,2.57,8.80,4.46,4.50,3.62,,,,,,,1:Yes,1:Mild,,,287.30,18.62,1.66,1.53,1.10,1.75,1:Yes,1:Mild,,,,2:No,0.99,0.76,155.48,,283.92,425.88,757.12,,757.12,,,,,,,,1.4638,1.39,2:No,
92,5.32,Study visit 9 (year 6 Echo),Yes,1:Excellent,1:Yes,1.27,0.49,0.65,12.88,4.56,3.00,14.48,8.34,4.09,3.16,10.85,5.89,87,37.60,16.00,57.45,2:No,,,,240.33,19.01,1.96,1.92,2.18,2.63,1:Yes,1:Mild,,,,2:No,1.07,0.94,113.56,,240.33,348.61,578.38,,578.38,2:No,6.12,11.63,7.92,,,340.69,2.2600,1.65,2:No,
95,4.9,Pre-Fontan Echo,Yes,2:Good,2:No,,,,,4.62,4.47,18.96,12.90,,,,,,,,,2:No,,,,211.00,13.70,,,2.04,2.88,1:Yes,1:Mild,,,,2:No,0.58,0.59,,,211.00,384.00,661.80,,,,,,,,,,1.7400,1.40,2:No,
95,5.92,Study visit 9 (year 6 Echo),Yes,2:Good,1:Yes,,,,,,,,,4.35,3.65,,,,,,,2:No,,,,224.00,12.10,1.92,2.06,2.50,2.33,1:Yes,1:Mild,,,,2:No,0.57,0.61,114.00,,224.00,412.00,668.20,,,2:No,5.00,8.00,4.40,243.00,32.00,452.00,1.6400,1.14,2:No,
101,2.49,Pre-Fontan Echo,Yes,2:Good,1:Yes,,,,,,,,,,,,,,,,,2:No,,,,295.00,22.51,2.10,1.86,1.74,1.81,1:Yes,1:Mild,,,,2:No,0.92,0.72,130.00,,295.00,335.00,550.00,,550.00,2:No,6.89,9.32,7.16,,,310.00,1.9300,,2:No,
106,1.72,Pre-Fontan Echo,Yes,2:Good,1:Yes,1.38,0.44,0.38,1.79,3.86,2.97,11.34,8.00,3.58,3.14,10.00,6.79,124,30.90,19.00,38.51,2:No,,,,219.70,11.86,1.43,1.41,1.22,1.94,1:Yes,1:Mild,,,,1:Yes,1.11,,,612.34,219.70,338.11,512.45,,512.45,2:No,4.68,4.81,5.01,229.77,29.05,345.97,1.8400,1.41,2:No,
106,6.17,Study visit 9 (year 6 Echo),Yes,1:Excellent,1:Yes,2.79,0.50,0.50,10.10,4.29,3.75,15.27,11.17,4.85,3.47,12.87,8.31,88,45.90,27.40,40.31,1:Yes,1:Mild,,,342.00,25.90,1.96,1.96,1.73,1.79,1:Yes,1:Mild,,,,2:No,1.07,0.49,174.00,941.00,342.00,430.00,845.00,,795.70,2:No,5.00,8.00,4.30,289.00,42.00,398.00,2.2700,,1:Yes,fenestrated Fontan
107,2.4,Pre-Fontan Echo,Yes,1:Excellent,1:Yes,,,,,4.70,4.61,21.22,12.77,4.33,3.33,19.99,14.86,95,80.10,55.10,31.21,2:No,,,,269.00,15.60,1.64,1.95,2.40,2.43,1:Yes,1:Mild,,,,2:No,0.66,0.75,,,269.00,401.00,665.50,,,,,,,,,,2.2900,2.36,1:Yes,Stent in RV from previous Sano conduit?
109,3.65,Pre-Fontan Echo,Yes,2:Good,1:Yes,2.25,1.91,1.74,11.29,,,,,4.70,4.04,,,,,,,1:Yes,1:Mild,,,340.12,21.19,2.29,2.00,1.79,2.80,2:No,,,,,2:No,0.64,0.46,188.55,,340.12,436.25,820.73,,820.73,2:No,9.69,9.90,6.53,310.52,27.73,504.60,2.3835,1.44,2:No,
109,5.05,Study visit 9 (year 6 Echo),Yes,2:Good,1:Yes,2.90,4.72,5.33,11.34,,,,,4.39,3.48,,,,,,,1:Yes,1:Mild,,,225.52,18.63,1.86,1.96,2.30,2.69,2:No,,,,,2:No,0.72,1.01,,,225.52,395.58,617.40,,617.40,2:No,10.75,7.80,6.32,240.31,40.67,436.25,2.2930,1.44,1:Yes,bileaflet tricuspid prolapse
112,2.88,Pre-Fontan Echo,Yes,2:Good,2:No,,,,,4.30,3.86,13.60,10.27,,,,,,,,,2:No,,,,233.22,8.46,1.44,1.68,1.44,1.71,1:Yes,1:Mild,,,,2:No,0.88,0.75,124.44,,233.22,449.54,713.18,,713.18,,,,,,,,1.7030,2.23,2:No,
112,6.56,Study visit 9 (year 6 Echo),Yes,3:Fair,1:Yes,,,,,4.91,3.89,17.34,11.81,,,,,,,,,2:No,,,,,,,,,2.29,1:Yes,1:Mild,,,,,,,,,,,,,,,,,,,,,1.4200,2.82,1:Yes,Most of the Doppler information is missing.
113,1.95,Pre-Fontan Echo,Yes,3:Fair,2:No,,,,,3.25,4.79,12.79,8.57,,,,,,,,,2:No,,,,287.13,20.34,,,,2.01,1:Yes,2:Moderate,,0.45,,,,,,,287.13,,,,,,,,,,,,,,1:Yes,Almost no information available for measurements and poor quality imaging. Only 12 images captured for the entire study.
113,5.68,Study visit 9 (year 6 Echo),Yes,1:Excellent,1:Yes,,,,,4.84,5.30,19.44,12.56,5.08,3.69,,,,,,,2:No,,,,327.00,20.20,1.64,1.71,2.47,2.52,1:Yes,2:Moderate,0.20,0.30,934.90,2:No,0.90,0.31,156.00,,327.00,430.00,876.80,,905.80,2:No,6.00,7.00,6.10,247.00,20.00,466.00,2.2700,2.36,2:No,
114,3.29,Pre-Fontan Echo,Yes,1:Excellent,1:Yes,1.25,0.67,0.67,,4.72,3.12,15.63,11.72,5.22,4.41,16.06,10.08,84,58.80,30.90,47.45,1:Yes,1:Mild,,,296.14,20.15,1.90,2.24,1.98,2.42,1:Yes,1:Mild,,,,2:No,0.70,0.59,162.67,1256.90,296.14,358.71,713.24,,713.24,2:No,8.39,11.84,5.18,279.46,33.37,404.59,1.7758,1.59,2:No,
114,5.75,Study visit 9 (year 6 Echo),Yes,1:Excellent,1:Yes,1.67,3.60,1.70,8.70,5.18,3.60,18.77,12.89,4.83,3.81,,,,,,,1:Yes,1:Mild,,,271.00,19.20,1.54,2.17,2.37,2.77,1:Yes,1:Mild,,,,2:No,0.64,0.50,146.00,696.00,271.00,392.00,825.90,,738.30,2:No,6.00,10.00,6.40,254.00,29.00,413.00,2.4000,1.62,1:Yes,Fenestrated Fontan
115,4.39,Pre-Fontan Echo,Yes,2:Good,2:No,,,,,,,,,3.52,3.15,,,,,,,2:No,,,,279.46,23.57,1.29,1.33,1.75,1.48,2:No,,,,,2:No,0.61,0.66,,,279.46,358.75,578.45,,578.45,2:No,8.22,4.73,4.32,250.26,45.88,362.88,1.6000,1.37,2:No,
127,2.45,Pre-Fontan Echo,Yes,1:Excellent,2:No,,,,,4.48,3.96,15.01,10.23,4.01,3.42,,,,,,,2:No,,,,259.10,16.15,1.60,1.97,1.99,2.15,1:Yes,1:Mild,,,,1:Yes,1.00,,,,259.10,313.17,536.21,,536.21,1:Yes,,19.11,6.13,,47.31,380.76,1.2471,2.68,2:No,
127,5.2,Study visit 9 (year 6 Echo),Yes,2:Good,2:No,,,,,5.16,4.67,19.50,13.74,4.51,3.26,,,,,,,2:No,,,,288.00,17.00,1.76,1.92,2.13,2.43,1:Yes,1:Mild,,,,2:No,0.76,0.75,151.00,552.00,288.00,412.00,747.40,,,,,,,,,,1.6000,3.23,2:No,
134,1.57,Pre-Fontan Echo,Yes,1:Excellent,1:Yes,1.37,0.61,0.63,7.84,3.89,3.89,13.23,10.30,4.18,3.65,9.07,5.84,96,32.20,17.90,44.41,2:No,,,,232.41,16.85,1.50,1.37,1.58,1.57,2:No,,,,,2:No,1.05,0.97,,,232.41,345.97,599.51,,599.51,1:Yes,,6.22,2.91,,,433.12,1.6700,,2:No,
134,5.83,Study visit 9 (year 6 Echo),Yes,2:Good,1:Yes,3.44,6.70,7.10,26.50,,,,,,,,,61,,,,2:No,,,,,,1.60,1.93,1.61,1.74,1:Yes,1:Mild,,,,2:No,1.33,0.61,83.00,,,475.00,,,,,,,,,,,2.3200,1.83,2:No,
139,5.5,Pre-Fontan Echo,Yes,2:Good,1:Yes,5.13,9.70,5.60,21.40,4.75,3.31,14.21,8.36,5.41,4.56,14.41,8.48,89,46.40,20.80,55.17,2:No,,,,247.00,18.80,2.00,1.69,2.74,2.86,1:Yes,1:Mild,,,,2:No,0.65,0.47,119.00,1103.00,247.00,327.00,557.70,,672.60,2:No,9.00,7.00,5.90,254.00,34.00,419.00,2.7600,2.05,2:No,
139,6.02,Study visit 9 (year 6 Echo),Yes,2:Good,1:Yes,3.05,2.20,2.00,10.20,5.45,3.09,14.73,9.21,4.96,3.82,7.00,4.02,108,33.40,15.80,52.69,2:No,,,,211.00,15.40,,1.99,2.73,2.30,1:Yes,1:Mild,,,,,,,,,211.00,,554.60,,,,,,,,,,2.7800,1.94,1:Yes,fenestrated Fontan; coronary fistulous connection
140,3.83,Pre-Fontan Echo,Yes,2:Good,1:Yes,,,,,4.62,1.91,8.37,3.66,,,10.13,4.33,73,26.60,10.20,61.65,1:Yes,1:Mild,,,313.00,,1.70,1.66,1.24,1.49,1:Yes,1:Mild,,,,2:No,0.72,1.15,155.00,,313.00,437.00,672.50,,,,,,,,,,2.1500,3.04,1:Yes,Severe biventricular hypertrophy; dynamic RVOT obstruction
140,5.6,Study visit 9 (year 6 Echo),Yes,2:Good,1:Yes,,,,,6.48,3.44,20.92,11.92,5.72,4.71,12.60,6.69,54,60.40,25.90,57.12,2:No,,,,334.00,37.80,2.05,1.95,2.14,2.31,1:Yes,1:Mild,,,,1:Yes,0.55,,,,334.00,468.00,880.20,,1052.80,2:No,5.00,3.00,4.70,313.00,32.00,437.00,2.5600,2.38,1:Yes,fenestrated Fontan
141,2.1,Pre-Fontan Echo,Yes,2:Good,1:Yes,3.84,3.51,1.07,11.11,4.10,3.26,10.60,7.76,4.12,3.23,,,,,,,2:No,,,,294.06,20.43,1.05,1.36,1.66,1.73,1:Yes,1:Mild,,,,2:No,0.68,0.75,162.24,,294.06,385.32,676.00,,676.00,,,,,,,,1.5829,2.25,2:No,
141,5.56,Study visit 9 (year 6 Echo),Yes,2:Good,1:Yes,3.80,3.80,1.70,12.00,4.59,3.64,13.07,9.60,,,,,,,,,2:No,,,,269.00,15.30,1.41,,1.83,2.04,1:Yes,1:Mild,,,,2:No,0.69,0.51,164.00,,269.00,404.00,765.90,,,,,,,,,,1.6300,2.84,2:No,
142,1.96,Pre-Fontan Echo,Yes,2:Good,1:Yes,,,,,4.36,3.38,12.63,7.32,4.18,3.46,,,,,,,2:No,,,,227.13,15.68,1.26,1.42,1.47,1.95,1:Yes,1:Mild,,,,2:No,0.74,0.71,,,227.13,332.77,,,,,,,,,,,,,2:No,
142,6.05,Study visit 9 (year 6 Echo),Yes,2:Good,1:Yes,2.14,1.50,0.70,7.50,4.89,3.38,15.03,10.43,,,,,,,,,2:No,,,,255.00,18.90,,2.17,2.02,2.37,1:Yes,1:Mild,,,,2:No,0.79,0.62,136.00,,255.00,373.00,659.40,,,,,,,,,,,,1:Yes,fenestrated Fontan
143,1.61,Pre-Fontan Echo,Yes,2:Good,1:Yes,,,,,4.81,3.37,14.92,12.04,4.15,3.75,9.33,6.63,104,39.00,23.50,39.74,1:Yes,1:Mild,,,203.36,12.78,1.52,2.13,1.72,1.86,1:Yes,2:Moderate,0.31,0.49,570.46,2:No,0.91,0.83,,,203.36,361.82,570.46,,570.46,2:No,4.85,6.52,4.18,240.33,23.77,385.59,2.3304,1.02,1:Yes,Multiple TR jets
143,6.52,Study visit 9 (year 6 Echo),Yes,2:Good,1:Yes,,,,,4.98,3.57,19.52,13.44,,,11.33,7.98,92,53.60,31.80,40.67,2:No,,,,267.00,14.00,,1.96,2.22,2.15,1:Yes,1:Mild,,,,2:No,1.06,0.56,,,267.00,331.00,637.90,,648.00,2:No,5.00,7.00,5.20,243.00,32.00,418.00,,,2:No,
147,6,Study visit 9 (year 6 Echo),Yes,2:Good,1:Yes,2.29,4.80,4.40,7.20,,,,,4.54,3.69,,,,,,,2:No,,,,288.00,19.10,2.06,2.03,2.19,2.35,1:Yes,1:Mild,,,,2:No,0.86,0.38,133.00,,288.00,388.00,792.90,,,,,,,,,,3.3600,,1:Yes,fenestrated Fontan
149,2.93,Pre-Fontan Echo,Yes,1:Excellent,1:Yes,0.97,0.40,0.45,3.73,4.57,3.53,16.24,10.40,4.34,3.35,,,,,,,2:No,,,,312.83,17.13,2.19,1.82,2.83,2.56,1:Yes,2:Moderate,0.30,0.30,556.70,2:No,0.89,0.90,,876.87,312.83,325.26,556.70,,556.70,2:No,8.06,10.07,6.91,,45.88,342.02,1.9345,1.32,2:No,
149,5.82,Study visit 9 (year 6 Echo),Yes,1:Excellent,1:Yes,1.27,0.90,1.20,4.80,5.19,3.26,16.45,9.29,4.89,3.49,11.44,6.69,98,50.70,24.40,51.87,2:No,,,,267.00,15.60,1.64,1.89,2.28,1.99,1:Yes,1:Mild,,,,2:No,0.93,0.69,113.00,,267.00,355.00,613.10,,596.50,2:No,7.00,9.00,6.90,188.00,29.00,384.00,2.0000,1.27,1:Yes,Fenestrated Fontan
153,2.07,Pre-Fontan Echo,Yes,1:Excellent,1:Yes,1.23,0.34,0.27,2.53,4.29,3.63,15.25,10.04,4.02,3.41,,,,,,,2:No,,,,269.38,21.53,2.03,1.42,1.74,1.79,2:No,,,,,2:No,0.83,0.72,,,269.38,316.92,554.61,,554.61,2:No,6.12,9.12,8.82,,,393.51,1.9029,,2:No,
154,2.33,Pre-Fontan Echo,Yes,2:Good,1:Yes,2.16,3.32,4.33,12.01,5.34,3.10,16.23,8.40,4.32,3.60,,,,,,,1:Yes,1:Mild,,,258.82,17.31,1.31,1.60,1.96,1.97,1:Yes,1:Mild,,,,,,,,,258.82,,720.99,,720.99,2:No,4.89,7.29,5.26,253.54,23.77,377.66,,2.19,2:No,
154,6.02,Study visit 9 (year 6 Echo),Yes,1:Excellent,1:Yes,2.48,6.10,6.50,13.80,5.05,3.65,16.95,9.14,5.65,4.70,,,,,,,1:Yes,1:Mild,,,,,2.14,1.94,2.47,2.70,1:Yes,1:Mild,,,,2:No,0.73,0.52,124.00,914.00,,375.00,,,625.90,2:No,6.00,13.00,5.90,314.00,42.00,430.00,2.0500,2.93,2:No,
156,2.25,Pre-Fontan Echo,Yes,2:Good,1:Yes,,,,,3.80,4.49,13.52,10.89,3.71,3.05,,,,,,,2:No,,,,255.07,18.20,1.44,1.38,1.91,1.57,1:Yes,1:Mild,,,,1:Yes,0.81,,,,255.07,354.88,537.86,,537.86,,,,,,,,1.5708,1.39,2:No,
159,3.36,Pre-Fontan Echo,Yes,3:Fair,1:Yes,,,,,,,,,4.59,3.63,,,,,,,2:No,,,,269.38,17.93,1.40,1.72,1.47,1.67,1:Yes,1:Mild,,,,,,,,956.12,269.38,,744.76,,744.76,2:No,6.14,7.06,5.10,,66.90,440.13,1.9223,1.52,1:Yes,Technically limited study with alot of missing information
161,3.15,Pre-Fontan Echo,Yes,2:Good,1:Yes,3.99,3.38,2.43,12.22,4.29,3.69,13.56,9.96,,,,,,,,,2:No,,,,237.69,18.01,1.49,1.55,1.88,1.42,1:Yes,1:Mild,,,,2:No,0.98,1.04,,,237.69,441.05,612.71,,612.71,,,,,,,,2.3921,2.51,2:No,
161,6.14,Study visit 9 (year 6 Echo),Yes,1:Excellent,1:Yes,4.70,6.60,2.80,12.50,4.70,3.89,16.38,11.39,,,,,,,,,2:No,,,,256.00,13.50,1.71,1.97,2.16,2.05,1:Yes,2:Moderate,0.28,0.27,662.90,2:No,0.96,0.92,129.00,525.00,256.00,401.00,721.00,,,,,,,,,,2.1700,2.47,1:Yes,fenestrated Fontan
165,2.78,Pre-Fontan Echo,Yes,1:Excellent,1:Yes,2.04,1.59,1.54,16.45,3.70,2.30,7.76,4.94,3.44,3.08,,,,,,,1:Yes,1:Mild,,,233.58,14.90,1.74,1.58,1.45,1.92,1:Yes,1:Mild,,,,2:No,0.78,1.00,,,233.58,330.94,521.38,,521.38,2:No,7.34,9.28,5.40,,29.20,325.34,2.7103,1.32,2:No,
165,6.18,Study visit 9 (year 6 Echo),Yes,1:Excellent,1:Yes,2.70,10.10,10.40,15.10,5.84,2.80,15.76,7.89,4.07,3.26,8.56,5.58,81,33.50,18.20,45.67,2:No,,,,271.00,26.50,1.63,1.78,1.56,1.93,1:Yes,1:Mild,,,,2:No,1.15,0.87,150.00,,271.00,409.00,721.60,,729.90,2:No,7.00,12.00,8.00,254.00,25.00,380.00,2.8300,2.42,2:No,