blind_id,HOLTER_D_AGE,HOLTER_HR,HOLTER_MIN,QUALITY,SYMPTOMS,PACEMAKER,PACE_MODE,PACE_LOWRATE,PACE_HIRATE,PRED_RHYTHM,PRED_OTHSPEC,NONPRED,NONPRED_NSR,NONPRED_ATR,NONPRED_JCT,NONPRED_OTH,NONPREDOTHSP,AECTOPY,AECTOP_ISOL,AECTOP_COUPL,AECTOP_NTACH,AECTOP_STACH,AECTOP_SUMM,VECTOPY,VECTOP_ISOL,VECTOP_COUPL,VECTOP_NTACH,VECTOP_STACH,VECTOP_SUMM,ABN,ABN1,ABN1_THROU,ABN1_INTER,ABN2,ABN2_MOBITZ,ABN2_RARE,ABN2_OCCAS,ABN2_FREQ,ABN3,ABN3_THROU,ABN3_INTER,ABN3_ESCAPE,HRENT_MEAN,HRENT_MIN,HRENT_MAX,RR_INT,VAR_SHORT,VAR_LONG,RHYTHM_SYMP,SUMMARY
2,6.06,23,59,Adequate,None,No,,,,SR,,No,,,,,,Yes,RARE (<1 / HOUR),NONE,NONE,NONE,,No,,,,,,No,,,,,,,,,,,,,80,43,158,1.50,Normal,Normal,None,1. Predominant rhythm is sinus rhythm. 2. Normal short and long term HR variability. 3. Rare atrial ectopy with 5 isolated APBs. 4. No ventricular ectopy. 5. No events or symptoms.
4,6.11,23,59,Adequate,"stomach hurt, pale lips and face, tired and hungry at 8:29 PM",No,,,,SR,,Yes,No,No,Yes,No,,Yes,RARE (<1 / HOUR),NONE,NONE,NONE,,Yes,RARE (<1 / HOUR),NONE,NONE,NONE,,No,,,,,,,,,,,,,83,50,123,1.30,Normal,Normal,"stomach hurt, pale associated with NSR rate 80-100 bpm","1.) Predominant rhythm is sinus rhythm with occasional junctional rhythm - more during times of sleep and lower HRs when awake. 2.) Normal short and long term HR variability 3.) Single APB 4.) Two isolatd VPBs 5.) One event of stomach pain, lips/face pale assocaited with NSR with HR 80-100 bpm"
5,6.06,23,59,Adequate,None,No,,,,SR,,No,,,,,,No,,,,,,Yes,RARE (<1 / HOUR),NONE,NONE,NONE,NA,Yes,Yes,No,Yes,No,,,,,No,,,,102,78,168,0.80,Normal,Normal,No Symptoms,1. Predominant rhythm is sinus rhythm with occasional 1st degree AV block. Longest PR interval 200 msec 2. Normal short and long term HR variability 3. No atrial ectopy 4. Very rare isolated monomorphic VPBs 5. No symptoms
23,6.21,23,59,Adequate,None,No,,,,SR,,No,,,,,,No,,,,,,Yes,OCCASIONAL (1-60 / HOUR),NONE,NONE,NONE,NA,No,,,,,,,,,,,,,86,59,137,1.30,Normal,Normal,No symptoms,"1. Predominant rhythm is sinus 2. Normal short and long term HR variability 3. No atrial ectopy 4. Occasional ventricular ectopy with isolated monomorphic VPBs , suppressed at higher HRs 4. No symptoms"
36,6.29,23,59,Adequate,None,No,,,,SR,,No,,,,,,No,,,,,,No,,,,,,Yes,No,,,Yes,Type II,Yes,No,No,No,,,,98,77,144,1.40,Normal,Normal,No symptoms,1.)Predominant rhythm is sinus rhythm with one episode of second degree type II block during sleep 2.) Normal short and long term HR variability 3.) No atrial or ventricular ectopy 4.) No symptoms
37,6.12,23,59,Adequate,None,No,,,,SR,,No,,,,,,No,,,,,,Yes,RARE (<1 / HOUR),NONE,NONE,NONE,NA,No,,,,,,,,,,,,,77,44,146,1.50,Normal,Normal,No Symptoms,1. Predominant rhythm is sinus rhythm with sinus arrhythmia and wandering atrial pacemaker at lower HRs 2. Normal HR variability 3. No atrial ectopy 4. Very rare isolated VPBs 5. No symptoms
39,5.62,23,59,Adequate,no symptoms,No,,,,SR,,No,,,,,,No,,,,,,Yes,RARE (<1 / HOUR),Don't Know,Don't Know,Don't Know,na,No,,,,,,,,,,,,,71,41,134,1.60,normal,normal,No symptoms,1. Predominant rhythm is sinus with a rate dependent bundle branch block. 2. Normal HR variability. 3. No atrial ectopy. One episode of accelerated junctional rhythm. 4. Single PVC. 5. No symptoms.
40,6.64,23,59,Adequate,one patient event at end of recording  - NSR,No,,,,SR,,No,,,,,,No,,,,,,Yes,RARE (<1 / HOUR),NONE,RARE (<1 / HOUR),NONE,One 4 beat run of VT,Yes,Yes,No,Yes,No,,,,,No,,,,75,60,120,1.30,Normal,Normal,"One patient event at end of recording - NSR, no symptoms","1. Predominant rhythm is sinus rhythm with occasional 1st degree AV block 2. Normal HR variability 3. No atrial ectopy 4. Rare isolated VPBs and one 4 beat run of VT 5. One patient event associated with NSR, no symptoms"
46,6.48,23,59,Adequate,One patient event no symptoms,Yes,DDD,70,,OTHER,DDD pacing,No,,,,,,No,,,,,,Yes,RARE (<1 / HOUR),RARE (<1 / HOUR),NONE,NONE,NA,No,,,,,,,,,,,,,71,58,99,1.20,Blunted 2 degree PM,Blunted Peak HR only 99 A sense V Pace,One event - no symptoms associated with DDD pacing ApVp,1.) Predominant rhythm is A pace V Pace with occasional A sense V pace and PM testing from 00:24-00:46 2.) Blunted HR variability with peak HR only 00 3.) No atrial ectopy 4.) rare ventricular ectopy with isolated VPBs and one ventricular couplet 5.) One patient event associated with ApVp - No symptoms
51,6.05,23,59,Adequate,None,No,,,,SR,,No,,,,,,Yes,RARE (<1 / HOUR),Don't Know,Don't Know,Don't Know,NA,Yes,RARE (<1 / HOUR),Don't Know,Don't Know,Don't Know,NA,No,,,,,,,,,,,,,74,42,156,1.40,Normal,Normal,None,1. Predominant rhythm is sinus rhythm with sinus arrhythmia 2. Normal HR variability 3. Single APB 4. Single VPB 5. No symptoms
54,6.07,23,59,Adequate,Zero Symptoms,No,,,,SR,,No,,,,,,No,,,,,,No,,,,,,No,,,,,,,,,,,,,86,51,155,1.50,Normal,Normal,Zero Symptoms,1. Predominant rhythm is sinus 2. Normal HR variability 3. No atrial or ventricular ectopy 4. No symptoms
58,6.11,23,59,Adequate,None,No,,,,SR,,No,,,,,,No,,,,,,Yes,RARE (<1 / HOUR),NONE,NONE,NONE,NA,No,,,,,,,,,,,,,73,46,185,1.40,Normal,Normal,None,1.Predominant rehythm is sinus rhythm with sinus arrhythmia at lower HRs 2. Normal HR variability 3. No atrial ectopy 4. Two isolated PVCs 5. No symptoms
61,6.42,13,30,Adequate,one event at the end of the recording. no symptoms+no rhythm all atrifact,No,,,,SR,,No,,,,,,Yes,RARE (<1 / HOUR),NONE,NONE,NONE,,Yes,RARE (<1 / HOUR),NONE,NONE,NONE,,No,,,,,,,,,,,,,56,35,108,2.20,Normal,Slightly blunted but most of the recording was during sleep,"One event associated with artifact, no symptoms","1. Predominant rhythm is sinus rhythm/ sinus bradycardia. 2. Normal short term HR variability and slightly blunted long term HR variability but most of the recording took place during sleep. Low avg HR of 56. 3. Single APB. 4. Single VPB. 5. one event associated with artifact, no symptoms reported."
62,6.94,23,59,Adequate,None,No,,,,SR,,Yes,No,Yes,No,No,,No,,,,,,No,,,,,,No,,,,,,,,,,,,,69,47,122,1.30,Normal,Normal,None,1. Predominant rhythm is sinus rhythm with sinus arrhythmia at lower HRS and occasional low atrial rhythm during sleep. 2. Normal short and long term HR variability. 3. No atrial ectopy. 4. No ventricular ectopy. 5. No symptoms
63,5.74,20,42,Adequate,stomach pain and fever both associated with sinus tachycardia,No,,,,SR,,No,,,,,,No,,,,,,No,,,,,,No,,,,,,,,,,,,,130,109,180,0.80,Normal,Normal with high avg HR in the 130's,3 patient events & 2 symptoms of stomach pain & fever all assocaited with sinus tachycardia,1. Predominant rhythm is sinus rhythm 2. Normal HR variability with high avg HR of 130 3. No atrial ectopy 4. No ventricular ectopy 5. 3 events & 2 symptoms of stomach pain & fever all associated with sinus tachycardia
69,6.26,23,59,Adequate,None,No,,,,SR,,No,,,,,,Yes,RARE (<1 / HOUR),NONE,NONE,NONE,None,Yes,RARE (<1 / HOUR),NONE,NONE,NONE,None,No,,,,,,,,,,,,,105,85,139,0.80,Normal,Normal,No symptoms,"1. Predominant rhythm is sinus rhythm 2. Normal short and long term HR variability but slightly high avg HR of 105 considering majority of the waking day was not recorded. 3. Rare isolated APBs 4. Rare isolated, monomorphic vPBs 5. No symptoms"
74,5.98,23,59,Adequate,1 patient event - no symptoms - associated with NSR,No,,,,SR,,No,,,,,,Yes,RARE (<1 / HOUR),NONE,NONE,NONE,NA,Yes,RARE (<1 / HOUR),NONE,NONE,NONE,NA,No,,,,,,,,,,,,,83,52,196,1.40,Normal,Normal,One patient event associated with NSR - no symptoms,"1.) Predominant rhythm is sinus rhythm with sinus arrhythmia at lower HRs.  2.) Occasional ST depression at HRs >130 3.) Normal short and long term HR variability 4.) Rare isolated APBs 5.) Rare isolated monomorphic VPBs 6.) One patient event assocaited with NSR, No symptoms"
78,6.08,23,59,Adequate,"One Patient Event - Normal Sinus Rhythm, with artifact",No,,,,SR,,No,,,,,,Yes,RARE (<1 / HOUR),NONE,NONE,NONE,Rare isolated APBs,Yes,RARE (<1 / HOUR),NONE,NONE,NONE,Very rare isolated VPB,No,,,,,,,,,,,,,89,53,168,1.10,Normal,Normal,One Patient Event - Normal Sinus Rhythm with Artifact,"Sinus rhythm, predominantly Normal HR variability, Rare isolated APBs, Rare isolated VPB, One Patient event - normal sinus rhythm with artifact."
87,6.01,23,59,Adequate,3 events-no symptoms,No,,,,SR,,No,,,,,,No,,,,,,Yes,RARE (<1 / HOUR),NONE,NONE,NONE,NA,No,,,,,,,,,,,,,116,83,182,0.90,normal,normal,3 events- sinus tachycardia,"1.Predominant rhythm is sinus. 2.Normal HR variability. 3.No atrial ectopy. 4. Rare isolated ventricular ectopy with isolated VPB's. 5.3 patient events-sinus tachycardia, no symptoms."
92,6.06,23,59,Adequate,complaint Holter felt weird and hurt,No,,,,SR,,No,,,,,,Yes,RARE (<1 / HOUR),Don't Know,Don't Know,Don't Know,na,Yes,RARE (<1 / HOUR),Don't Know,Don't Know,Don't Know,na,No,,,,,,,,,,,,,71,50,165,1.20,normal,normal,sinus tachycardia,1. Predominant rhythm is sinus rhythm with sinus arrhythmia. 2. Normal HR variability. 3. Rare isolated APBs. 4. Rare (single) VPB. 5. One symptom of Holter bothering and feeling weird associated with sinus tachycardia.
104,5.66,23,59,Adequate,No symptoms,No,,,,SR,,No,,,,,,No,,,,,,No,,,,,,Yes,Yes,Yes,No,No,,,,,No,,,,72,47,137,1.50,Normal,Normal - peak HR only 137,No symptoms,1.) Predominant rhythm is sinus rhythm with 1st degree AV Block 2.) PR interval shortens at higher HRs but does not normalize.  Longest PR interal ~280 msec 3.) Normal short and long term HR variability 4.) No atrial or ventrcular ectopy 5.) No symptoms
109,6.12,13,18,Adequate,headache 17:50; 2 events- NSR,No,,,,SR,,No,,,,,,No,,,,,,No,,,,,,Yes,Don't Know,Don't Know,Don't Know,Don't Know,Don't Know,Don't Know,Don't Know,Don't Know,Don't Know,Don't Know,Don't Know,Don't Know,92,61,131,1.30,normal,normal,NSR,"1. Predominant rhythm is sinus rhythm with marked sinus arrythmia 2. Normal HR variability (over about 5 hr of recording) 3. No atrial or ventricular ectopy, 4. Symptoms of HA- 2 patient events associated with NSR"
112,6.22,23,59,Adequate,None,No,,,,SR,,No,,,,,,Yes,RARE (<1 / HOUR),Don't Know,Don't Know,Don't Know,NA,Yes,RARE (<1 / HOUR),Don't Know,Don't Know,Don't Know,NA,No,,,,,,,,,,,,,80,43,143,1.50,Normal,Normal,None,"Predominant rhythm is sinus rhythm with sinus arrhythmia, Normal HR variability, Rare isolated atrial ectopy, Rare isolated monomorphic ventricular ectopy, No symptoms."
113,6.29,23,35,Adequate,None,No,,,,SR,,No,,,,,,Yes,RARE (<1 / HOUR),NONE,NONE,NONE,NA,No,,,,,,No,,,,,,,,,,,,,65,37,110,1.70,Normal,Slightly blunted peak HR of 110,No symptoms,1. Predominant rhythm is sinus with significant bradycarda during sleep. 2. Normal short term HR variability and blunted peak HR of 110 3. Very rare isolated atrial ectopy 4 APBs 4. No ventricular ectopy 5. No symptoms
114,5.75,23,59,Adequate,None,No,,,,SR,,No,,,,,,No,,,,,,Yes,RARE (<1 / HOUR),NONE,NONE,NONE,NA,No,,,,,,,,,,,,,92,59,182,1.20,Normal,Normal,No Symptoms,1. Predominant rhythm is sinus rhythm with occasional sinus arrhythmia 2. Mild ST depression at HRs>140 3. No atrial arrhythmias 4. Two isolated VPBs 5. No symptoms
127,6.17,23,59,Adequate,None,No,,,,SR,,No,,,,,,No,,,,,,No,,,,,,No,,,,,,,,,,,,,78,56,147,1.30,Normal,Normal,No symptoms,1.) Predominant rhythm is sinus rhythm 2.) Normal short and long term HR variability 3.) No atrial ectopy 4.) No ventricular ectopy 5.) No events
134,7.03,23,59,Adequate,"One event associated with sinus tachycardia, no symptoms.",No,,,,SR,,No,,,,,,Yes,OCCASIONAL (1-60 / HOUR),NONE,NONE,NONE,,Yes,RARE (<1 / HOUR),NONE,NONE,NONE,,No,,,,,,,,,,,,,71,42,150,1.50,Normal,Normal,"One event associated with sinus tachycardia, no symptoms reported.","1. Predominant rhythm is sinus rhythm. 2. Normal short and long term HR variability. 3. Occasional atrial ectopy (0.2%) with isolated ABP's and rare atrial bigeminy and trigeminy. 4. Rare ventricular ectopy with 6 isolated VPB's. 5. One event associated with sinus tachycardia, no symptoms reported."
139,5.98,23,59,Adequate,"2 events associated with sinus tachycardia, no symptoms.",No,,,,SR,,No,,,,,,No,,,,,,No,,,,,,No,,,,,,,,,,,,,112,89,152,0.70,Normal,Normal,"2 events associated with sinus tachycardia, no symptoms reported.",
141,6.01,23,59,Adequate,"12 events, no symptoms reported, all associated with NSR",No,,,,SR,,No,,,,,,Yes,RARE (<1 / HOUR),NONE,NONE,NONE,NA,No,,,,,,No,,,,,,,,,,,,,77,49,150,1.50,Normal,Normal,"12 Events with NSR 76-113 bpm, no symptoms","1.) Predominant rhythm is sinus rhythm with sinus arrhythmia at lower HRs 2.) Normal short & long term HR variability 3.) Single APB 4.) NO ventricular ectopy 5.) 12 patient events associated with NSR, rate 76-113 bpm.  NO symptoms reported"
142,6.12,23,59,Adequate,None,No,,,,SR,,Yes,No,Yes,No,No,,No,,,,,,Yes,RARE (<1 / HOUR),NONE,NONE,NONE,Rare isolated VPB,No,,,,,,,,,,,,,91,59,158,1.20,Normal,Normal,Symptoms,"Normal sinus rhythm with occasional wondering atrial PM, No atrial ectopy, Single VPB, No symptoms"
143,5.94,23,59,Adequate,no symptoms,No,,,,SR,,No,,,,,,Yes,RARE (<1 / HOUR),Don't Know,Don't Know,Don't Know,NA,Yes,RARE (<1 / HOUR),NONE,NONE,NONE,na,No,,,,,,,,,,,,,96,75,153,0.80,normal,normal,no symptons,1. Predominant rhythm is sinus. 2. Normal HR variability. 3. Single APB. 4. Rare isolated monomorphic VPBs. 5. No symptoms
147,5.95,23,59,Adequate,None,No,,,,SR,,No,,,,,,No,,,,,,Yes,RARE (<1 / HOUR),Don't Know,Don't Know,Don't Know,NA,No,,,,,,,,,,,,,98,60,166,1.20,Normal,Normal,None,1. Predominant rhythm is sinus 2. Normal HR variability 3. Single VPB 4. No atrial ectopy 5. No symptoms
149,5.68,23,59,Adequate,"one patient event, no symptoms; sinus tachycardia",No,,,,SR,,No,,,,,,Yes,RARE (<1 / HOUR),NONE,NONE,NONE,n/a,No,,,,,,No,,,,,,,,,,,,,89,54,155,1.30,normal,normal,"one patient event, no symptoms, sinus tachycardia","1.Predominant rhythm is sinus, occassional ST depression with higher HRs (seen when HR>100). 2.Normal HR variability. 3. Single APB. 4. No ventricular ectopy. 5.One patient associated with sinus tachycardia, no symptoms."
154,6.03,23,59,Adequate,None,No,,,,SR,,No,,,,,,No,,,,,,Yes,RARE (<1 / HOUR),NONE,NONE,NONE,NA,No,,,,,,,,,,,,,83,74,96,0.85,mildly blunted,mildly blunted,N/A,"Predominantly SR , Mildly blunted short- and long term HR variability, single isolated PAC, no ventricular ectopy, no symptoms"
159,5.94,23,59,Adequate,None,No,,,,SR,,No,,,,,,No,,,,,,No,,,,,,No,,,,,,,,,,,,,89,50,176,1.30,Normal,Normal,None,1. Predominant rhythm is sinus rhythm. There is occasional ST depression at HR >100bpm. 2. Normal short + long term HR variability. 3. No APBs. 4. No VPBs. 5. No events or symptoms.
161,6.57,23,59,Adequate,None,Yes,VVI,70,,SR,,Yes,Don't Know,Don't Know,Don't Know,Yes,Ventricular pacing,No,,,,,,No,,,,,,Yes,Yes,No,Yes,No,,,,,No,,,,83,60,146,1.00,Normal,Normal,No Symptoms,1. Predominant rhythm is sinus rhythm with occasional 1st degree AV block and VVI pacing at low rate of 70 with sleep of 60 2. Normal HR variability 3. No atrial ectopy 4. No ventricular ectopy 5. No symptoms
165,6.18,23,59,Adequate,None,No,,,,SR,,No,,,,,,No,,,,,,No,,,,,,No,,,,,,,,,,,,,84,50,173,1.30,Normal,Normal,None,1. Predominant rhythm is sinus rhythm with sinus arrhythmia 2. Normal HR variability 3. No atrial or ventricular ectopy 4. No symptoms
166,6.2,23,59,Adequate,"1 patient event, no symptoms assocaited with NSR",No,,,,SR,,Yes,Don't Know,Don't Know,Yes,Don't Know,,No,,,,,,Yes,RARE (<1 / HOUR),NONE,NONE,NONE,NA,No,,,,,,,,,,,,,77,49,196,1.40,Normal,Normal,"One event, no symptoms reported associated with NSR @124","1. Predominant rhythm is sinus rhythm with junctional rhythm frequent during times of sleep and at lower HRs 2. Normal short and long term HR variability 3. No atrial ectopy 4. Very rare isolated PVCs 5. One patient event assocaited with NSR at 124, no symptoms"
168,6.28,23,59,Adequate,"2 events, no symptoms. One associated with NSR, one with artifact.",No,,,,SR,,No,,,,,,No,,,,,,Yes,RARE (<1 / HOUR),NONE,NONE,NONE,,No,,,,,,,,,,,,,78,59,133,1.10,Normal,Normal,"2 events- one associated with NSR, one with artifact.","1. Predominant rhythm is sinus rhythm. 2. Normal short and long term HR variability. 3. No atrial ectopy. 4. Single VPB. 5. Two episodes, no symptoms reported- one associated with NSR, one associated with artifact."
169,5.7,23,59,Adequate,No patient events were logged,No,,,,SR,,No,,,,,,No,,,,,,No,,,,,,No,,,,,,,,,,,,,91,77,120,0.80,Normal,Normal,N/A,Normal Study
184,5.89,23,59,Adequate,None,No,,,,SR,,No,,,,,,Yes,RARE (<1 / HOUR),NONE,NONE,NONE,Single Isolated APB,Yes,RARE (<1 / HOUR),NONE,NONE,NONE,Single Isolated VPB,No,,,,,,,,,,,,,91,70,125,1.40,Normal,Normal,N/A,"Predominantly SR, Normal HR variability, Very rare isolated APB and very rare isolated VPB, Normal Study."
188,6.44,23,59,Adequate,2 events - no symptoms,No,,,,SR,,Yes,Yes,Don't Know,Yes,Don't Know,,Yes,RARE (<1 / HOUR),NONE,NONE,NONE,NA,Yes,RARE (<1 / HOUR),NONE,NONE,NONE,NA,No,,,,,,,,,,,,,85,43,178,1.80,Normal,Normal,"2 events associated with NSR, no symptoms","1.) Predominant rhythm is sinus rhythm with pronounced sinus arrhythmia.  Junctional escape at lower HRs and one episode of accelerated junctional rhythm. 2.)Normal short & long term HR variability 3.) Very rare APBs - isolated 4.) Very rare isolated VPBs 5.) No symptoms, two events associated with NSR."
196,6.75,23,59,Adequate,None,No,,,,SR,,No,,,,,,No,,,,,,Yes,RARE (<1 / HOUR),NONE,NONE,NONE,NA,No,,,,,,,,,,,,,80,60,134,1.30,Normal,Normal,No symptoms or events,1.) Predominant rhythm is sinus rhythm with sinus arrhythmia at lower HRs 2.) Normal short & long term HR variability 3.) No atrial ectopy 4.) Single VPB 5.) No symptoms
197,6.3,23,59,Adequate,Nome,No,,,,SR,,No,,,,,,No,,,,,,No,,,,,,Yes,Yes,No,No,No,,,,,No,,,,115,90,147,0.70,Normal,Normal,None,1. Predominant rhythm is sinus rhythm with occasional 1st degree AV block. 2. Normal short and long term HR variability. 3. No atrial ectopy. 4. No ventricular ectopy. 5. No events or symptoms.
206,6.49,21,15,Adequate,"4 events, no symptoms",No,,,,SR,,No,,,,,,No,,,,,,No,,,,,,Yes,Yes,No,Yes,No,,,,,No,,,,81,70,139,1.20,Normal,Normal,"4 events - 2 artifacts, 2 NSR 99bpm, No symptoms","1. Predominant rhythm is sinus rhythm with occasional 1st degree AV block. Longest PR 220 msec 2. Normal Short and Long term HR variability 3. No atrial ectopy 4. No ventricular ectopy 5. 4 events, 2 artifact, 2 associted with NSR @ 99 bpm. No Symptoms"
207,5.88,23,59,Adequate,Dizzy - associated with NSR 2 other events - no symptoms NSR,Yes,AVI,70,,SR,,Yes,Don't Know,Don't Know,Don't Know,Yes,A pace,No,,,,,,No,,,,,,No,,,,,,,,,,,,,83,69,180,0.90,Normal,Normal with AAIR pacing,Dizzy assoicated with NRS & Apacing 2 other events associated with Apace @85 +  116 bpm,"1.) Predominant rhythm is combo of sinus rhythm & A paced rhythm. Around HR~150 there is A undersensing & inappropriate A pacing 2.) Normal HR variability with PM 3.) No atrial ectopy 4.) No ventricular ectopy 5.) Three events one with ""dizzy"" symptoms assoicated with NSR & A pacing.  Other 2 without symptoms & associated with A pacing"
210,6.35,23,59,Adequate,15 patient events - no symptoms all assocaited with MSR,No,,,,SR,,No,,,,,,Yes,RARE (<1 / HOUR),NONE,NONE,NONE,NA,No,,,,,,Yes,Yes,No,Yes,No,,,,,No,,,,77,49,142,1.40,Normal,Normal,"15 patient events all associated with NSR, no symptoms","1. Predominant rhythm is sinus rhythm with rare junctional escape during sleep.  Occasional 1st degree AV block at lower HRs 2. Normal HR variability 3. Single APB 4. No ventricular ectopy 5. 15 patient events, no symptoms all associated with MSR"
211,6.2,23,59,Adequate,"4 events associated with NSR, no symptoms reported",No,,,,SR,,No,,,,,,No,,,,,,No,,,,,,No,,,,,,,,,,,,,103,85,155,0.70,normal,normal,"4 events, NSR with rate 84-120. No symptoms reported.",1. Predominant rhythm is sinus rhythm. 2. Normal short & long term HR variability. 3. No atrial ectopy. 4. No ventricular ectopy. 5. Four patient events associated with NSR with HR 84-120 bpm. No symptoms reported.
214,6.45,23,59,Adequate,None,No,,,,SR,,No,,,,,,Yes,RARE (<1 / HOUR),NONE,NONE,NONE,,Yes,RARE (<1 / HOUR),NONE,NONE,NONE,,No,,,,,,,,,,,,,88,70,108,1.00,Normal,Slighty blunted,none,1. Predominant rhythm is sinus rhythm. 2. Normal short term & long term variability with slightly blunted long term variability (HR range 70-108). 3. Rare atrial ectopy with 7 isolated APBs. 4. Single VPB. 5. No symptoms.
216,6.27,23,59,Adequate,"One event associated with NSR, no symptoms reported.",No,,,,SR,,No,,,,,,No,,,,,,No,,,,,,No,,,,,,,,,,,,,87,48,189,1.40,Normal,Normal,"One event associated with NSR, no symptoms.","1. Predominant rhythm is sinus rhythm. 2. Normal short and long term HR variability. 3. No atrial ectopy. 4. No ventricular ectopy. 5. One patient event associated with NSR, no symptoms reported."
218,6.35,23,59,Adequate,No Symptoms,No,,,,SR,,No,,,,,,No,,,,,,Yes,RARE (<1 / HOUR),NONE,NONE,NONE,N/A,No,,,,,,,,,,,,,101,72,161,0.90,Normal,Normal,No symptoms,1. Predominant rhythm is sinus rhythm 2. Normal HR variability with slightly high avg HR of 101 3. No atrial ectopy 4. Single VPB 4. No symptoms
225,5.77,15,21,Adequate,None,No,,,,SR,,No,,,,,,No,,,,,,Yes,RARE (<1 / HOUR),NONE,NONE,NONE,NA,No,,,,,,,,,,,,,63,43,85,1.40,Normal,Blunted peak HR of 85,No symptoms,1. Predominant rhythm is sinus rhythm with frequent 2nd degree AV lock.  Some wenckebach and some 2:1 A:V conduction.  Highest 1:1 conducted rate is 85 bpm with AV block occuring at higher atrial raters 2. No atrial ectopy 3. Very rare isolated VPBs 4. No symptoms
229,6.97,23,59,Adequate,"one event, no symptoms reported- associated with NSR at 112 bpm",No,,,,SR,,No,,,,,,No,,,,,,Yes,RARE (<1 / HOUR),NONE,NONE,NONE,,No,,,,,,,,,,,,,97,74,150,0.90,normal,normal,"One event associated with NSR-112 bpm, no symptoms reported.","1. Predominant rhythm is sinus rhythm. 2. Normal short and long term HR variability. 3. No atrial ectopy. 4. Two isolated VPB's. 5. One event associated with NSR at 112 bpm, no symptoms reported."
247,6.43,23,59,Adequate,NONE,No,,,,SR,,Yes,No,Yes,No,No,,No,,,,,,Yes,RARE (<1 / HOUR),NONE,NONE,NONE,NA,Yes,Yes,No,Yes,Yes,Type II,Yes,No,No,No,,,,91,57,129,1.60,Normal,Normal,No Symptoms,1. Predominant rhythm is sinus rhythm with low atrial rhythm intermittently during sleep.  Also occasional 1st degree AV block and 2 episodes of 2nd degree AV block type 2 during sleep.  2.) Normal short and long term HR variability.  Some ST depression at higher HRs 3.) No atrial ectopy 4.) Rare isolated VPBs with 3 morphologies 4.) No symptoms
250,5.59,23,59,Adequate,NONE,No,,,,SR,,No,,,,,,Yes,RARE (<1 / HOUR),NONE,NONE,NONE,N/A,Yes,RARE (<1 / HOUR),NONE,NONE,NONE,N/A,No,,,,,,,,,,,,,86,58,161,1.20,Normal,Normal,N/A,"Predominantly SR, Normal HRV, Rare isolated APBs, Single isolated VPB, No Sx reported."
253,6.13,23,59,Adequate,3 events - no symptoms; all associated with NSR,No,,,,SR,,No,,,,,,No,,,,,,No,,,,,,No,,,,,,,,,,,,,79,57,125,1.10,Normal,Normal,"3 events , no symptoms - all associated with NSR",1. Predominant rhythm is sinus rhythm with prolonged QT (though holter tracings difficult to measure) 2. Normal HR variability 3. No atrial or ventricular ectopy 4. 3 patient events - no symptoms; all associated with NSR
267,6.09,16,36,Adequate,"One event associated with sinus tachycardia, no symptoms reported.",No,,,,SR,,No,,,,,,No,,,,,,No,,,,,,No,,,,,,,,,,,,,112,100,172,0.60,Normal,Normal,"One event associated with sinus tachycardia, no symptoms reported.","1. Predominant rhythm is sinus rhythm. 2. Normal short and long term HR variability. 3. No atrial ectopy. 4. No ventricular ectopy. 5. One event associated with NSR/sinus tachycardia, no symptoms reported."
271,6.34,20,27,Adequate,"None, one event associated with artifact.",No,,,,SR,,No,,,,,,No,,,,,,Yes,RARE (<1 / HOUR),NONE,NONE,NONE,,No,,,,,,,,,,,,,69,40,105,2.00,normal,normal,no symptoms; one episode associated with artifact.,"1. Predominant rhythm is sinus rhythm. 2. Normal short and long term HR variability, avg HR 69. 3. No atrial ectopy. 4. Two isolated VPB's. 5. One event associated with artifact, no symptoms reported."